{"text_format":"3","workbook":"xlsx","n_sheets":9,"sheets":["Overview & Questionnaire","Milestone Progress","Permitting Progress","Named Community Progress","Locale Progress","Highway Progress","Milestone Summary","Named Community List","Hidden-lists"],"not_rendered":{"images":1,"defined_names":13},"read":"whole","date_system":"1900"}

{"sheet":"Overview & Questionnaire","index":0,"n_rows":84,"n_cols":2,"rows_kept":84,"merged":[[42,1,51,1],[57,1,66,1],[72,1,81,1],[83,1,83,2]]}
[null,"Connecting British Columbia"]
[null,"Economic Recovery Intake"]
[null,"Quarterly Report Workbook"]
[]
[null,"Instructions"]
[null,"1. Complete the yellow sections below (all projects). \n2. Complete the yellow sections within the Milestone Progress tab (all projects).\n3. Complete the yellow sections within the Permitting Progress tab (all projects).\n4. Complete the yellow sections within the Named Community Progress tab (community projects).\n5. Complete the yellow sections within the Locale Progress tab (community projects involving unlisted locales or communities).\n6. Complete the yellow sections within the Highway Progress tab (highway projects)."]
[]
[null,"Submitting Your Report"]
[null,"Quarterly Report Workbook ending March 31 is due by April 30.\nQuarterly Report Workbook ending June 30 is due by July 31.\nQuarterly Report Workbook September 30 is due by October 31.\nQuarterly Report Workbook December 31 is due by January 31."]
[]
{"$rows_left_out":45}
{"sheet":"Milestone Progress","index":1,"n_rows":33,"n_cols":14,"rows_kept":33,"merged":[[0,1,0,6],[1,1,1,6],[2,1,2,6],[3,1,3,6],[4,1,4,6],[5,1,5,6],[6,1,6,6],[7,1,7,6],[9,2,9,3],[9,4,9,5],[32,4,32,6]]}
[null,"Milestone Progress"]
[]
[null,"Instructions"]
[null,"Complete the yellow sections."]
[null,"For Project Start MILESTONE, the ORIGINAL PLAN start and completion should be entered as the same date."]
[null,"For Project Start MILESTONE, the ACTUAL start and completion should be entered as the same date."]
[null,"For Project Completion MILESTONE, the ORIGINAL PLAN start and completion should be entered as the same date."]
[null,"For Project Completion MILESTONE, the ACTUAL start and completion should be entered as the same date."]
[]
[null,null,"ORIGINAL PLAN",null,"ACTUAL"]
{"$rows_left_out":24}
{"sheet":"Permitting Progress","index":2,"n_rows":26,"n_cols":12,"rows_kept":26,"merged":[[0,1,0,11],[1,1,1,11],[2,1,2,11],[3,1,3,11],[4,1,4,11],[6,5,6,9],[25,9,25,11]]}
[null,"Permitting Progress"]
[]
[null,"Instructions"]
[null,"Complete the yellow sections."]
[null,"Please identify all permits required for the successful completion of your project. Also indicate the progress that has been made thus far."]
[]
[{"$nulls":5},"CURRENTLY ENGAGED WITH"]
[null,"ASSET REQUIRED","ASSET OWNER","TYPE OF PERMIT REQUIRED","PERMITTING AUTHORITY","ORGANIZATION NAME","CONTACT NAME\n(first name, last name)","POSITION/TITLE","PHONE NUMBER","E-MAIL ADDRESS","STATUS\n(use drop-down)","DATE PERMIT\nIS REQUIRED"]
{"$rows_empty":17}
[{"$nulls":9},"Published October 2020 - Ver. 1.1"]
{"$rows_left_out":1}
{"sheet":"Named Community Progress","index":3,"n_rows":39,"n_cols":10,"rows_kept":39,"merged":[[0,1,0,6],[1,1,1,6],[2,1,2,6],[3,1,3,6],[4,1,4,6],[38,5,38,6]]}
[null,"Named Community Progress"]
[]
[null,"Instructions"]
[null,"Complete the yellow sections."]
[null,"All Named Communities identified in the approved 'Template 2 - Application Workbook' MUST be listed below."]
[]
[null,"NAMED COMMUNITY\n(*denotes an indigenous community)\n(use-dropdown)","SOLUTION TYPE\n(use drop-down)","PROGRESS (%)","STATUS\n(use drop-down)","ESTIMATED\nCOMPLETION DATE","PLACE ID\n(auto populated)","Applicant Name","Project Name","TimeStamp\n(auto fill)"]
[{"$nulls":6},{"$f":"IF(Table13[[#This Row],[NAMED COMMUNITY\n(*denotes an indigenous community)\n(use-dropdown)]]<>\"\",INDEX(Table1[Place ID\n],MATCH(Table13[[#This Row],[NAMED COMMUNITY\n(*denotes an indigenous community)\n(use-dropdown)]],Table1[Place Name1 \n(*denotes an indigenous community)],0)),\"\")","v":""},{"$f":"IF(Table13[[#This Row],[NAMED COMMUNITY\n(*denotes an indigenous community)\n(use-dropdown)]]<>\"\",'Overview & Questionnaire'!B$18,\"\")","v":""},{"$f":"IF(Table13[[#This Row],[NAMED COMMUNITY\n(*denotes an indigenous community)\n(use-dropdown)]]<>\"\",'Overview & Questionnaire'!B$20,\"\")","v":""},{"$f":"IF(Table13[[#This Row],[NAMED COMMUNITY\n(*denotes an indigenous community)\n(use-dropdown)]]<>\"\",'Overview & Questionnaire'!B$36,\"\")","v":""}]
[{"$nulls":6},{"$f":"IF(Table13[[#This Row],[NAMED COMMUNITY\n(*denotes an indigenous community)\n(use-dropdown)]]<>\"\",INDEX(Table1[Place ID\n],MATCH(Table13[[#This Row],[NAMED COMMUNITY\n(*denotes an indigenous community)\n(use-dropdown)]],Table1[Place Name1 \n(*denotes an indigenous community)],0)),\"\")","v":""},{"$f":"IF(Table13[[#This Row],[NAMED COMMUNITY\n(*denotes an indigenous community)\n(use-dropdown)]]<>\"\",'Overview & Questionnaire'!B$18,\"\")","v":""},{"$f":"IF(Table13[[#This Row],[NAMED COMMUNITY\n(*denotes an indigenous community)\n(use-dropdown)]]<>\"\",'Overview & Questionnaire'!B$20,\"\")","v":""},{"$f":"IF(Table13[[#This Row],[NAMED COMMUNITY\n(*denotes an indigenous community)\n(use-dropdown)]]<>\"\",'Overview & Questionnaire'!B$36,\"\")","v":""}]
[{"$nulls":6},{"$f":"IF(Table13[[#This Row],[NAMED COMMUNITY\n(*denotes an indigenous community)\n(use-dropdown)]]<>\"\",INDEX(Table1[Place ID\n],MATCH(Table13[[#This Row],[NAMED COMMUNITY\n(*denotes an indigenous community)\n(use-dropdown)]],Table1[Place Name1 \n(*denotes an indigenous community)],0)),\"\")","v":""},{"$f":"IF(Table13[[#This Row],[NAMED COMMUNITY\n(*denotes an indigenous community)\n(use-dropdown)]]<>\"\",'Overview & Questionnaire'!B$18,\"\")","v":""},{"$f":"IF(Table13[[#This Row],[NAMED COMMUNITY\n(*denotes an indigenous community)\n(use-dropdown)]]<>\"\",'Overview & Questionnaire'!B$20,\"\")","v":""},{"$f":"IF(Table13[[#This Row],[NAMED COMMUNITY\n(*denotes an indigenous community)\n(use-dropdown)]]<>\"\",'Overview & Questionnaire'!B$36,\"\")","v":""}]
{"$rows_left_out":30}
{"sheet":"Locale Progress","index":4,"n_rows":39,"n_cols":9,"rows_kept":39,"merged":[[0,1,0,5],[1,1,1,5],[2,1,2,5],[3,1,3,5],[4,1,4,5],[38,4,38,5]]}
[null,"Locale Progress"]
[]
[null,"Instructions"]
[null,"Complete the yellow sections."]
[null,"All locales identified in the approved 'Template 2 - Application Workbook' MUST be listed below."]
[]
[null,"LOCALE NAME\n(must match your application)","SOLUTION TYPE\n(use drop-down)","PROGRESS (%)","STATUS\n(use drop-down)","ESTIMATED \nCOMPLETION DATE","Applicant Name","Project Name","TimeStamp\n(auto fill)"]
[{"$nulls":6},{"$f":"IF(Table1311[[#This Row],[LOCALE NAME\n(must match your application)]]<>\"\",'Overview & Questionnaire'!B18,\"\")","v":""},{"$f":"IF(Table1311[[#This Row],[LOCALE NAME\n(must match your application)]]<>\"\",'Overview & Questionnaire'!B$20,\"\")","v":""},{"$f":"IF(Table1311[[#This Row],[LOCALE NAME\n(must match your application)]]<>\"\",'Overview & Questionnaire'!B$36,\"\")","v":""}]
[{"$nulls":6},{"$f":"IF(Table1311[[#This Row],[LOCALE NAME\n(must match your application)]]<>\"\",'Overview & Questionnaire'!B19,\"\")","v":""},{"$f":"IF(Table1311[[#This Row],[LOCALE NAME\n(must match your application)]]<>\"\",'Overview & Questionnaire'!B$20,\"\")","v":""},{"$f":"IF(Table1311[[#This Row],[LOCALE NAME\n(must match your application)]]<>\"\",'Overview & Questionnaire'!B$36,\"\")","v":""}]
[{"$nulls":6},{"$f":"IF(Table1311[[#This Row],[LOCALE NAME\n(must match your application)]]<>\"\",'Overview & Questionnaire'!B20,\"\")","v":""},{"$f":"IF(Table1311[[#This Row],[LOCALE NAME\n(must match your application)]]<>\"\",'Overview & Questionnaire'!B$20,\"\")","v":""},{"$f":"IF(Table1311[[#This Row],[LOCALE NAME\n(must match your application)]]<>\"\",'Overview & Questionnaire'!B$36,\"\")","v":""}]
{"$rows_left_out":30}
{"sheet":"Highway Progress","index":5,"n_rows":39,"n_cols":12,"rows_kept":39,"merged":[[0,1,0,8],[1,1,1,8],[2,1,2,8],[3,1,3,8],[4,1,4,8],[38,7,38,8]]}
[null,"Highway Progress"]
[]
[null,"Instructions"]
[null,"Complete the yellow sections."]
[null,"All Site IDs, Inland Ferries & Rest Areas, and Highway Number - Names identified in the approved 'Template 2 - Application Workbook' MUST be listed below."]
[]
[null,"SITE ID","SITE TYPE\n(use drop-down)","SOLUTION TYPE\n(use drop-down)","INLAND FERRIES & REST AREAS\n(use drop-down)","HIGHWAY NUMBER - NAME\n(use drop-down)","PROGRESS (%)","STATUS\n(use drop-down)","ESTIMATED\nCOMPETION DATE","Applicant Name","Project Name","TimeStamp\n(auto fill)"]
[{"$nulls":9},{"$f":"IF(Table131112[[#This Row],[SITE ID]]<>\"\",'Overview & Questionnaire'!B$18,\"\")","v":""},{"$f":"IF(Table131112[[#This Row],[SITE ID]]<>\"\",'Overview & Questionnaire'!B$20,\"\")","v":""},{"$f":"IF(Table131112[[#This Row],[SOLUTION TYPE\n(use drop-down)]]<>\"\",'Overview & Questionnaire'!B$36,\"\")","v":""}]
[{"$nulls":9},{"$f":"IF(Table131112[[#This Row],[SITE ID]]<>\"\",'Overview & Questionnaire'!B$18,\"\")","v":""},{"$f":"IF(Table131112[[#This Row],[SITE ID]]<>\"\",'Overview & Questionnaire'!B$20,\"\")","v":""},{"$f":"IF(Table131112[[#This Row],[SOLUTION TYPE\n(use drop-down)]]<>\"\",'Overview & Questionnaire'!B$36,\"\")","v":""}]
[{"$nulls":9},{"$f":"IF(Table131112[[#This Row],[SITE ID]]<>\"\",'Overview & Questionnaire'!B$18,\"\")","v":""},{"$f":"IF(Table131112[[#This Row],[SITE ID]]<>\"\",'Overview & Questionnaire'!B$20,\"\")","v":""},{"$f":"IF(Table131112[[#This Row],[SOLUTION TYPE\n(use drop-down)]]<>\"\",'Overview & Questionnaire'!B$36,\"\")","v":""}]
{"$rows_left_out":30}
{"sheet":"Milestone Summary","index":6,"n_rows":28,"n_cols":16,"rows_kept":28,"merged":[[0,1,0,15],[1,1,1,6],[1,8,1,15],[2,2,2,3],[2,4,2,5],[2,8,2,15],[27,5,27,7]]}
[null,"Milestone Summary"]
[{"$nulls":8},"HIDE; NOT WORKING"]
[null,"MILESTONE","PLANNED",null,"ACTUAL",null,"DELAY","PROGRESS","QUARTER"]
[null,null,"Start","Completion","Start","Completion",null,null,{"$f":"'Milestone Progress'!C12","v":"00:00:00"},{"$f":"DATE(YEAR(I4),MONTH(I4)+3,DAY(I4))","v":"1900-03-31"},{"$f":"DATE(YEAR(J4),MONTH(J4)+3,DAY(J4))","v":"1900-07-01"},"1900-10-01","1901-01-01","1901-04-01","1901-07-01","1901-10-01"]
[null,{"$f":"IF('Milestone Progress'!B12<>\"\",'Milestone Progress'!B12,\"\")","v":"Project Start"},{"$f":"'Milestone Progress'!H12","v":"Q1 1900"},{"$f":"'Milestone Progress'!I12","v":"Q1 1900"},{"$f":"'Milestone Progress'!L12","v":""},{"$f":"'Milestone Progress'!M12","v":""},{"$f":"'Milestone Progress'!K12","v":""},{"$f":"IF(B5<>\"\",'Milestone Progress'!G12,\"\")","v":{"v":0,"d":"0%"}}]
[null,{"$f":"IF('Milestone Progress'!B13<>\"\",'Milestone Progress'!B13,\"\")","v":"insert milestone here"},{"$f":"'Milestone Progress'!H13","v":"Q1 1900"},{"$f":"'Milestone Progress'!I13","v":"Q1 1900"},{"$f":"'Milestone Progress'!L13","v":""},{"$f":"'Milestone Progress'!M13","v":""},{"$f":"'Milestone Progress'!K13","v":""},{"$f":"IF(B6<>\"\",'Milestone Progress'!G13,\"\")","v":{"v":0,"d":"0%"}}]
[null,{"$f":"IF('Milestone Progress'!B14<>\"\",'Milestone Progress'!B14,\"\")","v":"insert milestone here"},{"$f":"'Milestone Progress'!H14","v":"Q1 1900"},{"$f":"'Milestone Progress'!I14","v":"Q1 1900"},{"$f":"'Milestone Progress'!L14","v":""},{"$f":"'Milestone Progress'!M14","v":""},{"$f":"'Milestone Progress'!K14","v":""},{"$f":"IF(B7<>\"\",'Milestone Progress'!G14,\"\")","v":{"v":0,"d":"0%"}}]
[null,{"$f":"IF('Milestone Progress'!B15<>\"\",'Milestone Progress'!B15,\"\")","v":"insert milestone here"},{"$f":"'Milestone Progress'!H15","v":"Q1 1900"},{"$f":"'Milestone Progress'!I15","v":"Q1 1900"},{"$f":"'Milestone Progress'!L15","v":""},{"$f":"'Milestone Progress'!M15","v":""},{"$f":"'Milestone Progress'!K15","v":""},{"$f":"IF(B8<>\"\",'Milestone Progress'!G15,\"\")","v":{"v":0,"d":"0%"}}]
[null,{"$f":"IF('Milestone Progress'!B16<>\"\",'Milestone Progress'!B16,\"\")","v":"insert milestone here"},{"$f":"'Milestone Progress'!H16","v":"Q1 1900"},{"$f":"'Milestone Progress'!I16","v":"Q1 1900"},{"$f":"'Milestone Progress'!L16","v":""},{"$f":"'Milestone Progress'!M16","v":""},{"$f":"'Milestone Progress'!K16","v":""},{"$f":"IF(B9<>\"\",'Milestone Progress'!G16,\"\")","v":{"v":0,"d":"0%"}}]
[null,{"$f":"IF('Milestone Progress'!B17<>\"\",'Milestone Progress'!B17,\"\")","v":"insert milestone here"},{"$f":"'Milestone Progress'!H17","v":"Q1 1900"},{"$f":"'Milestone Progress'!I17","v":"Q1 1900"},{"$f":"'Milestone Progress'!L17","v":""},{"$f":"'Milestone Progress'!M17","v":""},{"$f":"'Milestone Progress'!K17","v":""},{"$f":"IF(B10<>\"\",'Milestone Progress'!G17,\"\")","v":{"v":0,"d":"0%"}}]
{"$rows_left_out":19}
{"sheet":"Named Community List","index":7,"n_rows":1245,"n_cols":8,"rows_kept":1245,"merged":[[0,6,0,7],[1,1,1,7]]}
[{"$nulls":6},"Published October 2020 - Ver. 1.1"]
[null,"Find a Community"]
[null,"Place ID\n","Place Name1 \n(*denotes an indigenous community)","Existing 50/10 Mbps Availability\nInternet2\n(Yes or No)","Existing 25/5 Mbps Availability\n(Yes or No)2","Existing LTE Cellular Availity\n(Yes or No)","Regional District","Economic Region"]
[null,50604,"?Akisq'nuk First Nation*","No","No","Yes","Regional District of East Kootenay","Kootenay"]
[null,8013,"?Akisq'nuk*","No","Yes","Yes","Regional District of East Kootenay","Kootenay"]
[null,50602,"?aqam*","No","Yes","Yes","Regional District of East Kootenay","Kootenay"]
[null,50709,"?Esdilagh First Nation*","Yes","Yes","Yes","Cariboo Regional District","Cariboo"]
[null,8482,"100 Mile House","Yes","Yes","Yes","Cariboo Regional District","Cariboo"]
[null,8481,"103 Mile","Yes","Yes","Yes","Cariboo Regional District","Cariboo"]
[null,8480,"105 Mile House","Yes","Yes","Yes","Cariboo Regional District","Cariboo"]
{"$rows_left_out":1236}
{"sheet":"Hidden-lists","index":8,"n_rows":238,"n_cols":7,"rows_kept":238,"hidden":true}
[]
[null,"Project Types","Community Deployment","Site Type","List of BC HWYs",null,"Inland Ferries & Rest Areas"]
[null,"Community","Broadband","Cellular","HWY 1 - Trans-Canada (Vancouver Island)",null,"Inland Ferry: 104 AVE - Barnston Island Ferry - Port Kells"]
[null,"Highway","Cellular","Public Wi-Fi Hotspot","HWY 1 - Trans-Canada (Mainland)",null,"Inland Ferry: DIVISION ROAD - Glade Ferry Terminal East Shore"]
[null,"Community & Highway","Public Wi-Fi Hotspot","Emergency Call Box","HWY 1A - Taylor Way, Marine Drive, Lions Gate Bridge Road",null,"Inland Ferry: DYKE RD - Barnston Island Ferry - Barnston"]
[null,null,"Broadband & Cellular","Other","HWY 1A - Chemainus (Vancouver Island)",null,"Inland Ferry: EMPIRE VALLEY BIG BAR RD - Big Bar Reaction Ferry West Terminal"]
[null,null,"Satellite",null,"HWY 2 - Dawson Creek – Tupper",null,"Inland Ferry: EMPIRE VALLEY BIG BAR RD - Big Bar Reaction Ferry East Terminal"]
[{"$nulls":4},"HWY 3 - Southern Trans-Provincial Highway (Crowsnest)",null,"Inland Ferry: FERRY ROAD - Little Fort Reaction Ferry West Terminal"]
[{"$nulls":4},"HWY 3A - Keremeos – Kaleden Junction",null,"Inland Ferry: GLADE FERRY ROAD - Glade Ferry Terminal West Shore"]
[{"$nulls":4},"HWY 3A - Castlegar – Nelson Creston",null,"Inland Ferry: HARROP PROCTER ROAD - Harrop Ferry Terminal South Shore"]
{"$rows_left_out":228}