{"text_format":"3","workbook":"xlsx","n_sheets":8,"sheets":["INSTRUCTIONS - Project Info","Named Communities","Locales","Detailed Budget","Permitting","Employment","SUMMARY","Lists-HIdden"],"not_rendered":{"defined_names":32},"read":"whole","date_system":"1900"}

{"sheet":"INSTRUCTIONS - Project Info","index":0,"n_rows":34,"n_cols":13,"rows_kept":34,"merged":[[1,1,1,13],[2,1,2,11],[2,12,2,13],[3,1,5,13],[15,1,17,13],[20,1,20,11],[22,1,23,13],[24,2,24,3],[24,4,24,9],[26,2,26,3],[26,4,26,5],[27,4,27,5],[28,1,29,13],[30,2,30,3],[30,4,30,10],[32,2,32,3],[32,4,32,6],[32,7,32,10],[33,4,33,6],[33,7,33,10]]}
[]
[null,"Connecting British Columbia Program: UBF Core Intake"]
[null,"WORKBOOK INSTRUCTIONS",{"$nulls":10},"Published January 7, 2021 – Ver. 1.0"]
[null,"Applicants to the Connecting British Columbia Program are required to complete this workbook with detailed information about the proposed project.\nIt is the responsibility of the applicant to ensure the information entered is accurate and that totals and costs add up correctly.  "]
[]
[]
[null,"This workbook consists of 7 sheets: "]
[null,null,"INSTRUCTIONS - Project Information"]
[null,null,"Named Communities"]
[null,null,"Locales"]
[null,null,"Detailed Budget"]
[null,null,"Permitting"]
[null,null,"Employment"]
[null,null,"SUMMARY (Auto-Populated)"]
[]
[null,"Applicants should not enter formulas, add or remove columns and rows or make other changes to the format of the workbook. If you are pasting data from one spreadsheet to another, paste values only, not formulas or formatting. Any change to the format of the spreadsheet may prevent your data from being assessed for funding. "]
[]
[]
[null,"Once the workbook is completed verify all information entered is correct. The SUMMARY sheet will auto-populated a reference table to summarize the information provided.  "]
[]
[null,"PROJECT INFORMATION"]
[]
[null,"Indicate the project name and select the project type (Last-Mile or Last-Mile & Transport) using the drop-down menu."]
[]
[null,null,"Project Name:"]
[]
[null,null,"Project Type:"]
[{"$nulls":4},"Use drop-down"]
[null,"Indicate the applicant organization and a primary contact for information entered into this workbook."]
[]
[null,null,"Applicant Organization:"]
[]
[null,null,"Primary Contact:"]
[{"$nulls":4},"Name",null,null,"Email"]

{"sheet":"Named Communities","index":1,"n_rows":1275,"n_cols":42,"rows_kept":1275,"merged":[[1,1,1,16],[2,1,2,15],[3,1,5,16],[6,1,6,12],[6,13,6,16],[8,1,26,12],[8,14,8,16],[9,14,9,16],[12,14,12,15],[13,14,13,15],[14,14,14,15],[15,14,15,15],[18,14,18,15],[19,14,19,15],[20,14,20,15],[28,1,28,16],[28,35,31,35],[29,1,29,16],[31,1,31,7],[31,9,31,12],[31,13,31,16],[31,40,31,41]]}
[]
[null,"Connecting British Columbia Program: UBF Core Intake"]
[null,"                     NAMED COMMUNITIES",{"$nulls":14},"Published January 7, 2021 – Ver. 1.0","Drop Down Lists"]
[null,"Use this template to identify the Named Communities that will benefit from the proposed project.  The list below contains the communities or placenames in B.C. that are classified as cities, towns, villages, districts, municipalities, or indigenous communities.  \nWhile every effort is made to ensure all communities are on this list it is possible that a local place name or neighborhood is not included.  Those communities not shown on the list below can be identified on the Locales sheet in this workbook."]
[]
[{"$nulls":17},"Transport",null,"Fibre"]
[null,"INSTRUCTIONS",{"$nulls":11},"SUMMARY (Auto-Populated)",{"$nulls":3},"Last-Mile",null,"Microwave"]
[{"$nulls":17},"Transport & Last-Mile",null,"Other"]
[null,"Step 1: Identify communities for proposed project using the drop-down list in column C.  If your community is not available within the list below please select the Locales tab, then enter your community/locale and populate the required columns.\n\nStep 2: For each community indicate the proposed solution. \n\t\t\t\t\t\t\t\t\t\t\t\t\nStep 3: Filter out the blank rows.  Click on the filter button in cell I33 and remove the check mark beside (Blanks).  To undue this select the filter button and select the check mark beside (Blanks).\t\n\t\t\t\t\t\t\t\t\t\t\t\t\nStep 4: For each project community, provide information for columns J-P.\t\t\t\t\t\t\n\nNotes:\t\t\t\t\t\t\t\t\t\t\t\t\n1 Verify selected place names as multiples do exist.  A map link is provided in column C.  For more information refer to the data source found here:\nhttps://open.canada.ca/data/en/dataset/fe945388-1dd9-4a4a-9a1e-5c552579a28c\t\t\t\t\t\t\t\t\t\t\t\n\t\t\t\t\t\t\t\t\t\t\t\t\n2 \"Column D indicates whether a selected community has access to 50/10 Mbps internet based on data from Innovation, Science and Economic Development Canada.\nFor community projects the Connecting British Columbia Program provides funding for communities that do not have access to 50/10 Mbps internet.  Refer to section 3.1 in the Application Guide for more information.\n\n3 Contention ratio or over subscription ratio is the number of users sharing the same data capacity. For example a 50:1 contention ratio means that up to 50 broadband customers are sharing the same bandwidth at any one time.",{"$nulls":11},"Project Name:",{"$f":"IF(ISBLANK('INSTRUCTIONS - Project Info'!E25), \"Auto-Populated from the INSTRUCTIONS Sheet\", 'INSTRUCTIONS - Project Info'!E25)","v":"Auto-Populated from the INSTRUCTIONS Sheet"}]
[{"$nulls":13},"Project Type:",{"$f":"IF(ISBLANK('INSTRUCTIONS - Project Info'!E27), \"Auto-Populated from the INSTRUCTIONS Sheet\", 'INSTRUCTIONS - Project Info'!E27)","v":"Auto-Populated from the INSTRUCTIONS Sheet"}]
[]
[{"$nulls":14},"Last-Mile:"]
[{"$nulls":14},"Total Number of Communities",null,{"$f":"COUNTIF(Table11[Identify Solution for \nProposed Project\n(use drop-down in each cell)],\"*\")","v":0}]
[{"$nulls":14},"Indigenous Communities",null,{"$f":"IF(U29=0,\"0\",U29)","v":"0"}]
[{"$nulls":14},"Total Number of Households",null,{"$f":"SUM(Table11[Number of Households proposed to be served?])","v":0}]
[{"$nulls":14},"Number of Indigenous Households",null,{"$f":"SUMIFS(Table11[Number of Households proposed to be served?],Table11[Identify Solution for \nProposed Project\n(use drop-down in each cell)],\"*\",Table11[First Nations],\"Y\")","v":0}]
[]
[{"$nulls":14},"Transport:"]
[{"$nulls":14},"Total Number of Communities",null,{"$f":"COUNTIF(Table11[Identify Solution for \nProposed Project\n(use drop-down in each cell)],\"*\"&\"Transport\"&\"*\")","v":0}]
[{"$nulls":14},"Indigenous Communities",null,{"$f":"IF(V29=0,\"0\",V29)","v":"0"}]
[]
[]
[]
[]
[]
[]
[{"$nulls":20},"Sum of FN Communities (last-mile):","Sum of FN Communities (last-mile & transport):",null,null,"Sum of FN Transport Communitiers:"]
[]
[null,"NAMED COMMUNITY INFORMATION",{"$nulls":18},{"$f":"SUM(U34:U1275)","v":0},{"$f":"SUM(V34:V1275)","v":0},null,null,{"$f":"SUM(Y34:Y1269)","v":0},{"$nulls":10},"Based on threshold fo 75% HHs in a HEX having access to 50/10"]
[]
[null,null,"Step 1",{"$nulls":5},"Step 2 & 3","Step 4","Step 4","Step 4","Step 4","Step 4","Step 4","Step 4"]
[null,"Reference List",{"$nulls":7},"Broadband",{"$nulls":3},"Network",{"$nulls":3},"Last-Mile Stats Calculations",{"$nulls":5},"Transport Calculations",null,null,"Reference List ",{"$nulls":9},"CRTC Broadband Fund Criteria",{"$nulls":3},"Not Used Currently"]
[null,"Place ID\n","Place Name1 \n(*denotes an indigenous community)","Existing 50/10 Mbps Availability2\n(Yes or No)","Existing 25/5 Mbps Availability3\n(Yes or No)","Existing LTE Cellular Availability\n(Yes or No)","Regional District","Economic Region","Identify Solution for \nProposed Project\n(use drop-down in each cell)","Number of Households proposed to be served?","Proposed Broadband Solution\n(use drop-down in each cell)","Speeds proposed for households\n(Mbps)","Contention Ratio3 \n(X:1) - enter value\nfor only X below","Existing Transport Capacity \n(Mbps)","Name of Existing\nWholesale Transport Provider\n(if applicable; leave blank for none)","Wholesale Transport Cost (if applicable)\n($ monthly)","Network\nCapacity\nCheck\n(Auto-populated)","Check Calculation 1 (Household Capacity Required)","Check Calculation 2 (Difference with Available Transport)","Total Number of Communities Calculation","Total number of First Nations & Indigenous Communities Calculation (Last-Mile)","Total number of First Nations & Indigenous Communities Calculation (Transport)","Total number of HHs Calculation","Total Number of Transport Communities","Total number of First Nations & Indigenous Communities Calculation2","Total Number of PoPs","Place Name","First Nations","Latitude","Longitude","Map Links","Place ID","Place Type","HEX POPULATION","HEX TOTAL_DWELLINGS","Broadband 50/10 Mbps Access (Yes/No)","Eligible for CRTC Last-Mile Funding (Yes/No)","CRTC Transport Eligible","CRTC Satellite Dependant","Placename with Asterix for First Nations","Condition for Last-Mile Community Names","Condition for Transport "]
[null,7926,{"$f":"HYPERLINK(AE34,AN34)","v":"Roosville"},"No","No","Yes","Regional District of East Kootenay","Kootenay",{"$nulls":8},{"$f":"IF(L34=\"\",\"\",\nIF(SUM((J34*L34)/M34)<=N34,\"Sufficient Capacity\",\nIF(SUM((J34*L34)/M34)>N34,\"Not Enough Capacity\",\"Error\")))","v":""},{"$f":"IF(OR(ISBLANK(J34),ISBLANK(L34),ISBLANK(M34)), \"\",(J34*L34/M34))","v":""},{"$f":"IF(AND(COUNT(N34,R34)=2, OR($O$10=\"Last-Mile\", $O$10=\"Transport & Last-Mile\")), N34-R34, \"\")","v":""},null,{"$f":"IF(AND(AB34=\"Y\",I34<>\"\"),1,0)","v":0},{"$f":"IF(AND(AB34=\"Y\",I34=\"Last-Mile & Transport\"),1,0)","v":0},null,null,{"$f":"IF(AB34=\"Y\",COUNT(#REF!), \"\")","v":""},null,"Roosville","N",{"v":49.023629,"d":"49.02363"},{"v":-115.046938,"d":"-115.04694"},"http://www.google.com/maps/place/49.023629,-115.046938",7926,"Rural",61,24,"No","Yes","Yes","No ",{"$f":"IF(AB34=\"Y\", CONCATENATE(AA34,\"*\"), AA34)","v":"Roosville"},{"$f":"IF(I34=\"Last-Mile\",\"TRUE\",IF(I34=\"Transport & Last-Mile\",\"TRUE\",\"FALSE\"))","v":"FALSE"},{"$f":"IF(I34=\"Transport\",\"TRUE\",IF(I34=\"Transport & Last-Mile\",\"TRUE\",\"FALSE\"))","v":"FALSE"}]
[null,7927,"Grasmere","No","No","Yes","Regional District of East Kootenay","Kootenay",{"$nulls":8},"","","",null,0,0,null,null,{"$f":"IF(AB35=\"Y\",COUNT(#REF!), \"\")","v":""},null,"Grasmere","N",{"v":49.1,"d":"49.10000"},{"v":-115.0833,"d":"-115.08330"},"http://www.google.com/maps/place/49.1,-115.0833",7927,"Rural",86,74,"No","Yes","Yes","No ","Grasmere","FALSE","FALSE"]
[null,7928,"Baynes Lake","No","Yes","Yes","Regional District of East Kootenay","Kootenay",{"$nulls":8},"","","",null,0,0,null,null,{"$f":"IF(AB36=\"Y\",COUNT(#REF!), \"\")","v":""},null,"Baynes Lake","N",{"v":49.2333,"d":"49.23330"},{"v":-115.2167,"d":"-115.21670"},"http://www.google.com/maps/place/49.2333,-115.2167",7928,"Rural",142,84,"No","Yes","No","No ","Baynes Lake","FALSE","FALSE"]
[null,7929,"Elko","No","Yes","Yes","Regional District of East Kootenay","Kootenay",{"$nulls":8},"","","",null,0,0,null,null,{"$f":"IF(AB37=\"Y\",COUNT(#REF!), \"\")","v":""},null,"Elko","N",{"v":49.301222,"d":"49.30122"},{"v":-115.110988,"d":"-115.11099"},"http://www.google.com/maps/place/49.301222,-115.110988",7929,"Rural",243,121,"No","Yes","No","No ","Elko","FALSE","FALSE"]
[null,7930,"Jaffray","No","Yes","Yes","Regional District of East Kootenay","Kootenay",{"$nulls":8},"","","",null,0,0,null,null,{"$f":"IF(AB38=\"Y\",COUNT(#REF!), \"\")","v":""},null,"Jaffray","N",{"v":49.374424,"d":"49.37442"},{"v":-115.300036,"d":"-115.30004"},"http://www.google.com/maps/place/49.374424,-115.300036",7930,"Rural",788,550,"No","Yes","No","No ","Jaffray","FALSE","FALSE"]
[null,7931,"Wardner","No","No","Yes","Regional District of East Kootenay","Kootenay",{"$nulls":8},"","","",null,0,0,null,null,{"$f":"IF(AB39=\"Y\",COUNT(#REF!), \"\")","v":""},null,"Wardner","N",{"v":49.416999,"d":"49.41700"},{"v":-115.428955,"d":"-115.42896"},"http://www.google.com/maps/place/49.416999,-115.428955",7931,"Rural",99,66,"No","Yes","Yes","No ","Wardner","FALSE","FALSE"]
[null,7932,"Bull River","No","No","Yes","Regional District of East Kootenay","Kootenay",{"$nulls":8},"","","",null,0,0,null,null,{"$f":"IF(AB40=\"Y\",COUNT(#REF!), \"\")","v":""},null,"Bull River","N",{"v":49.470053,"d":"49.47005"},{"v":-115.448181,"d":"-115.44818"},"http://www.google.com/maps/place/49.470053,-115.448181",7932,"Rural",58,32,"No","Yes","No","No ","Bull River","FALSE","FALSE"]
[null,7933,"Mayook","No","No","Yes","Regional District of East Kootenay","Kootenay",{"$nulls":8},"","","",null,0,0,null,null,{"$f":"IF(AB41=\"Y\",COUNT(#REF!), \"\")","v":""},null,"Mayook","N",{"v":49.486908,"d":"49.48691"},{"v":-115.576893,"d":"-115.57689"},"http://www.google.com/maps/place/49.486908,-115.576893",7933,"Rural",29,20,"No","Yes","No","No ","Mayook","FALSE","FALSE"]
[null,7934,"Cranbrook","Yes","Yes","Yes","Regional District of East Kootenay","Kootenay",{"$nulls":8},"","","",null,0,0,null,null,{"$f":"IF(AB42=\"Y\",COUNT(#REF!), \"\")","v":""},null,"Cranbrook","N",{"v":49.515487,"d":"49.51549"},{"v":-115.758896,"d":"-115.75890"},"http://www.google.com/maps/place/49.515487,-115.758896",7934,"Rural",7426,3583,"Yes","No","Yes","No ","Cranbrook","FALSE","FALSE"]
[null,7935,"Cokato","Yes","Yes","Yes","Regional District of East Kootenay","Kootenay",{"$nulls":8},"","","",null,0,0,null,null,{"$f":"IF(AB43=\"Y\",COUNT(#REF!), \"\")","v":""},null,"Cokato","N",{"v":49.4667,"d":"49.46670"},{"v":-115.066699,"d":"-115.06670"},"http://www.google.com/maps/place/49.4667,-115.066699",7935,"Rural",223,547,"Yes","No","No","No ","Cokato","FALSE","FALSE"]
[null,7936,"Fernie","Yes","Yes","Yes","Regional District of East Kootenay","Kootenay",{"$nulls":8},"","","",null,0,0,null,null,{"$f":"IF(AB44=\"Y\",COUNT(#REF!), \"\")","v":""},null,"Fernie","N",{"v":49.506761,"d":"49.50676"},{"v":-115.068802,"d":"-115.06880"},"http://www.google.com/maps/place/49.506761,-115.068802",7936,"Rural",4432,2453,"Yes","No","Yes","No ","Fernie","FALSE","FALSE"]
[null,7937,"Hosmer","Yes","Yes","Yes","Regional District of East Kootenay","Kootenay",{"$nulls":8},"","","",null,0,0,null,null,{"$f":"IF(AB45=\"Y\",COUNT(#REF!), \"\")","v":""},null,"Hosmer","N",{"v":49.589651,"d":"49.58965"},{"v":-114.964499,"d":"-114.96450"},"http://www.google.com/maps/place/49.589651,-114.964499",7937,"Rural",123,67,"Yes","No","No","No ","Hosmer","FALSE","FALSE"]
[null,7938,"Sparwood","Yes","Yes","Yes","Regional District of East Kootenay","Kootenay",{"$nulls":8},"","","",null,0,0,null,null,{"$f":"IF(AB46=\"Y\",COUNT(#REF!), \"\")","v":""},null,"Sparwood","N",{"v":49.732622,"d":"49.73262"},{"v":-114.891904,"d":"-114.89190"},"http://www.google.com/maps/place/49.732622,-114.891904",7938,"Rural",3307,1880,"Yes","No","No","No ","Sparwood","FALSE","FALSE"]
[null,7939,"Elkford","Yes","Yes","Yes","Regional District of East Kootenay","Kootenay",{"$nulls":8},"","","",null,0,0,null,null,{"$f":"IF(AB47=\"Y\",COUNT(#REF!), \"\")","v":""},null,"Elkford","N",50.01044,{"v":-114.929557,"d":"-114.92956"},"http://www.google.com/maps/place/50.01044,-114.929557",7939,"Rural",2499,1519,"Yes","No","No","No ","Elkford","FALSE","FALSE"]
[null,7940,"Moyie","Yes","Yes","Yes","Regional District of East Kootenay","Kootenay",{"$nulls":8},"","","",null,0,0,null,null,{"$f":"IF(AB48=\"Y\",COUNT(#REF!), \"\")","v":""},null,"Moyie","N",{"v":49.288788,"d":"49.28879"},-115.83158,"http://www.google.com/maps/place/49.288788,-115.83158",7940,"Rural",125,113,"No","Yes","No","No ","Moyie","FALSE","FALSE"]
[null,7941,"Yahk","No","Yes","Yes","Regional District of Central Kootenay","Kootenay",{"$nulls":8},"","","",null,0,0,null,null,{"$f":"IF(AB49=\"Y\",COUNT(#REF!), \"\")","v":""},null,"Yahk","N",{"v":49.085002,"d":"49.08500"},{"v":-116.081893,"d":"-116.08189"},"http://www.google.com/maps/place/49.085002,-116.081893",7941,"Rural",78,44,"No","Yes","No","No ","Yahk","FALSE","FALSE"]
[null,7942,"Kitchener","No","Yes","Yes","Regional District of Central Kootenay","Kootenay",{"$nulls":8},"","","",null,0,0,null,null,{"$f":"IF(AB50=\"Y\",COUNT(#REF!), \"\")","v":""},null,"Kitchener","N",{"v":49.156652,"d":"49.15665"},{"v":-116.339452,"d":"-116.33945"},"http://www.google.com/maps/place/49.156652,-116.339452",7942,"Rural",132,64,"No","Yes","No","No ","Kitchener","FALSE","FALSE"]
[null,7943,"Creston","Yes","Yes","Yes","Regional District of Central Kootenay","Kootenay",{"$nulls":8},"","","",null,0,0,null,null,{"$f":"IF(AB51=\"Y\",COUNT(#REF!), \"\")","v":""},null,"Creston","N",49.10062,{"v":-116.507478,"d":"-116.50748"},"http://www.google.com/maps/place/49.10062,-116.507478",7943,"Rural",4618,2368,"Yes","No","Yes","No ","Creston","FALSE","FALSE"]
[null,7944,"Wynndel","Yes","Yes","Yes","Regional District of Central Kootenay","Kootenay",{"$nulls":8},"","","",null,0,0,null,null,{"$f":"IF(AB52=\"Y\",COUNT(#REF!), \"\")","v":""},null,"Wynndel","N",{"v":49.18,"d":"49.18000"},{"v":-116.5525,"d":"-116.55250"},"http://www.google.com/maps/place/49.18,-116.5525",7944,"Rural",559,265,"No","No","Yes","No ","Wynndel","FALSE","FALSE"]
[null,7945,"Lister","No","Yes","Yes","Regional District of Central Kootenay","Kootenay",{"$nulls":8},"","","",null,0,0,null,null,{"$f":"IF(AB53=\"Y\",COUNT(#REF!), \"\")","v":""},null,"Lister","N",{"v":49.047402,"d":"49.04740"},{"v":-116.463073,"d":"-116.46307"},"http://www.google.com/maps/place/49.047402,-116.463073",7945,"Rural",2844,1367,"Yes","No","No","No ","Lister","FALSE","FALSE"]
[null,7946,"Canyon","Yes","Yes","Yes","Regional District of Central Kootenay","Kootenay",{"$nulls":8},"","","",null,0,0,null,null,{"$f":"IF(AB54=\"Y\",COUNT(#REF!), \"\")","v":""},null,"Canyon","N",{"v":49.081267,"d":"49.08127"},{"v":-116.442846,"d":"-116.44285"},"http://www.google.com/maps/place/49.081267,-116.442846",7946,"Rural",412,184,"Yes","No","No","No ","Canyon","FALSE","FALSE"]
[null,7947,"Huscroft","No","Yes","Yes","Regional District of Central Kootenay","Kootenay",{"$nulls":8},"","","",null,0,0,null,null,{"$f":"IF(AB55=\"Y\",COUNT(#REF!), \"\")","v":""},null,"Huscroft","N",{"v":49.016701,"d":"49.01670"},{"v":-116.4667,"d":"-116.46670"},"http://www.google.com/maps/place/49.016701,-116.4667",7947,"Rural",544,247,"No","Yes","No","No ","Huscroft","FALSE","FALSE"]
[null,7949,"Crawford Bay","No","Yes","Yes","Regional District of Central Kootenay","Kootenay",{"$nulls":8},"","","",null,0,0,null,null,{"$f":"IF(AB56=\"Y\",COUNT(#REF!), \"\")","v":""},null,"Crawford Bay","N",{"v":49.676593,"d":"49.67659"},{"v":-116.822438,"d":"-116.82244"},"http://www.google.com/maps/place/49.676593,-116.822438",7949,"Rural",294,207,"No","Yes","Yes","No ","Crawford Bay","FALSE","FALSE"]
[null,7950,"Balfour","Yes","Yes","Yes","Regional District of Central Kootenay","Kootenay",{"$nulls":8},"","","",null,0,0,null,null,{"$f":"IF(AB57=\"Y\",COUNT(#REF!), \"\")","v":""},null,"Balfour","N",{"v":49.628334,"d":"49.62833"},{"v":-116.971805,"d":"-116.97181"},"http://www.google.com/maps/place/49.628334,-116.971805",7950,"Rural",892,611,"Yes","No","No","No ","Balfour","FALSE","FALSE"]
[null,7951,"Procter","Yes","Yes","Yes","Regional District of Central Kootenay","Kootenay",{"$nulls":8},"","","",null,0,0,null,null,{"$f":"IF(AB58=\"Y\",COUNT(#REF!), \"\")","v":""},null,"Procter","N",{"v":49.615578,"d":"49.61558"},-116.95582,"http://www.google.com/maps/place/49.615578,-116.95582",7951,"Rural",892,611,"Yes","No","Yes","No ","Procter","FALSE","FALSE"]
[null,7952,"Harrop","Yes","Yes","Yes","Regional District of Central Kootenay","Kootenay",{"$nulls":8},"","","",null,0,0,null,null,{"$f":"IF(AB59=\"Y\",COUNT(#REF!), \"\")","v":""},null,"Harrop","N",{"v":49.601643,"d":"49.60164"},{"v":-117.053224,"d":"-117.05322"},"http://www.google.com/maps/place/49.601643,-117.053224",7952,"Rural",96,68,"Yes","No","Yes","No ","Harrop","FALSE","FALSE"]
[null,7953,"Riondel","No","Yes","Yes","Regional District of Central Kootenay","Kootenay",{"$nulls":8},"","","",null,0,0,null,null,{"$f":"IF(AB60=\"Y\",COUNT(#REF!), \"\")","v":""},null,"Riondel","N",{"v":49.761771,"d":"49.76177"},{"v":-116.856238,"d":"-116.85624"},"http://www.google.com/maps/place/49.761771,-116.856238",7953,"Rural",271,222,"No","Yes","No","No ","Riondel","FALSE","FALSE"]
[null,7954,"Ymir","No","Yes","Yes","Regional District of Central Kootenay","Kootenay",{"$nulls":8},"","","",null,0,0,null,null,{"$f":"IF(AB61=\"Y\",COUNT(#REF!), \"\")","v":""},null,"Ymir","N",{"v":49.2833,"d":"49.28330"},{"v":-117.216701,"d":"-117.21670"},"http://www.google.com/maps/place/49.2833,-117.216701",7954,"Rural",435,195,"No","Yes","Yes","No ","Ymir","FALSE","FALSE"]
[null,7955,"Six Mile","Yes","Yes","Yes","Regional District of Central Kootenay","Kootenay",{"$nulls":8},"","","",null,0,0,null,null,{"$f":"IF(AB62=\"Y\",COUNT(#REF!), \"\")","v":""},null,"Six Mile","N",49.57855,{"v":-117.225128,"d":"-117.22513"},"http://www.google.com/maps/place/49.57855,-117.225128",7955,"Rural",1083,530,"Yes","No","Yes","No ","Six Mile","FALSE","FALSE"]
[null,7956,"Ainsworth Hot Springs","Yes","Yes","Yes","Regional District of Central Kootenay","Kootenay",{"$nulls":8},"","","",null,0,0,null,null,{"$f":"IF(AB63=\"Y\",COUNT(#REF!), \"\")","v":""},null,"Ainsworth Hot Springs","N",{"v":49.734265,"d":"49.73427"},{"v":-116.912552,"d":"-116.91255"},"http://www.google.com/maps/place/49.734265,-116.912552",7956,"Rural",82,68,"No","No","Yes","No ","Ainsworth Hot Springs","FALSE","FALSE"]
[null,7957,"Nelson","Yes","Yes","Yes","Regional District of Central Kootenay","Kootenay",{"$nulls":8},"","","",null,0,0,null,null,{"$f":"IF(AB64=\"Y\",COUNT(#REF!), \"\")","v":""},null,"Nelson","N",{"v":49.497478,"d":"49.49748"},-117.28238,"http://www.google.com/maps/place/49.497478,-117.28238",7957,"Rural",6096,2888,"Yes","No","No","No ","Nelson","FALSE","FALSE"]
[null,7958,"Winlaw","No","Yes","No","Regional District of Central Kootenay","Kootenay",{"$nulls":8},"","","",null,0,0,null,null,{"$f":"IF(AB65=\"Y\",COUNT(#REF!), \"\")","v":""},null,"Winlaw","N",{"v":49.614419,"d":"49.61442"},{"v":-117.549724,"d":"-117.54972"},"http://www.google.com/maps/place/49.614419,-117.549724",7958,"Rural",435,218,"No","Yes","Yes","No ","Winlaw","FALSE","FALSE"]
[null,7959,"Slocan","Yes","Yes","Yes","Regional District of Central Kootenay","Kootenay",{"$nulls":8},"","","",null,0,0,null,null,{"$f":"IF(AB66=\"Y\",COUNT(#REF!), \"\")","v":""},null,"Slocan","N",{"v":49.7667,"d":"49.76670"},{"v":-117.466699,"d":"-117.46670"},"http://www.google.com/maps/place/49.7667,-117.466699",7959,"Rural",153,103,"No","Yes","No","No ","Slocan","FALSE","FALSE"]
[null,7960,"Silverton","No","Yes","Yes","Regional District of Central Kootenay","Kootenay",{"$nulls":8},"","","",null,0,0,null,null,{"$f":"IF(AB67=\"Y\",COUNT(#REF!), \"\")","v":""},null,"Silverton","N",{"v":49.952799,"d":"49.95280"},{"v":-117.3583,"d":"-117.35830"},"http://www.google.com/maps/place/49.952799,-117.3583",7960,"Rural",259,184,"No","Yes","Yes","No ","Silverton","FALSE","FALSE"]
[null,7961,"New Denver","Yes","Yes","Yes","Regional District of Central Kootenay","Kootenay",{"$nulls":8},"","","",null,0,0,null,null,{"$f":"IF(AB68=\"Y\",COUNT(#REF!), \"\")","v":""},null,"New Denver","N",{"v":49.9917,"d":"49.99170"},{"v":-117.373601,"d":"-117.37360"},"http://www.google.com/maps/place/49.9917,-117.373601",7961,"Rural",554,373,"No","Yes","No","No ","New Denver","FALSE","FALSE"]
[null,7962,"Salmo","Yes","Yes","Yes","Regional District of Central Kootenay","Kootenay",{"$nulls":8},"","","",null,0,0,null,null,{"$f":"IF(AB69=\"Y\",COUNT(#REF!), \"\")","v":""},null,"Salmo","N",{"v":49.191615,"d":"49.19162"},{"v":-117.276785,"d":"-117.27679"},"http://www.google.com/maps/place/49.191615,-117.276785",7962,"Rural",1450,721,"No","Yes","Yes","No ","Salmo","FALSE","FALSE"]
[null,7963,"Fruitvale","Yes","Yes","Yes","Regional District of Kootenay Boundary","Kootenay",{"$nulls":8},"","","",null,0,0,null,null,{"$f":"IF(AB70=\"Y\",COUNT(#REF!), \"\")","v":""},null,"Fruitvale","N",{"v":49.113885,"d":"49.11389"},{"v":-117.547764,"d":"-117.54776"},"http://www.google.com/maps/place/49.113885,-117.547764",7963,"Rural",2680,1177,"Yes","No","No","No ","Fruitvale","FALSE","FALSE"]
[null,7964,"Montrose","Yes","Yes","Yes","Regional District of Kootenay Boundary","Kootenay",{"$nulls":8},"","","",null,0,0,null,null,{"$f":"IF(AB71=\"Y\",COUNT(#REF!), \"\")","v":""},null,"Montrose","N",{"v":49.078787,"d":"49.07879"},{"v":-117.590692,"d":"-117.59069"},"http://www.google.com/maps/place/49.078787,-117.590692",7964,"Rural",1448,616,"Yes","No","No","No ","Montrose","FALSE","FALSE"]
[null,7965,"Trail","Yes","Yes","Yes","Regional District of Kootenay Boundary","Kootenay",{"$nulls":8},"","","",null,0,0,null,null,{"$f":"IF(AB72=\"Y\",COUNT(#REF!), \"\")","v":""},null,"Trail","N",{"v":49.100001,"d":"49.10000"},{"v":-117.700001,"d":"-117.70000"},"http://www.google.com/maps/place/49.100001,-117.700001",7965,"Rural",3165,1475,"Yes","No","No","No ","Trail","FALSE","FALSE"]
[null,7966,"Warfield","Yes","Yes","Yes","Regional District of Kootenay Boundary","Kootenay",{"$nulls":8},"","","",null,0,0,null,null,{"$f":"IF(AB73=\"Y\",COUNT(#REF!), \"\")","v":""},null,"Warfield","N",{"v":49.094466,"d":"49.09447"},{"v":-117.748631,"d":"-117.74863"},"http://www.google.com/maps/place/49.094466,-117.748631",7966,"Rural",3500,1853,"Yes","No","No","No ","Warfield","FALSE","FALSE"]
[null,7967,"Rossland","Yes","Yes","Yes","Regional District of Kootenay Boundary","Kootenay",{"$nulls":8},"","","",null,0,0,null,null,{"$f":"IF(AB74=\"Y\",COUNT(#REF!), \"\")","v":""},null,"Rossland","N",49.07746,{"v":-117.800782,"d":"-117.80078"},"http://www.google.com/maps/place/49.07746,-117.800782",7967,"Rural",3657,1752,"Yes","No","Yes","No ","Rossland","FALSE","FALSE"]
[null,7968,"Genelle","Yes","Yes","Yes","Regional District of Kootenay Boundary","Kootenay",{"$nulls":8},"","","",null,0,0,null,null,{"$f":"IF(AB75=\"Y\",COUNT(#REF!), \"\")","v":""},null,"Genelle","N",{"v":49.213867,"d":"49.21387"},{"v":-117.690816,"d":"-117.69082"},"http://www.google.com/maps/place/49.213867,-117.690816",7968,"Rural",1026,499,"Yes","No","No","No ","Genelle","FALSE","FALSE"]
[null,7969,"Ootischenia","Yes","Yes","Yes","Regional District of Central Kootenay","Kootenay",{"$nulls":8},"","","",null,0,0,null,null,{"$f":"IF(AB76=\"Y\",COUNT(#REF!), \"\")","v":""},null,"Ootischenia","N",{"v":49.2833,"d":"49.28330"},{"v":-117.6333,"d":"-117.63330"},"http://www.google.com/maps/place/49.2833,-117.6333",7969,"Rural",2797,1298,"Yes","No","No","No ","Ootischenia","FALSE","FALSE"]
[null,7970,"Castlegar","Yes","Yes","Yes","Regional District of Central Kootenay","Kootenay",{"$nulls":8},"","","",null,0,0,null,null,{"$f":"IF(AB77=\"Y\",COUNT(#REF!), \"\")","v":""},null,"Castlegar","N",{"v":49.321815,"d":"49.32182"},{"v":-117.660314,"d":"-117.66031"},"http://www.google.com/maps/place/49.321815,-117.660314",7970,"Rural",4290,2036,"Yes","No","No","No ","Castlegar","FALSE","FALSE"]
[null,7971,"Blueberry Creek","Yes","Yes","Yes","Regional District of Central Kootenay","Kootenay",{"$nulls":8},"","","",null,0,0,null,null,{"$f":"IF(AB78=\"Y\",COUNT(#REF!), \"\")","v":""},null,"Blueberry Creek","N",{"v":49.246007,"d":"49.24601"},{"v":-117.658675,"d":"-117.65868"},"http://www.google.com/maps/place/49.246007,-117.658675",7971,"Rural",1530,680,"Yes","No","Yes","No ","Blueberry Creek","FALSE","FALSE"]
[null,7972,"Kinnaird","Yes","Yes","Yes","Regional District of Central Kootenay","Kootenay",{"$nulls":8},"","","",null,0,0,null,null,{"$f":"IF(AB79=\"Y\",COUNT(#REF!), \"\")","v":""},null,"Kinnaird","N",{"v":49.283415,"d":"49.28342"},{"v":-117.650843,"d":"-117.65084"},"http://www.google.com/maps/place/49.283415,-117.650843",7972,"Rural",2083,838,"Yes","No","Yes","No ","Kinnaird","FALSE","FALSE"]
[null,7973,"Raspberry","Yes","Yes","Yes","Regional District of Central Kootenay","Kootenay",{"$nulls":8},"","","",null,0,0,null,null,{"$f":"IF(AB80=\"Y\",COUNT(#REF!), \"\")","v":""},null,"Raspberry","N",{"v":49.335768,"d":"49.33577"},{"v":-117.657419,"d":"-117.65742"},"http://www.google.com/maps/place/49.335768,-117.657419",7973,"Rural",4290,2036,"Yes","No","Yes","No ","Raspberry","FALSE","FALSE"]
[null,7974,"Robson","Yes","Yes","Yes","Regional District of Central Kootenay","Kootenay",{"$nulls":8},"","","",null,0,0,null,null,{"$f":"IF(AB81=\"Y\",COUNT(#REF!), \"\")","v":""},null,"Robson","N",{"v":49.337472,"d":"49.33747"},{"v":-117.691433,"d":"-117.69143"},"http://www.google.com/maps/place/49.337472,-117.691433",7974,"Rural",4290,2036,"Yes","No","Yes","No ","Robson","FALSE","FALSE"]
[null,7975,"Glade","Yes","Yes","Yes","Regional District of Central Kootenay","Kootenay",{"$nulls":8},"","","",null,0,0,null,null,{"$f":"IF(AB82=\"Y\",COUNT(#REF!), \"\")","v":""},null,"Glade","N",{"v":49.396358,"d":"49.39636"},{"v":-117.535373,"d":"-117.53537"},"http://www.google.com/maps/place/49.396358,-117.535373",7975,"Rural",418,195,"Yes","No","Yes","No ","Glade","FALSE","FALSE"]
[null,7976,"Shoreacres","Yes","Yes","Yes","Regional District of Central Kootenay","Kootenay",{"$nulls":8},"","","",null,0,0,null,null,{"$f":"IF(AB83=\"Y\",COUNT(#REF!), \"\")","v":""},null,"Shoreacres","N",{"v":49.430727,"d":"49.43073"},-117.52685,"http://www.google.com/maps/place/49.430727,-117.52685",7976,"Rural",1520,723,"Yes","No","Yes","No ","Shoreacres","FALSE","FALSE"]
[null,7977,"Bonnington Falls","Yes","Yes","Yes","Regional District of Central Kootenay","Kootenay",{"$nulls":8},"","","",null,0,0,null,null,{"$f":"IF(AB84=\"Y\",COUNT(#REF!), \"\")","v":""},null,"Bonnington Falls","N",{"v":49.4667,"d":"49.46670"},{"v":-117.483301,"d":"-117.48330"},"http://www.google.com/maps/place/49.4667,-117.483301",7977,"Rural",920,389,"Yes","No","No","No ","Bonnington Falls","FALSE","FALSE"]
[null,7978,"Krestova","Yes","Yes","Yes","Regional District of Central Kootenay","Kootenay",{"$nulls":8},"","","",null,0,0,null,null,{"$f":"IF(AB85=\"Y\",COUNT(#REF!), \"\")","v":""},null,"Krestova","N",{"v":49.444738,"d":"49.44474"},{"v":-117.582166,"d":"-117.58217"},"http://www.google.com/maps/place/49.444738,-117.582166",7978,"Rural",1520,723,"Yes","No","Yes","No ","Krestova","FALSE","FALSE"]
[null,7979,"Taghum","Yes","Yes","Yes","Regional District of Central Kootenay","Kootenay",{"$nulls":8},"","","",null,0,0,null,null,{"$f":"IF(AB86=\"Y\",COUNT(#REF!), \"\")","v":""},null,"Taghum","N",{"v":49.493387,"d":"49.49339"},{"v":-117.398939,"d":"-117.39894"},"http://www.google.com/maps/place/49.493387,-117.398939",7979,"Rural",864,415,"Yes","No","Yes","No ","Taghum","FALSE","FALSE"]
[null,7980,"Brilliant","Yes","Yes","Yes","Regional District of Central Kootenay","Kootenay",{"$nulls":8},"","","",null,0,0,null,null,{"$f":"IF(AB87=\"Y\",COUNT(#REF!), \"\")","v":""},null,"Brilliant","N",{"v":49.321727,"d":"49.32173"},{"v":-117.643053,"d":"-117.64305"},"http://www.google.com/maps/place/49.321727,-117.643053",7980,"Rural",2797,1298,"Yes","No","No","No ","Brilliant","FALSE","FALSE"]
[null,7981,"Glenmerry","Yes","Yes","Yes","Regional District of Kootenay Boundary","Kootenay",{"$nulls":8},"","","",null,0,0,null,null,{"$f":"IF(AB88=\"Y\",COUNT(#REF!), \"\")","v":""},null,"Glenmerry","N",{"v":49.100001,"d":"49.10000"},{"v":-117.666699,"d":"-117.66670"},"http://www.google.com/maps/place/49.100001,-117.666699",7981,"Rural",3165,1475,"Yes","No","Yes","No ","Glenmerry","FALSE","FALSE"]
[null,7982,"Sunningdale","Yes","Yes","Yes","Regional District of Kootenay Boundary","Kootenay",{"$nulls":8},"","","",null,0,0,null,null,{"$f":"IF(AB89=\"Y\",COUNT(#REF!), \"\")","v":""},null,"Sunningdale","N",{"v":49.1167,"d":"49.11670"},{"v":-117.716699,"d":"-117.71670"},"http://www.google.com/maps/place/49.1167,-117.716699",7982,"Rural",3165,1475,"Yes","No","No","No ","Sunningdale","FALSE","FALSE"]
[null,7983,"Park Siding","No","Yes","No","Regional District of Kootenay Boundary","Kootenay",{"$nulls":8},"","","",null,0,0,null,null,{"$f":"IF(AB90=\"Y\",COUNT(#REF!), \"\")","v":""},null,"Park Siding","N",{"v":49.172462,"d":"49.17246"},{"v":-117.493484,"d":"-117.49348"},"http://www.google.com/maps/place/49.172462,-117.493484",7983,"Rural",165,71,"No","No","Yes","No ","Park Siding","FALSE","FALSE"]
[null,7984,"Christina Lake","Yes","Yes","Yes","Regional District of Kootenay Boundary","Kootenay",{"$nulls":8},"","","",null,0,0,null,null,{"$f":"IF(AB91=\"Y\",COUNT(#REF!), \"\")","v":""},null,"Christina Lake","N",{"v":49.039151,"d":"49.03915"},{"v":-118.215917,"d":"-118.21592"},"http://www.google.com/maps/place/49.039151,-118.215917",7984,"Rural",1035,788,"Yes","No","No","No ","Christina Lake","FALSE","FALSE"]
[null,7985,"Grand Forks","Yes","Yes","Yes","Regional District of Kootenay Boundary","Kootenay",{"$nulls":8},"","","",null,0,0,null,null,{"$f":"IF(AB92=\"Y\",COUNT(#REF!), \"\")","v":""},null,"Grand Forks","N",{"v":49.029024,"d":"49.02902"},{"v":-118.453272,"d":"-118.45327"},"http://www.google.com/maps/place/49.029024,-118.453272",7985,"Rural",4259,1992,"Yes","No","Yes","No ","Grand Forks","FALSE","FALSE"]
[null,7986,"Sion","Yes","Yes","Yes","Regional District of Kootenay Boundary","Kootenay",{"$nulls":8},"","","",null,0,0,null,null,{"$f":"IF(AB93=\"Y\",COUNT(#REF!), \"\")","v":""},null,"Sion","N",{"v":49.020682,"d":"49.02068"},{"v":-118.483838,"d":"-118.48384"},"http://www.google.com/maps/place/49.020682,-118.483838",7986,"Rural",804,379,"Yes","No","Yes","No ","Sion","FALSE","FALSE"]
[null,7987,"Niagara","No","No","No","Regional District of Kootenay Boundary","Kootenay",{"$nulls":8},"","","",null,0,0,null,null,{"$f":"IF(AB94=\"Y\",COUNT(#REF!), \"\")","v":""},null,"Niagara","N",{"v":49.107056,"d":"49.10706"},-118.46584,"http://www.google.com/maps/place/49.107056,-118.46584",7987,"Rural",202,88,"No","Yes","No","No ","Niagara","FALSE","FALSE"]
[null,7988,"Greenwood","Yes","Yes","Yes","Regional District of Kootenay Boundary","Kootenay",{"$nulls":8},"","","",null,0,0,null,null,{"$f":"IF(AB95=\"Y\",COUNT(#REF!), \"\")","v":""},null,"Greenwood","N",{"v":49.0949,"d":"49.09490"},{"v":-118.676274,"d":"-118.67627"},"http://www.google.com/maps/place/49.0949,-118.676274",7988,"Rural",529,335,"Yes","No","Yes","No ","Greenwood","FALSE","FALSE"]
[null,7989,"Midway","Yes","Yes","Yes","Regional District of Kootenay Boundary","Kootenay",{"$nulls":8},"","","",null,0,0,null,null,{"$f":"IF(AB96=\"Y\",COUNT(#REF!), \"\")","v":""},null,"Midway","N",{"v":49.007136,"d":"49.00714"},{"v":-118.773048,"d":"-118.77305"},"http://www.google.com/maps/place/49.007136,-118.773048",7989,"Rural",654,325,"Yes","No","Yes","No ","Midway","FALSE","FALSE"]
[null,7990,"Rock Creek","No","No","Yes","Regional District of Kootenay Boundary","Kootenay",{"$nulls":8},"","","",null,0,0,null,null,{"$f":"IF(AB97=\"Y\",COUNT(#REF!), \"\")","v":""},null,"Rock Creek","N",{"v":49.059618,"d":"49.05962"},{"v":-118.999025,"d":"-118.99903"},"http://www.google.com/maps/place/49.059618,-118.999025",7990,"Rural",193,106,"No","Yes","Yes","No ","Rock Creek","FALSE","FALSE"]
[null,7991,{"$f":"HYPERLINK(AE98,AN98)","v":"Bridesville"},"No","No","Yes","Regional District of Kootenay Boundary","Kootenay",{"$nulls":8},{"$f":"IF(L98=\"\",\"\",\nIF(SUM((J98*L98)/M98)<=N98,\"Sufficient Capacity\",\nIF(SUM((J98*L98)/M98)>N98,\"Not Enough Capacity\",\"Error\")))","v":""},{"$f":"IF(OR(ISBLANK(J98),ISBLANK(L98),ISBLANK(M98)), \"\",(J98*L98/M98))","v":""},{"$f":"IF(AND(COUNT(N98,R98)=2, OR($O$10=\"Last-Mile\", $O$10=\"Transport & Last-Mile\")), N98-R98, \"\")","v":""},null,{"$f":"IF(AND(AB98=\"Y\",I98<>\"\"),1,0)","v":0},{"$f":"IF(AND(AB98=\"Y\",I98=\"Last-Mile & Transport\"),1,0)","v":0},null,null,{"$f":"IF(AB98=\"Y\",COUNT(#REF!), \"\")","v":""},null,"Bridesville","N",49.03578,{"v":-119.142375,"d":"-119.14238"},"http://www.google.com/maps/place/49.03578,-119.142375",7991,"Rural",63,45,"No","Yes","Yes","No ",{"$f":"IF(AB98=\"Y\", CONCATENATE(AA98,\"*\"), AA98)","v":"Bridesville"},{"$f":"IF(I98=\"Last-Mile\",\"TRUE\",IF(I98=\"Transport & Last-Mile\",\"TRUE\",\"FALSE\"))","v":"FALSE"},{"$f":"IF(I98=\"Transport\",\"TRUE\",IF(I98=\"Transport & Last-Mile\",\"TRUE\",\"FALSE\"))","v":"FALSE"}]
[null,7992,"Mount Baldy","No","Yes","Yes","Regional District of Kootenay Boundary","Kootenay",{"$nulls":8},"","","",null,0,0,null,null,{"$f":"IF(AB99=\"Y\",COUNT(#REF!), \"\")","v":""},null,"Mount Baldy","N",{"v":49.152222,"d":"49.15222"},{"v":-119.237499,"d":"-119.23750"},"http://www.google.com/maps/place/49.152222,-119.237499",7992,"Rural",24,123,"No","Yes","No","No ","Mount Baldy","FALSE","FALSE"]
[null,7993,"Osoyoos","Yes","Yes","Yes","Regional District of Okanagan-Similkameen","Thompson--Okanagan",{"$nulls":8},"","","",null,0,0,null,null,{"$f":"IF(AB100=\"Y\",COUNT(#REF!), \"\")","v":""},null,"Osoyoos","N",{"v":49.031096,"d":"49.03110"},{"v":-119.464802,"d":"-119.46480"},"http://www.google.com/maps/place/49.031096,-119.464802",7993,"Rural",4370,2282,"Yes","No","Yes","No ","Osoyoos","FALSE","FALSE"]
[null,7995,"Cawston","No","Yes","Yes","Regional District of Okanagan-Similkameen","Thompson--Okanagan",{"$nulls":8},"","","",null,0,0,null,null,{"$f":"IF(AB101=\"Y\",COUNT(#REF!), \"\")","v":""},null,"Cawston","N",{"v":49.180181,"d":"49.18018"},{"v":-119.763751,"d":"-119.76375"},"http://www.google.com/maps/place/49.180181,-119.763751",7995,"Rural",858,390,"No","Yes","No","No ","Cawston","FALSE","FALSE"]
[null,7996,"Oliver","Yes","Yes","Yes","Regional District of Okanagan-Similkameen","Thompson--Okanagan",{"$nulls":8},"","","",null,0,0,null,null,{"$f":"IF(AB102=\"Y\",COUNT(#REF!), \"\")","v":""},null,"Oliver","N",{"v":49.182583,"d":"49.18258"},{"v":-119.552692,"d":"-119.55269"},"http://www.google.com/maps/place/49.182583,-119.552692",7996,"Rural",5824,2714,"Yes","No","Yes","No ","Oliver","FALSE","FALSE"]
[null,7997,"Willowbrook","Yes","Yes","No","Regional District of Okanagan-Similkameen","Thompson--Okanagan",{"$nulls":8},"","","",null,0,0,null,null,{"$f":"IF(AB103=\"Y\",COUNT(#REF!), \"\")","v":""},null,"Willowbrook","N",{"v":49.260719,"d":"49.26072"},{"v":-119.593518,"d":"-119.59352"},"http://www.google.com/maps/place/49.260719,-119.593518",7997,"Rural",240,111,"No","Yes","No","No ","Willowbrook","FALSE","FALSE"]
[null,7998,"Keremeos","Yes","Yes","Yes","Regional District of Okanagan-Similkameen","Thompson--Okanagan",{"$nulls":8},"","","",null,0,0,null,null,{"$f":"IF(AB104=\"Y\",COUNT(#REF!), \"\")","v":""},null,"Keremeos","N",{"v":49.206431,"d":"49.20643"},{"v":-119.826386,"d":"-119.82639"},"http://www.google.com/maps/place/49.206431,-119.826386",7998,"Rural",1805,941,"No","Yes","Yes","No ","Keremeos","FALSE","FALSE"]
[null,7999,"Hedley","No","Yes","Yes","Regional District of Okanagan-Similkameen","Thompson--Okanagan",{"$nulls":8},"","","",null,0,0,null,null,{"$f":"IF(AB105=\"Y\",COUNT(#REF!), \"\")","v":""},null,"Hedley","N",{"v":49.360365,"d":"49.36037"},{"v":-120.071775,"d":"-120.07178"},"http://www.google.com/maps/place/49.360365,-120.071775",7999,"Rural",53,31,"No","Yes","No","No ","Hedley","FALSE","FALSE"]
[null,8000,"Apex Mountain","No","Yes","Yes","Regional District of Okanagan-Similkameen","Thompson--Okanagan",{"$nulls":8},"","","",null,0,0,null,null,{"$f":"IF(AB106=\"Y\",COUNT(#REF!), \"\")","v":""},null,"Apex Mountain","N",49.39418,{"v":-119.907218,"d":"-119.90722"},"http://www.google.com/maps/place/49.39418,-119.907218",8000,"Rural",102,507,"No","Yes","No","No ","Apex Mountain","FALSE","FALSE"]
[null,8001,"Penticton","Yes","Yes","Yes","Regional District of Okanagan-Similkameen","Thompson--Okanagan",{"$nulls":8},"","","",null,0,0,null,null,{"$f":"IF(AB107=\"Y\",COUNT(#REF!), \"\")","v":""},null,"Penticton","N",{"v":49.482156,"d":"49.48216"},{"v":-119.584947,"d":"-119.58495"},"http://www.google.com/maps/place/49.482156,-119.584947",8001,"Urban",18171,9566,"Yes","No","Yes","No ","Penticton","FALSE","FALSE"]
[null,8002,"Kaleden","Yes","Yes","Yes","Regional District of Okanagan-Similkameen","Thompson--Okanagan",{"$nulls":8},"","","",null,0,0,null,null,{"$f":"IF(AB108=\"Y\",COUNT(#REF!), \"\")","v":""},null,"Kaleden","N",{"v":49.392767,"d":"49.39277"},{"v":-119.595861,"d":"-119.59586"},"http://www.google.com/maps/place/49.392767,-119.595861",8002,"Rural",1205,529,"Yes","No","Yes","No ","Kaleden","FALSE","FALSE"]
[null,8004,"Kimberley","Yes","Yes","Yes","Regional District of East Kootenay","Kootenay",{"$nulls":8},"","","",null,0,0,null,null,{"$f":"IF(AB109=\"Y\",COUNT(#REF!), \"\")","v":""},null,"Kimberley","N",{"v":49.687103,"d":"49.68710"},{"v":-115.982918,"d":"-115.98292"},"http://www.google.com/maps/place/49.687103,-115.982918",8004,"Rural",4396,2393,"Yes","No","Yes","No ","Kimberley","FALSE","FALSE"]
[null,8005,"Wycliffe","No","No","Yes","Regional District of East Kootenay","Kootenay",{"$nulls":8},"","","",null,0,0,null,null,{"$f":"IF(AB110=\"Y\",COUNT(#REF!), \"\")","v":""},null,"Wycliffe","N",{"v":49.601326,"d":"49.60133"},{"v":-115.860707,"d":"-115.86071"},"http://www.google.com/maps/place/49.601326,-115.860707",8005,"Rural",396,158,"No","No","Yes","No ","Wycliffe","FALSE","FALSE"]
[null,8006,"Fort Steele","No","No","Yes","Regional District of East Kootenay","Kootenay",{"$nulls":8},"","","",null,0,0,null,null,{"$f":"IF(AB111=\"Y\",COUNT(#REF!), \"\")","v":""},null,"Fort Steele","N",49.61694,{"v":-115.625518,"d":"-115.62552"},"http://www.google.com/maps/place/49.61694,-115.625518",8006,"Rural",95,44,"No","Yes","Yes","No ","Fort Steele","FALSE","FALSE"]
[null,8007,"St. Mary's*","No","No","Yes","Regional District of East Kootenay","Kootenay",{"$nulls":8},"","","",null,0,0,null,null,{"$f":"IF(AB112=\"Y\",COUNT(#REF!), \"\")","v":0},null,"St. Mary's","Y",49.62032,{"v":-115.696089,"d":"-115.69609"},"http://www.google.com/maps/place/49.62032,-115.696089",8007,"Rural First Nations Primary Reserve",128,46,"No","Yes","No","No ","St. Mary's*","FALSE","FALSE"]
[null,8008,"Marysville","Yes","Yes","Yes","Regional District of East Kootenay","Kootenay",{"$nulls":8},"","","",null,0,0,null,null,{"$f":"IF(AB113=\"Y\",COUNT(#REF!), \"\")","v":""},null,"Marysville","N",{"v":49.637257,"d":"49.63726"},{"v":-115.9559,"d":"-115.95590"},"http://www.google.com/maps/place/49.637257,-115.9559",8008,"Rural",967,456,"Yes","No","No","No ","Marysville","FALSE","FALSE"]
[null,8009,"Wasa","Yes","Yes","Yes","Regional District of East Kootenay","Kootenay",{"$nulls":8},"","","",null,0,0,null,null,{"$f":"IF(AB114=\"Y\",COUNT(#REF!), \"\")","v":""},null,"Wasa","N",{"v":49.7833,"d":"49.78330"},{"v":-115.733301,"d":"-115.73330"},"http://www.google.com/maps/place/49.7833,-115.733301",8009,"Rural",307,360,"Yes","No","No","No ","Wasa","FALSE","FALSE"]
[null,8010,"Canal Flats","Yes","Yes","Yes","Regional District of East Kootenay","Kootenay",{"$nulls":8},"","","",null,0,0,null,null,{"$f":"IF(AB115=\"Y\",COUNT(#REF!), \"\")","v":""},null,"Canal Flats","N",{"v":50.157583,"d":"50.15758"},{"v":-115.816855,"d":"-115.81686"},"http://www.google.com/maps/place/50.157583,-115.816855",8010,"Rural",520,294,"Yes","No","No","No ","Canal Flats","FALSE","FALSE"]
[null,8011,"Kaslo","Yes","Yes","Yes","Regional District of Central Kootenay","Kootenay",{"$nulls":8},"","","",null,0,0,null,null,{"$f":"IF(AB116=\"Y\",COUNT(#REF!), \"\")","v":""},null,"Kaslo","N",{"v":49.908588,"d":"49.90859"},-116.91121,"http://www.google.com/maps/place/49.908588,-116.91121",8011,"Rural",1260,749,"No","No","No","No ","Kaslo","FALSE","FALSE"]
[null,8012,"Fairmont Hot Springs","Yes","Yes","Yes","Regional District of East Kootenay","Kootenay",{"$nulls":8},"","","",null,0,0,null,null,{"$f":"IF(AB117=\"Y\",COUNT(#REF!), \"\")","v":""},null,"Fairmont Hot Springs","N",{"v":50.334924,"d":"50.33492"},{"v":-115.856472,"d":"-115.85647"},"http://www.google.com/maps/place/50.334924,-115.856472",8012,"Rural",628,751,"Yes","No","No","No ","Fairmont Hot Springs","FALSE","FALSE"]
[null,8013,"?Akisq'nuk*","No","Yes","Yes","Regional District of East Kootenay","Kootenay",{"$nulls":8},"","","",null,0,0,null,null,{"$f":"IF(AB118=\"Y\",COUNT(#REF!), \"\")","v":0},null,"?Akisq'nuk","Y",{"v":50.451202,"d":"50.45120"},{"v":-115.959718,"d":"-115.95972"},"http://www.google.com/maps/place/50.451202,-115.959718",8013,"Rural First Nations Secondary Reserve",105,58,"No","No","Yes","No ","?Akisq'nuk*","FALSE","FALSE"]
[null,8014,"Windermere","Yes","Yes","Yes","Regional District of East Kootenay","Kootenay",{"$nulls":8},"","","",null,0,0,null,null,{"$f":"IF(AB119=\"Y\",COUNT(#REF!), \"\")","v":""},null,"Windermere","N",{"v":50.4667,"d":"50.46670"},{"v":-115.983299,"d":"-115.98330"},"http://www.google.com/maps/place/50.4667,-115.983299",8014,"Rural",1071,1722,"Yes","No","Yes","No ","Windermere","FALSE","FALSE"]
[null,8015,"Invermere","Yes","Yes","Yes","Regional District of East Kootenay","Kootenay",{"$nulls":8},"","","",null,0,0,null,null,{"$f":"IF(AB120=\"Y\",COUNT(#REF!), \"\")","v":""},null,"Invermere","N",{"v":50.5007,"d":"50.50070"},{"v":-116.038191,"d":"-116.03819"},"http://www.google.com/maps/place/50.5007,-116.038191",8015,"Rural",3256,1740,"Yes","No","Yes","No ","Invermere","FALSE","FALSE"]
[null,8017,"Wilmer","Yes","Yes","Yes","Regional District of East Kootenay","Kootenay",{"$nulls":8},"","","",null,0,0,null,null,{"$f":"IF(AB121=\"Y\",COUNT(#REF!), \"\")","v":""},null,"Wilmer","N",{"v":50.542552,"d":"50.54255"},{"v":-116.063447,"d":"-116.06345"},"http://www.google.com/maps/place/50.542552,-116.063447",8017,"Rural",415,196,"Yes","No","No","No ","Wilmer","FALSE","FALSE"]
[null,8018,"Panorama","No","Yes","Yes","Regional District of East Kootenay","Kootenay",{"$nulls":8},"","","",null,0,0,null,null,{"$f":"IF(AB122=\"Y\",COUNT(#REF!), \"\")","v":""},null,"Panorama","N",{"v":50.458333,"d":"50.45833"},{"v":-116.2375,"d":"-116.23750"},"http://www.google.com/maps/place/50.458333,-116.2375",8018,"Rural",128,82,"No","Yes","Yes","No ","Panorama","FALSE","FALSE"]
[null,8019,"Radium Hot Springs","Yes","Yes","Yes","Regional District of East Kootenay","Kootenay",{"$nulls":8},"","","",null,0,0,null,null,{"$f":"IF(AB123=\"Y\",COUNT(#REF!), \"\")","v":""},null,"Radium Hot Springs","N",{"v":50.623004,"d":"50.62300"},{"v":-116.080487,"d":"-116.08049"},"http://www.google.com/maps/place/50.623004,-116.080487",8019,"Rural",917,996,"Yes","No","Yes","No ","Radium Hot Springs","FALSE","FALSE"]
[null,8020,"Edgewater","No","Yes","Yes","Regional District of East Kootenay","Kootenay",{"$nulls":8},"","","",null,0,0,null,null,{"$f":"IF(AB124=\"Y\",COUNT(#REF!), \"\")","v":""},null,"Edgewater","N",{"v":50.699999,"d":"50.70000"},{"v":-116.133301,"d":"-116.13330"},"http://www.google.com/maps/place/50.699999,-116.133301",8020,"Rural",622,297,"No","Yes","No","No ","Edgewater","FALSE","FALSE"]
[null,8021,"Meadow Creek","No","Yes","No","Regional District of Central Kootenay","Kootenay",{"$nulls":8},"","","",null,0,0,null,null,{"$f":"IF(AB125=\"Y\",COUNT(#REF!), \"\")","v":""},null,"Meadow Creek","N",{"v":50.239199,"d":"50.23920"},-116.97254,"http://www.google.com/maps/place/50.239199,-116.97254",8021,"Rural",159,117,"No","Yes","Yes","No ","Meadow Creek","FALSE","FALSE"]
[null,8022,"Cooper Creek","No","Yes","No","Regional District of Central Kootenay","Kootenay",{"$nulls":8},"","","",null,0,0,null,null,{"$f":"IF(AB126=\"Y\",COUNT(#REF!), \"\")","v":""},null,"Cooper Creek","N",50.20229,{"v":-116.962878,"d":"-116.96288"},"http://www.google.com/maps/place/50.20229,-116.962878",8022,"Rural",159,117,"No","Yes","No","No ","Cooper Creek","FALSE","FALSE"]
[null,8023,"Lardeau","Yes","Yes","No","Regional District of Central Kootenay","Kootenay",{"$nulls":8},"","","",null,0,0,null,null,{"$f":"IF(AB127=\"Y\",COUNT(#REF!), \"\")","v":""},null,"Lardeau","N",{"v":50.143019,"d":"50.14302"},{"v":-116.955941,"d":"-116.95594"},"http://www.google.com/maps/place/50.143019,-116.955941",8023,"Rural",35,52,"Yes","No","No","No ","Lardeau","FALSE","FALSE"]
[null,8024,"Hills","No","No","Yes","Regional District of Central Kootenay","Kootenay",{"$nulls":8},"","","",null,0,0,null,null,{"$f":"IF(AB128=\"Y\",COUNT(#REF!), \"\")","v":""},null,"Hills","N",{"v":50.108881,"d":"50.10888"},{"v":-117.493321,"d":"-117.49332"},"http://www.google.com/maps/place/50.108881,-117.493321",8024,"Rural",14,10,"No","Yes","No","No ","Hills","FALSE","FALSE"]
[null,8025,"Burton","No","No","Yes","Regional District of Central Kootenay","Kootenay",{"$nulls":8},"","","",null,0,0,null,null,{"$f":"IF(AB129=\"Y\",COUNT(#REF!), \"\")","v":""},null,"Burton","N",{"v":49.985595,"d":"49.98560"},{"v":-117.880137,"d":"-117.88014"},"http://www.google.com/maps/place/49.985595,-117.880137",8025,"Rural",180,139,"No","Yes","No","No ","Burton","FALSE","FALSE"]
[null,8026,"Nakusp","Yes","Yes","Yes","Regional District of Central Kootenay","Kootenay",{"$nulls":8},"","","",null,0,0,null,null,{"$f":"IF(AB130=\"Y\",COUNT(#REF!), \"\")","v":""},null,"Nakusp","N",{"v":50.241827,"d":"50.24183"},{"v":-117.799072,"d":"-117.79907"},"http://www.google.com/maps/place/50.241827,-117.799072",8026,"Rural",1470,722,"No","Yes","No","No ","Nakusp","FALSE","FALSE"]
[null,8027,"Fauquier","No","Yes","Yes","Regional District of Central Kootenay","Kootenay",{"$nulls":8},"","","",null,0,0,null,null,{"$f":"IF(AB131=\"Y\",COUNT(#REF!), \"\")","v":""},null,"Fauquier","N",{"v":49.8667,"d":"49.86670"},{"v":-118.066699,"d":"-118.06670"},"http://www.google.com/maps/place/49.8667,-118.066699",8027,"Rural",15,13,"No","Yes","No","No ","Fauquier","FALSE","FALSE"]
[null,8028,"Edgewood","No","Yes","Yes","Regional District of Central Kootenay","Kootenay",{"$nulls":8},"","","",null,0,0,null,null,{"$f":"IF(AB132=\"Y\",COUNT(#REF!), \"\")","v":""},null,"Edgewood","N",{"v":49.783301,"d":"49.78330"},{"v":-118.15,"d":"-118.15000"},"http://www.google.com/maps/place/49.783301,-118.15",8028,"Rural",247,158,"No","Yes","No","No ","Edgewood","FALSE","FALSE"]
[null,8029,"Kuskonook","No","No","Yes","Regional District of Central Kootenay","Kootenay",{"$nulls":8},"","","",null,0,0,null,null,{"$f":"IF(AB133=\"Y\",COUNT(#REF!), \"\")","v":""},null,"Kuskonook","N",{"v":49.3,"d":"49.30000"},{"v":-116.650001,"d":"-116.65000"},"http://www.google.com/maps/place/49.3,-116.650001",8029,"Rural",10,14,"No","Yes","Yes","No ","Kuskonook","FALSE","FALSE"]
[null,8030,"Sanca","No","Yes","No","Regional District of Central Kootenay","Kootenay",{"$nulls":8},"","","",null,0,0,null,null,{"$f":"IF(AB134=\"Y\",COUNT(#REF!), \"\")","v":""},null,"Sanca","N",{"v":49.391667,"d":"49.39167"},{"v":-116.735,"d":"-116.73500"},"http://www.google.com/maps/place/49.391667,-116.735",8030,"Rural",22,38,"No","Yes","No","No ","Sanca","FALSE","FALSE"]
[null,8031,"Boswell","No","Yes","Yes","Regional District of Central Kootenay","Kootenay",{"$nulls":8},"","","",null,0,0,null,null,{"$f":"IF(AB135=\"Y\",COUNT(#REF!), \"\")","v":""},null,"Boswell","N",{"v":49.450303,"d":"49.45030"},{"v":-116.763762,"d":"-116.76376"},"http://www.google.com/maps/place/49.450303,-116.763762",8031,"Rural",89,112,"No","Yes","No","No ","Boswell","FALSE","FALSE"]
[null,8032,"Nelway","No","Yes","No","Regional District of Central Kootenay","Kootenay",{"$nulls":8},"","","",null,0,0,null,null,{"$f":"IF(AB136=\"Y\",COUNT(#REF!), \"\")","v":""},null,"Nelway","N",49.01466,{"v":-117.272979,"d":"-117.27298"},"http://www.google.com/maps/place/49.01466,-117.272979",8032,"Rural",35,19,"No","Yes","No","No ","Nelway","FALSE","FALSE"]
[null,8033,"Paterson","No","No","No","Regional District of Kootenay Boundary","Kootenay",{"$nulls":8},"","","",null,0,0,null,null,{"$f":"IF(AB137=\"Y\",COUNT(#REF!), \"\")","v":""},null,"Paterson","N",49.00668,-117.83111,"http://www.google.com/maps/place/49.00668,-117.83111",8033,"Rural",21,11,"No","Yes","Yes","No ","Paterson","FALSE","FALSE"]
[null,8034,"Cascade","No","Yes","Yes","Regional District of Kootenay Boundary","Kootenay",{"$nulls":8},"","","",null,0,0,null,null,{"$f":"IF(AB138=\"Y\",COUNT(#REF!), \"\")","v":""},null,"Cascade","N",{"v":49.018675,"d":"49.01868"},{"v":-118.207069,"d":"-118.20707"},"http://www.google.com/maps/place/49.018675,-118.207069",8034,"Rural",123,68,"No","Yes","No","No ","Cascade","FALSE","FALSE"]
[null,8035,"Gilpin","No","No","Yes","Regional District of Kootenay Boundary","Kootenay",{"$nulls":8},"","","",null,0,0,null,null,{"$f":"IF(AB139=\"Y\",COUNT(#REF!), \"\")","v":""},null,"Gilpin","N",{"v":49.006334,"d":"49.00633"},{"v":-118.328575,"d":"-118.32858"},"http://www.google.com/maps/place/49.006334,-118.328575",8035,"Rural",64,25,"Yes","No","No","No ","Gilpin","FALSE","FALSE"]
[null,8036,"Kettle Valley","No","Yes","Yes","Regional District of Kootenay Boundary","Kootenay",{"$nulls":8},"","","",null,0,0,null,null,{"$f":"IF(AB140=\"Y\",COUNT(#REF!), \"\")","v":""},null,"Kettle Valley","N",{"v":49.053622,"d":"49.05362"},{"v":-118.944897,"d":"-118.94490"},"http://www.google.com/maps/place/49.053622,-118.944897",8036,"Rural",233,120,"No","Yes","Yes","No ","Kettle Valley","FALSE","FALSE"]
[null,8037,"Okanagan Falls","Yes","Yes","Yes","Regional District of Okanagan-Similkameen","Thompson--Okanagan",{"$nulls":8},"","","",null,0,0,null,null,{"$f":"IF(AB141=\"Y\",COUNT(#REF!), \"\")","v":""},null,"Okanagan Falls","N",{"v":49.342811,"d":"49.34281"},{"v":-119.571233,"d":"-119.57123"},"http://www.google.com/maps/place/49.342811,-119.571233",8037,"Rural",2732,1518,"Yes","No","Yes","No ","Okanagan Falls","FALSE","FALSE"]
[null,8038,"Olalla","No","Yes","Yes","Regional District of Okanagan-Similkameen","Thompson--Okanagan",{"$nulls":8},"","","",null,0,0,null,null,{"$f":"IF(AB142=\"Y\",COUNT(#REF!), \"\")","v":""},null,"Olalla","N",{"v":49.263407,"d":"49.26341"},{"v":-119.829031,"d":"-119.82903"},"http://www.google.com/maps/place/49.263407,-119.829031",8038,"Rural",383,243,"No","Yes","Yes","No ","Olalla","FALSE","FALSE"]
[null,8039,"Princeton","Yes","Yes","Yes","Regional District of Okanagan-Similkameen","Thompson--Okanagan",{"$nulls":8},"","","",null,0,0,null,null,{"$f":"IF(AB143=\"Y\",COUNT(#REF!), \"\")","v":""},null,"Princeton","N",{"v":49.4524,"d":"49.45240"},-120.51419,"http://www.google.com/maps/place/49.4524,-120.51419",8039,"Rural",2832,1553,"Yes","No","Yes","No ","Princeton","FALSE","FALSE"]
[null,8040,"Manning Park","No","Yes","No","Regional District of Okanagan-Similkameen","Thompson--Okanagan",{"$nulls":8},"","","",null,0,0,null,null,{"$f":"IF(AB144=\"Y\",COUNT(#REF!), \"\")","v":""},null,"Manning Park","N",{"v":49.066795,"d":"49.06680"},-120.78156,"http://www.google.com/maps/place/49.066795,-120.78156",8040,"Rural",25,36,"No","Yes","No","No ","Manning Park","FALSE","FALSE"]
[null,8041,"Eastgate","No","No","Yes","Regional District of Okanagan-Similkameen","Thompson--Okanagan",{"$nulls":8},"","","",null,0,0,null,null,{"$f":"IF(AB145=\"Y\",COUNT(#REF!), \"\")","v":""},null,"Eastgate","N",{"v":49.1375,"d":"49.13750"},{"v":-120.612501,"d":"-120.61250"},"http://www.google.com/maps/place/49.1375,-120.612501",8041,"Rural",72,134,"No","Yes","No","No ","Eastgate","FALSE","FALSE"]
[null,8042,"Sunshine Valley","Yes","Yes","Yes","Fraser Valley Regional District","Lower Mainland--Southwest",{"$nulls":8},"","","",null,0,0,null,null,{"$f":"IF(AB146=\"Y\",COUNT(#REF!), \"\")","v":""},null,"Sunshine Valley","N",49.27272,{"v":-121.238805,"d":"-121.23881"},"http://www.google.com/maps/place/49.27272,-121.238805",8042,"Rural",166,335,"No","No","No","No ","Sunshine Valley","FALSE","FALSE"]
[null,8043,"Hemlock Valley","No","Yes","Yes","Fraser Valley Regional District","Lower Mainland--Southwest",{"$nulls":8},"","","",null,0,0,null,null,{"$f":"IF(AB147=\"Y\",COUNT(#REF!), \"\")","v":""},null,"Hemlock Valley","N",{"v":49.376944,"d":"49.37694"},{"v":-121.935277,"d":"-121.93528"},"http://www.google.com/maps/place/49.376944,-121.935277",8043,"Rural",48,182,"No","Yes","No","No ","Hemlock Valley","FALSE","FALSE"]
[null,8044,"Hope","Yes","Yes","Yes","Fraser Valley Regional District","Lower Mainland--Southwest",{"$nulls":8},"","","",null,0,0,null,null,{"$f":"IF(AB148=\"Y\",COUNT(#REF!), \"\")","v":""},null,"Hope","N",{"v":49.380213,"d":"49.38021"},{"v":-121.429856,"d":"-121.42986"},"http://www.google.com/maps/place/49.380213,-121.429856",8044,"Rural",4718,2360,"Yes","No","Yes","No ","Hope","FALSE","FALSE"]
[null,8045,"Laidlaw","No","Yes","Yes","Fraser Valley Regional District","Lower Mainland--Southwest",{"$nulls":8},"","","",null,0,0,null,null,{"$f":"IF(AB149=\"Y\",COUNT(#REF!), \"\")","v":""},null,"Laidlaw","N",{"v":49.322345,"d":"49.32235"},{"v":-121.618136,"d":"-121.61814"},"http://www.google.com/maps/place/49.322345,-121.618136",8045,"Rural",142,39,"Yes","No","Yes","No ","Laidlaw","FALSE","FALSE"]
[null,8046,"Ruby Creek","No","Yes","Yes","Fraser Valley Regional District","Lower Mainland--Southwest",{"$nulls":8},"","","",null,0,0,null,null,{"$f":"IF(AB150=\"Y\",COUNT(#REF!), \"\")","v":""},null,"Ruby Creek","N",49.34684,{"v":-121.596578,"d":"-121.59658"},"http://www.google.com/maps/place/49.34684,-121.596578",8046,"Rural",217,88,"No","No","Yes","No ","Ruby Creek","FALSE","FALSE"]
[null,8047,"Harrison Hot Springs","Yes","Yes","Yes","Fraser Valley Regional District","Lower Mainland--Southwest",{"$nulls":8},"","","",null,0,0,null,null,{"$f":"IF(AB151=\"Y\",COUNT(#REF!), \"\")","v":""},null,"Harrison Hot Springs","N",{"v":49.3,"d":"49.30000"},{"v":-121.783301,"d":"-121.78330"},"http://www.google.com/maps/place/49.3,-121.783301",8047,"Rural",1681,1000,"Yes","No","Yes","No ","Harrison Hot Springs","FALSE","FALSE"]
[null,8048,"Silver Creek","Yes","Yes","Yes","Fraser Valley Regional District","Lower Mainland--Southwest",{"$nulls":8},"","","",null,0,0,null,null,{"$f":"IF(AB152=\"Y\",COUNT(#REF!), \"\")","v":""},null,"Silver Creek","N",{"v":49.363362,"d":"49.36336"},{"v":-121.455623,"d":"-121.45562"},"http://www.google.com/maps/place/49.363362,-121.455623",8048,"Rural",1206,612,"Yes","No","No","No ","Silver Creek","FALSE","FALSE"]
[null,8049,"Haig*","Yes","Yes","Yes","Fraser Valley Regional District","Lower Mainland--Southwest",{"$nulls":8},"","","",null,0,0,null,null,{"$f":"IF(AB153=\"Y\",COUNT(#REF!), \"\")","v":0},null,"Haig","Y",{"v":49.396721,"d":"49.39672"},-121.45304,"http://www.google.com/maps/place/49.396721,-121.45304",8049,"Rural First Nations Secondary Reserve",201,89,"Yes","No","Yes","No ","Haig*","FALSE","FALSE"]
[null,8050,"Agassiz","Yes","Yes","Yes","Fraser Valley Regional District","Lower Mainland--Southwest",{"$nulls":8},"","","",null,0,0,null,null,{"$f":"IF(AB154=\"Y\",COUNT(#REF!), \"\")","v":""},null,"Agassiz","N",{"v":49.2333,"d":"49.23330"},{"v":-121.7667,"d":"-121.76670"},"http://www.google.com/maps/place/49.2333,-121.7667",8050,"Rural",4557,1935,"Yes","No","No","No ","Agassiz","FALSE","FALSE"]
[null,8052,"Harrison Mills","Yes","Yes","Yes","Fraser Valley Regional District","Lower Mainland--Southwest",{"$nulls":8},"","","",null,0,0,null,null,{"$f":"IF(AB155=\"Y\",COUNT(#REF!), \"\")","v":""},null,"Harrison Mills","N",{"v":49.255887,"d":"49.25589"},{"v":-121.948779,"d":"-121.94878"},"http://www.google.com/maps/place/49.255887,-121.948779",8052,"Rural",517,364,"Yes","No","Yes","No ","Harrison Mills","FALSE","FALSE"]
[null,8054,"West Popkum","Yes","Yes","Yes","Fraser Valley Regional District","Lower Mainland--Southwest",{"$nulls":8},"","","",null,0,0,null,null,{"$f":"IF(AB156=\"Y\",COUNT(#REF!), \"\")","v":""},null,"West Popkum","N",{"v":49.182155,"d":"49.18216"},{"v":-121.772678,"d":"-121.77268"},"http://www.google.com/maps/place/49.182155,-121.772678",8054,"Rural",2923,1074,"Yes","No","Yes","No ","West Popkum","FALSE","FALSE"]
[null,8055,"Popkum","Yes","Yes","Yes","Fraser Valley Regional District","Lower Mainland--Southwest",{"$nulls":8},"","","",null,0,0,null,null,{"$f":"IF(AB157=\"Y\",COUNT(#REF!), \"\")","v":""},null,"Popkum","N",49.20022,{"v":-121.736082,"d":"-121.73608"},"http://www.google.com/maps/place/49.20022,-121.736082",8055,"Rural",253,113,"No","No","No","No ","Popkum","FALSE","FALSE"]
[null,8057,"Rosedale","Yes","Yes","Yes","Fraser Valley Regional District","Lower Mainland--Southwest",{"$nulls":8},"","","",null,0,0,null,null,{"$f":"IF(AB158=\"Y\",COUNT(#REF!), \"\")","v":""},null,"Rosedale","N",{"v":49.182012,"d":"49.18201"},{"v":-121.804383,"d":"-121.80438"},"http://www.google.com/maps/place/49.182012,-121.804383",8057,"Rural",2923,1074,"Yes","No","Yes","No ","Rosedale","FALSE","FALSE"]
[null,8058,"Chilliwack","Yes","Yes","Yes","Fraser Valley Regional District","Lower Mainland--Southwest",{"$nulls":8},"","","",null,0,0,null,null,{"$f":"IF(AB159=\"Y\",COUNT(#REF!), \"\")","v":""},null,"Chilliwack","N",{"v":49.175,"d":"49.17500"},{"v":-121.941701,"d":"-121.94170"},"http://www.google.com/maps/place/49.175,-121.941701",8058,"Urban",9881,3991,"Yes","No","No","No ","Chilliwack","FALSE","FALSE"]
[null,8059,"Sardis","Yes","Yes","Yes","Fraser Valley Regional District","Lower Mainland--Southwest",{"$nulls":8},"","","",null,0,0,null,null,{"$f":"IF(AB160=\"Y\",COUNT(#REF!), \"\")","v":""},null,"Sardis","N",{"v":49.136678,"d":"49.13668"},{"v":-121.959138,"d":"-121.95914"},"http://www.google.com/maps/place/49.136678,-121.959138",8059,"Urban",27163,12788,"Yes","No","Yes","No ","Sardis","FALSE","FALSE"]
[null,8060,"Promontory","Yes","Yes","Yes","Fraser Valley Regional District","Lower Mainland--Southwest",{"$nulls":8},"","","",null,0,0,null,null,{"$f":"IF(AB161=\"Y\",COUNT(#REF!), \"\")","v":""},null,"Promontory","N",{"v":49.100616,"d":"49.10062"},{"v":-121.937262,"d":"-121.93726"},"http://www.google.com/maps/place/49.100616,-121.937262",8060,"Urban",27513,10888,"Yes","No","Yes","No ","Promontory","FALSE","FALSE"]
[null,8061,{"$f":"HYPERLINK(AE162,AN162)","v":"Cultus Lake"},"Yes","Yes","Yes","Fraser Valley Regional District","Lower Mainland--Southwest",{"$nulls":8},{"$f":"IF(L162=\"\",\"\",\nIF(SUM((J162*L162)/M162)<=N162,\"Sufficient Capacity\",\nIF(SUM((J162*L162)/M162)>N162,\"Not Enough Capacity\",\"Error\")))","v":""},{"$f":"IF(OR(ISBLANK(J162),ISBLANK(L162),ISBLANK(M162)), \"\",(J162*L162/M162))","v":""},{"$f":"IF(AND(COUNT(N162,R162)=2, OR($O$10=\"Last-Mile\", $O$10=\"Transport & Last-Mile\")), N162-R162, \"\")","v":""},null,{"$f":"IF(AND(AB162=\"Y\",I162<>\"\"),1,0)","v":0},{"$f":"IF(AND(AB162=\"Y\",I162=\"Last-Mile & Transport\"),1,0)","v":0},null,null,{"$f":"IF(AB162=\"Y\",COUNT(#REF!), \"\")","v":""},null,"Cultus Lake","N",{"v":49.071353,"d":"49.07135"},{"v":-121.966086,"d":"-121.96609"},"http://www.google.com/maps/place/49.071353,-121.966086",8061,"Rural",480,331,"Yes","No","Yes","No ",{"$f":"IF(AB162=\"Y\", CONCATENATE(AA162,\"*\"), AA162)","v":"Cultus Lake"},{"$f":"IF(I162=\"Last-Mile\",\"TRUE\",IF(I162=\"Transport & Last-Mile\",\"TRUE\",\"FALSE\"))","v":"FALSE"},{"$f":"IF(I162=\"Transport\",\"TRUE\",IF(I162=\"Transport & Last-Mile\",\"TRUE\",\"FALSE\"))","v":"FALSE"}]
[null,8062,"Vedder Crossing","Yes","Yes","Yes","Fraser Valley Regional District","Lower Mainland--Southwest",{"$nulls":8},"","","",null,0,0,null,null,{"$f":"IF(AB163=\"Y\",COUNT(#REF!), \"\")","v":""},null,"Vedder Crossing","N",{"v":49.106244,"d":"49.10624"},{"v":-121.970806,"d":"-121.97081"},"http://www.google.com/maps/place/49.106244,-121.970806",8062,"Urban",27513,10888,"Yes","No","No","No ","Vedder Crossing","FALSE","FALSE"]
[null,8064,"Lindell Beach","Yes","Yes","Yes","Fraser Valley Regional District","Lower Mainland--Southwest",{"$nulls":8},"","","",null,0,0,null,null,{"$f":"IF(AB164=\"Y\",COUNT(#REF!), \"\")","v":""},null,"Lindell Beach","N",{"v":49.033299,"d":"49.03330"},{"v":-122.0167,"d":"-122.01670"},"http://www.google.com/maps/place/49.033299,-122.0167",8064,"Rural",533,542,"Yes","No","Yes","No ","Lindell Beach","FALSE","FALSE"]
[null,8065,"Slesse Park","Yes","Yes","Yes","Fraser Valley Regional District","Lower Mainland--Southwest",{"$nulls":8},"","","",null,0,0,null,null,{"$f":"IF(AB165=\"Y\",COUNT(#REF!), \"\")","v":""},null,"Slesse Park","N",{"v":49.080512,"d":"49.08051"},{"v":-121.820607,"d":"-121.82061"},"http://www.google.com/maps/place/49.080512,-121.820607",8065,"Rural",1137,565,"No","No","Yes","No ","Slesse Park","FALSE","FALSE"]
[null,8066,"Yarrow","Yes","Yes","Yes","Fraser Valley Regional District","Lower Mainland--Southwest",{"$nulls":8},"","","",null,0,0,null,null,{"$f":"IF(AB166=\"Y\",COUNT(#REF!), \"\")","v":""},null,"Yarrow","N",{"v":49.083299,"d":"49.08330"},{"v":-122.049999,"d":"-122.05000"},"http://www.google.com/maps/place/49.083299,-122.049999",8066,"Rural",2101,715,"Yes","No","Yes","No ","Yarrow","FALSE","FALSE"]
[null,8070,"Abbotsford","Yes","Yes","Yes","Fraser Valley Regional District","Lower Mainland--Southwest",{"$nulls":8},"","","",null,0,0,null,null,{"$f":"IF(AB167=\"Y\",COUNT(#REF!), \"\")","v":""},null,"Abbotsford","N",49.04775,{"v":-122.270317,"d":"-122.27032"},"http://www.google.com/maps/place/49.04775,-122.270317",8070,"Urban",23354,8415,"Yes","No","No","No ","Abbotsford","FALSE","FALSE"]
[null,8071,"Matsqui","Yes","Yes","Yes","Fraser Valley Regional District","Lower Mainland--Southwest",{"$nulls":8},"","","",null,0,0,null,null,{"$f":"IF(AB168=\"Y\",COUNT(#REF!), \"\")","v":""},null,"Matsqui","N",{"v":49.1083,"d":"49.10830"},{"v":-122.291699,"d":"-122.29170"},"http://www.google.com/maps/place/49.1083,-122.291699",8071,"Urban",2695,1073,"Yes","No","No","No ","Matsqui","FALSE","FALSE"]
[null,8072,"Huntingdon","Yes","Yes","Yes","Fraser Valley Regional District","Lower Mainland--Southwest",{"$nulls":8},"","","",null,0,0,null,null,{"$f":"IF(AB169=\"Y\",COUNT(#REF!), \"\")","v":""},null,"Huntingdon","N",{"v":49.005104,"d":"49.00510"},{"v":-122.265586,"d":"-122.26559"},"http://www.google.com/maps/place/49.005104,-122.265586",8072,"Rural",15704,6260,"Yes","No","No","No ","Huntingdon","FALSE","FALSE"]
[null,8073,"Aberdeen","Yes","Yes","Yes","Fraser Valley Regional District","Lower Mainland--Southwest",{"$nulls":8},"","","",null,0,0,null,null,{"$f":"IF(AB170=\"Y\",COUNT(#REF!), \"\")","v":""},null,"Aberdeen","N",{"v":49.050298,"d":"49.05030"},{"v":-122.4112,"d":"-122.41120"},"http://www.google.com/maps/place/49.050298,-122.4112",8073,"Rural",13400,4700,"Yes","No","No","No ","Aberdeen","FALSE","FALSE"]
[null,8074,"Clearbrook","Yes","Yes","Yes","Fraser Valley Regional District","Lower Mainland--Southwest",{"$nulls":8},"","","",null,0,0,null,null,{"$f":"IF(AB171=\"Y\",COUNT(#REF!), \"\")","v":""},null,"Clearbrook","N",{"v":49.05,"d":"49.05000"},{"v":-122.333299,"d":"-122.33330"},"http://www.google.com/maps/place/49.05,-122.333299",8074,"Urban",59460,23603,"Yes","No","No","No ","Clearbrook","FALSE","FALSE"]
[null,8075,"Aldergrove","Yes","Yes","Yes","Metro Vancouver Regional District","Lower Mainland--Southwest",{"$nulls":8},"","","",null,0,0,null,null,{"$f":"IF(AB172=\"Y\",COUNT(#REF!), \"\")","v":""},null,"Aldergrove","N",{"v":49.057581,"d":"49.05758"},{"v":-122.470611,"d":"-122.47061"},"http://www.google.com/maps/place/49.057581,-122.470611",8075,"Rural",13400,4700,"Yes","No","No","No ","Aldergrove","FALSE","FALSE"]
[null,8076,"Matsqui*","Yes","Yes","Yes","Metro Vancouver Regional District","Lower Mainland--Southwest",{"$nulls":8},"","","",null,0,0,null,null,{"$f":"IF(AB173=\"Y\",COUNT(#REF!), \"\")","v":0},null,"Matsqui","Y",{"v":49.005994,"d":"49.00599"},{"v":-122.476246,"d":"-122.47625"},"http://www.google.com/maps/place/49.005994,-122.476246",8076,"Rural First Nations Secondary Reserve",839,402,"Yes","No","No","No ","Matsqui*","FALSE","FALSE"]
[null,8077,"Mission","Yes","Yes","Yes","Fraser Valley Regional District","Lower Mainland--Southwest",{"$nulls":8},"","","",null,0,0,null,null,{"$f":"IF(AB174=\"Y\",COUNT(#REF!), \"\")","v":""},null,"Mission","N",49.13761,{"v":-122.303696,"d":"-122.30370"},"http://www.google.com/maps/place/49.13761,-122.303696",8077,"Urban",28392,10090,"Yes","No","No","No ","Mission","FALSE","FALSE"]
[null,8078,"Murrayville","Yes","Yes","Yes","Metro Vancouver Regional District","Lower Mainland--Southwest",{"$nulls":8},"","","",null,0,0,null,null,{"$f":"IF(AB175=\"Y\",COUNT(#REF!), \"\")","v":""},null,"Murrayville","N",{"v":49.090419,"d":"49.09042"},{"v":-122.616176,"d":"-122.61618"},"http://www.google.com/maps/place/49.090419,-122.616176",8078,"Urban",18781,6847,"Yes","No","No","No ","Murrayville","FALSE","FALSE"]
[null,8079,"Langley","Yes","Yes","Yes","Metro Vancouver Regional District","Lower Mainland--Southwest",{"$nulls":8},"","","",null,0,0,null,null,{"$f":"IF(AB176=\"Y\",COUNT(#REF!), \"\")","v":""},null,"Langley","N",49.10378,{"v":-122.658835,"d":"-122.65884"},"http://www.google.com/maps/place/49.10378,-122.658835",8079,"Urban",42137,18240,"Yes","No","Yes","No ","Langley","FALSE","FALSE"]
[null,8080,"White Rock","Yes","Yes","Yes","Metro Vancouver Regional District","Lower Mainland--Southwest",{"$nulls":8},"","","",null,0,0,null,null,{"$f":"IF(AB177=\"Y\",COUNT(#REF!), \"\")","v":""},null,"White Rock","N",{"v":49.025169,"d":"49.02517"},{"v":-122.796164,"d":"-122.79616"},"http://www.google.com/maps/place/49.025169,-122.796164",8080,"Urban",58492,27051,"Yes","No","Yes","No ","White Rock","FALSE","FALSE"]
[null,8082,"Brookswood","Yes","Yes","Yes","Metro Vancouver Regional District","Lower Mainland--Southwest",{"$nulls":8},"","","",null,0,0,null,null,{"$f":"IF(AB178=\"Y\",COUNT(#REF!), \"\")","v":""},null,"Brookswood","N",49.07177,{"v":-122.665988,"d":"-122.66599"},"http://www.google.com/maps/place/49.07177,-122.665988",8082,"Urban",18781,6847,"Yes","No","No","No ","Brookswood","FALSE","FALSE"]
[null,8083,"Fern Ridge","Yes","Yes","Yes","Metro Vancouver Regional District","Lower Mainland--Southwest",{"$nulls":8},"","","",null,0,0,null,null,{"$f":"IF(AB179=\"Y\",COUNT(#REF!), \"\")","v":""},null,"Fern Ridge","N",{"v":49.048303,"d":"49.04830"},{"v":-122.655561,"d":"-122.65556"},"http://www.google.com/maps/place/49.048303,-122.655561",8083,"Urban",5860,2423,"Yes","No","No","No ","Fern Ridge","FALSE","FALSE"]
[null,8084,"Walnut Grove","Yes","Yes","Yes","Metro Vancouver Regional District","Lower Mainland--Southwest",{"$nulls":8},"","","",null,0,0,null,null,{"$f":"IF(AB180=\"Y\",COUNT(#REF!), \"\")","v":""},null,"Walnut Grove","N",{"v":49.180555,"d":"49.18056"},{"v":-122.648192,"d":"-122.64819"},"http://www.google.com/maps/place/49.180555,-122.648192",8084,"Rural",30091,10896,"Yes","No","Yes","No ","Walnut Grove","FALSE","FALSE"]
[null,8085,"Fort Langley","Yes","Yes","Yes","Metro Vancouver Regional District","Lower Mainland--Southwest",{"$nulls":8},"","","",null,0,0,null,null,{"$f":"IF(AB181=\"Y\",COUNT(#REF!), \"\")","v":""},null,"Fort Langley","N",{"v":49.166701,"d":"49.16670"},{"v":-122.5833,"d":"-122.58330"},"http://www.google.com/maps/place/49.166701,-122.5833",8085,"Rural",5090,1930,"Yes","No","No","No ","Fort Langley","FALSE","FALSE"]
[null,8086,"Douglas","Yes","Yes","Yes","Metro Vancouver Regional District","Lower Mainland--Southwest",{"$nulls":8},"","","",null,0,0,null,null,{"$f":"IF(AB182=\"Y\",COUNT(#REF!), \"\")","v":""},null,"Douglas","N",{"v":49.002778,"d":"49.00278"},{"v":-122.735557,"d":"-122.73556"},"http://www.google.com/maps/place/49.002778,-122.735557",8086,"Rural",13775,5676,"Yes","No","No","No ","Douglas","FALSE","FALSE"]
[null,8087,"South Surrey","Yes","Yes","Yes","Metro Vancouver Regional District","Lower Mainland--Southwest",{"$nulls":8},"","","",null,0,0,null,null,{"$f":"IF(AB183=\"Y\",COUNT(#REF!), \"\")","v":""},null,"South Surrey","N",{"v":49.054281,"d":"49.05428"},{"v":-122.832917,"d":"-122.83292"},"http://www.google.com/maps/place/49.054281,-122.832917",8087,"Urban",58492,27051,"Yes","No","Yes","No ","South Surrey","FALSE","FALSE"]
[null,8088,"Cloverdale","Yes","Yes","Yes","Metro Vancouver Regional District","Lower Mainland--Southwest",{"$nulls":8},"","","",null,0,0,null,null,{"$f":"IF(AB184=\"Y\",COUNT(#REF!), \"\")","v":""},null,"Cloverdale","N",{"v":49.111723,"d":"49.11172"},{"v":-122.724855,"d":"-122.72486"},"http://www.google.com/maps/place/49.111723,-122.724855",8088,"Urban",31750,10828,"Yes","No","Yes","No ","Cloverdale","FALSE","FALSE"]
[null,8089,"Tsawwassen","Yes","Yes","Yes","Metro Vancouver Regional District","Lower Mainland--Southwest",{"$nulls":8},"","","",null,0,0,null,null,{"$f":"IF(AB185=\"Y\",COUNT(#REF!), \"\")","v":""},null,"Tsawwassen","N",{"v":49.018293,"d":"49.01829"},{"v":-123.080538,"d":"-123.08054"},"http://www.google.com/maps/place/49.018293,-123.080538",8089,"Urban",8716,3354,"Yes","No","Yes","No ","Tsawwassen","FALSE","FALSE"]
[null,8090,"North Delta","Yes","Yes","Yes","Metro Vancouver Regional District","Lower Mainland--Southwest",{"$nulls":8},"","","",null,0,0,null,null,{"$f":"IF(AB186=\"Y\",COUNT(#REF!), \"\")","v":""},null,"North Delta","N",{"v":49.154715,"d":"49.15472"},{"v":-122.911401,"d":"-122.91140"},"http://www.google.com/maps/place/49.154715,-122.911401",8090,"Urban",36651,12271,"Yes","No","Yes","No ","North Delta","FALSE","FALSE"]
[null,8091,"Ladner","Yes","Yes","Yes","Metro Vancouver Regional District","Lower Mainland--Southwest",{"$nulls":8},"","","",null,0,0,null,null,{"$f":"IF(AB187=\"Y\",COUNT(#REF!), \"\")","v":""},null,"Ladner","N",{"v":49.091666,"d":"49.09167"},{"v":-123.077777,"d":"-123.07778"},"http://www.google.com/maps/place/49.091666,-123.077777",8091,"Urban",17508,6865,"Yes","No","Yes","No ","Ladner","FALSE","FALSE"]
[null,8092,"Richmond","Yes","Yes","Yes","Metro Vancouver Regional District","Lower Mainland--Southwest",{"$nulls":8},"","","",null,0,0,null,null,{"$f":"IF(AB188=\"Y\",COUNT(#REF!), \"\")","v":""},null,"Richmond","N",{"v":49.153856,"d":"49.15386"},{"v":-123.158203,"d":"-123.15820"},"http://www.google.com/maps/place/49.153856,-123.158203",8092,"Urban",87485,32467,"Yes","No","No","No ","Richmond","FALSE","FALSE"]
[null,8094,"Leq' a: mel","Yes","Yes","Yes","Fraser Valley Regional District","Lower Mainland--Southwest",{"$nulls":8},"","","",null,0,0,null,null,{"$f":"IF(AB189=\"Y\",COUNT(#REF!), \"\")","v":""},null,"Leq' a: mel","N",{"v":49.167069,"d":"49.16707"},{"v":-122.086376,"d":"-122.08638"},"http://www.google.com/maps/place/49.167069,-122.086376",8094,"Rural",470,206,"Yes","No","Yes","No ","Leq' a: mel","FALSE","FALSE"]
[null,8096,"Leq' a: mel*","Yes","Yes","Yes","Fraser Valley Regional District","Lower Mainland--Southwest",{"$nulls":8},"","","",null,0,0,null,null,{"$f":"IF(AB190=\"Y\",COUNT(#REF!), \"\")","v":0},null,"Leq' a: mel","Y",{"v":49.209032,"d":"49.20903"},{"v":-122.023377,"d":"-122.02338"},"http://www.google.com/maps/place/49.209032,-122.023377",8096,"Rural First Nations Primary Reserve",796,432,"Yes","No","Yes","No ","Leq' a: mel*","FALSE","FALSE"]
[null,8097,"Lake Errock","Yes","Yes","Yes","Fraser Valley Regional District","Lower Mainland--Southwest",{"$nulls":8},"","","",null,0,0,null,null,{"$f":"IF(AB191=\"Y\",COUNT(#REF!), \"\")","v":""},null,"Lake Errock","N",{"v":49.229102,"d":"49.22910"},{"v":-122.011596,"d":"-122.01160"},"http://www.google.com/maps/place/49.229102,-122.011596",8097,"Rural",796,432,"Yes","No","Yes","No ","Lake Errock","FALSE","FALSE"]
[null,8099,"Durieu","Yes","Yes","Yes","Fraser Valley Regional District","Lower Mainland--Southwest",{"$nulls":8},"","","",null,0,0,null,null,{"$f":"IF(AB192=\"Y\",COUNT(#REF!), \"\")","v":""},null,"Durieu","N",{"v":49.217533,"d":"49.21753"},{"v":-122.235034,"d":"-122.23503"},"http://www.google.com/maps/place/49.217533,-122.235034",8099,"Rural",468,214,"No","No","No","No ","Durieu","FALSE","FALSE"]
[null,8100,"Hatzic Island","Yes","Yes","Yes","Fraser Valley Regional District","Lower Mainland--Southwest",{"$nulls":8},"","","",null,0,0,null,null,{"$f":"IF(AB193=\"Y\",COUNT(#REF!), \"\")","v":""},null,"Hatzic Island","N",{"v":49.162449,"d":"49.16245"},{"v":-122.236412,"d":"-122.23641"},"http://www.google.com/maps/place/49.162449,-122.236412",8100,"Rural",5342,2138,"Yes","No","Yes","No ","Hatzic Island","FALSE","FALSE"]
[null,8101,"Baker Trails","Yes","Yes","Yes","Fraser Valley Regional District","Lower Mainland--Southwest",{"$nulls":8},"","","",null,0,0,null,null,{"$f":"IF(AB194=\"Y\",COUNT(#REF!), \"\")","v":""},null,"Baker Trails","N",{"v":49.085388,"d":"49.08539"},-121.92677,"http://www.google.com/maps/place/49.085388,-121.92677",8101,"Rural",752,326,"No","No","No","No ","Baker Trails","FALSE","FALSE"]
[null,8102,"Bell Acres","Yes","Yes","Yes","Fraser Valley Regional District","Lower Mainland--Southwest",{"$nulls":8},"","","",null,0,0,null,null,{"$f":"IF(AB195=\"Y\",COUNT(#REF!), \"\")","v":""},null,"Bell Acres","N",{"v":49.078048,"d":"49.07805"},{"v":-121.866156,"d":"-121.86616"},"http://www.google.com/maps/place/49.078048,-121.866156",8102,"Rural",1137,565,"No","No","No","No ","Bell Acres","FALSE","FALSE"]
[null,8103,"University Hill","Yes","Yes","Yes","Metro Vancouver Regional District","Lower Mainland--Southwest",{"$nulls":8},"","","",null,0,0,null,null,{"$f":"IF(AB196=\"Y\",COUNT(#REF!), \"\")","v":""},null,"University Hill","N",{"v":49.266888,"d":"49.26689"},{"v":-123.241849,"d":"-123.24185"},"http://www.google.com/maps/place/49.266888,-123.241849",8103,"Urban",21753,10785,"Yes","No","Yes","No ","University Hill","FALSE","FALSE"]
[null,8104,"Vancouver","Yes","Yes","Yes","Metro Vancouver Regional District","Lower Mainland--Southwest",{"$nulls":8},"","","",null,0,0,null,null,{"$f":"IF(AB197=\"Y\",COUNT(#REF!), \"\")","v":""},null,"Vancouver","N",{"v":49.244798,"d":"49.24480"},{"v":-123.115387,"d":"-123.11539"},"http://www.google.com/maps/place/49.244798,-123.115387",8104,"Urban",103965,41470,"Yes","No","Yes","No ","Vancouver","FALSE","FALSE"]
[null,8105,"Burnaby","Yes","Yes","Yes","Metro Vancouver Regional District","Lower Mainland--Southwest",{"$nulls":8},"","","",null,0,0,null,null,{"$f":"IF(AB198=\"Y\",COUNT(#REF!), \"\")","v":""},null,"Burnaby","N",{"v":49.252088,"d":"49.25209"},{"v":-122.961708,"d":"-122.96171"},"http://www.google.com/maps/place/49.252088,-122.961708",8105,"Urban",45637,17845,"Yes","No","No","No ","Burnaby","FALSE","FALSE"]
[null,8106,"New Westminster","Yes","Yes","Yes","Metro Vancouver Regional District","Lower Mainland--Southwest",{"$nulls":8},"","","",null,0,0,null,null,{"$f":"IF(AB199=\"Y\",COUNT(#REF!), \"\")","v":""},null,"New Westminster","N",{"v":49.2167,"d":"49.21670"},{"v":-122.9167,"d":"-122.91670"},"http://www.google.com/maps/place/49.2167,-122.9167",8106,"Urban",85596,39368,"Yes","No","No","No ","New Westminster","FALSE","FALSE"]
[null,8107,"Port Moody","Yes","Yes","Yes","Metro Vancouver Regional District","Lower Mainland--Southwest",{"$nulls":8},"","","",null,0,0,null,null,{"$f":"IF(AB200=\"Y\",COUNT(#REF!), \"\")","v":""},null,"Port Moody","N",{"v":49.278646,"d":"49.27865"},{"v":-122.867626,"d":"-122.86763"},"http://www.google.com/maps/place/49.278646,-122.867626",8107,"Urban",43149,17723,"Yes","No","Yes","No ","Port Moody","FALSE","FALSE"]
[null,8108,"Belcarra","Yes","Yes","Yes","Metro Vancouver Regional District","Lower Mainland--Southwest",{"$nulls":8},"","","",null,0,0,null,null,{"$f":"IF(AB201=\"Y\",COUNT(#REF!), \"\")","v":""},null,"Belcarra","N",{"v":49.318236,"d":"49.31824"},{"v":-122.928169,"d":"-122.92817"},"http://www.google.com/maps/place/49.318236,-122.928169",8108,"Rural",7963,3263,"Yes","No","No","No ","Belcarra","FALSE","FALSE"]
[null,8110,"North Vancouver","Yes","Yes","Yes","Metro Vancouver Regional District","Lower Mainland--Southwest",{"$nulls":8},"","","",null,0,0,null,null,{"$f":"IF(AB202=\"Y\",COUNT(#REF!), \"\")","v":""},null,"North Vancouver","N",{"v":49.314238,"d":"49.31424"},{"v":-123.067197,"d":"-123.06720"},"http://www.google.com/maps/place/49.314238,-123.067197",8110,"Urban",65236,32287,"Yes","No","Yes","No ","North Vancouver","FALSE","FALSE"]
[null,8112,"Anmore","Yes","Yes","Yes","Metro Vancouver Regional District","Lower Mainland--Southwest",{"$nulls":8},"","","",null,0,0,null,null,{"$f":"IF(AB203=\"Y\",COUNT(#REF!), \"\")","v":""},null,"Anmore","N",{"v":49.311547,"d":"49.31155"},{"v":-122.848839,"d":"-122.84884"},"http://www.google.com/maps/place/49.311547,-122.848839",8112,"Urban",2318,786,"Yes","No","No","No ","Anmore","FALSE","FALSE"]
[null,8113,"Pleasantside","Yes","Yes","Yes","Metro Vancouver Regional District","Lower Mainland--Southwest",{"$nulls":8},"","","",null,0,0,null,null,{"$f":"IF(AB204=\"Y\",COUNT(#REF!), \"\")","v":""},null,"Pleasantside","N",{"v":49.293415,"d":"49.29342"},{"v":-122.847407,"d":"-122.84741"},"http://www.google.com/maps/place/49.293415,-122.847407",8113,"Urban",43149,17723,"Yes","No","No","No ","Pleasantside","FALSE","FALSE"]
[null,8114,"Port Coquitlam","Yes","Yes","Yes","Metro Vancouver Regional District","Lower Mainland--Southwest",{"$nulls":8},"","","",null,0,0,null,null,{"$f":"IF(AB205=\"Y\",COUNT(#REF!), \"\")","v":""},null,"Port Coquitlam","N",49.25668,-122.76166,"http://www.google.com/maps/place/49.25668,-122.76166",8114,"Urban",47641,16928,"Yes","No","No","No ","Port Coquitlam","FALSE","FALSE"]
[null,8115,"Coquitlam","Yes","Yes","Yes","Metro Vancouver Regional District","Lower Mainland--Southwest",{"$nulls":8},"","","",null,0,0,null,null,{"$f":"IF(AB206=\"Y\",COUNT(#REF!), \"\")","v":""},null,"Coquitlam","N",{"v":49.253916,"d":"49.25392"},{"v":-122.848809,"d":"-122.84881"},"http://www.google.com/maps/place/49.253916,-122.848809",8115,"Urban",43149,17723,"Yes","No","No","No ","Coquitlam","FALSE","FALSE"]
[null,8116,"Surrey","Yes","Yes","Yes","Metro Vancouver Regional District","Lower Mainland--Southwest",{"$nulls":8},"","","",null,0,0,null,null,{"$f":"IF(AB207=\"Y\",COUNT(#REF!), \"\")","v":""},null,"Surrey","N",{"v":49.174479,"d":"49.17448"},{"v":-122.827771,"d":"-122.82777"},"http://www.google.com/maps/place/49.174479,-122.827771",8116,"Urban",86764,27248,"Yes","No","No","No ","Surrey","FALSE","FALSE"]
[null,8117,"Lynn Valley","Yes","Yes","Yes","Metro Vancouver Regional District","Lower Mainland--Southwest",{"$nulls":8},"","","",null,0,0,null,null,{"$f":"IF(AB208=\"Y\",COUNT(#REF!), \"\")","v":""},null,"Lynn Valley","N",{"v":49.341644,"d":"49.34164"},{"v":-123.032818,"d":"-123.03282"},"http://www.google.com/maps/place/49.341644,-123.032818",8117,"Urban",30611,11419,"Yes","No","Yes","No ","Lynn Valley","FALSE","FALSE"]
[null,8118,"Deep Cove","Yes","Yes","Yes","Metro Vancouver Regional District","Lower Mainland--Southwest",{"$nulls":8},"","","",null,0,0,null,null,{"$f":"IF(AB209=\"Y\",COUNT(#REF!), \"\")","v":""},null,"Deep Cove","N",{"v":49.323229,"d":"49.32323"},{"v":-122.947901,"d":"-122.94790"},"http://www.google.com/maps/place/49.323229,-122.947901",8118,"Urban",7963,3263,"Yes","No","Yes","No ","Deep Cove","FALSE","FALSE"]
[null,8119,"Delbrook","Yes","Yes","Yes","Metro Vancouver Regional District","Lower Mainland--Southwest",{"$nulls":8},"","","",null,0,0,null,null,{"$f":"IF(AB210=\"Y\",COUNT(#REF!), \"\")","v":""},null,"Delbrook","N",{"v":49.343025,"d":"49.34303"},{"v":-123.085198,"d":"-123.08520"},"http://www.google.com/maps/place/49.343025,-123.085198",8119,"Urban",47239,20236,"Yes","No","No","No ","Delbrook","FALSE","FALSE"]
[null,8120,"Seymour Heights","Yes","Yes","Yes","Metro Vancouver Regional District","Lower Mainland--Southwest",{"$nulls":8},"","","",null,0,0,null,null,{"$f":"IF(AB211=\"Y\",COUNT(#REF!), \"\")","v":""},null,"Seymour Heights","N",{"v":49.319242,"d":"49.31924"},{"v":-123.001638,"d":"-123.00164"},"http://www.google.com/maps/place/49.319242,-123.001638",8120,"Urban",18670,6990,"Yes","No","No","No ","Seymour Heights","FALSE","FALSE"]
[null,8121,"Dundarave","Yes","Yes","Yes","Metro Vancouver Regional District","Lower Mainland--Southwest",{"$nulls":8},"","","",null,0,0,null,null,{"$f":"IF(AB212=\"Y\",COUNT(#REF!), \"\")","v":""},null,"Dundarave","N",{"v":49.337954,"d":"49.33795"},{"v":-123.180536,"d":"-123.18054"},"http://www.google.com/maps/place/49.337954,-123.180536",8121,"Urban",19863,9199,"Yes","No","Yes","No ","Dundarave","FALSE","FALSE"]
[null,8122,"Hollyburn","Yes","Yes","Yes","Metro Vancouver Regional District","Lower Mainland--Southwest",{"$nulls":8},"","","",null,0,0,null,null,{"$f":"IF(AB213=\"Y\",COUNT(#REF!), \"\")","v":""},null,"Hollyburn","N",49.33243,{"v":-123.163312,"d":"-123.16331"},"http://www.google.com/maps/place/49.33243,-123.163312",8122,"Urban",19863,9199,"Yes","No","Yes","No ","Hollyburn","FALSE","FALSE"]
[null,8123,"Caulfeild","Yes","Yes","Yes","Metro Vancouver Regional District","Lower Mainland--Southwest",{"$nulls":8},"","","",null,0,0,null,null,{"$f":"IF(AB214=\"Y\",COUNT(#REF!), \"\")","v":""},null,"Caulfeild","N",49.34164,-123.26049,"http://www.google.com/maps/place/49.34164,-123.26049",8123,"Urban",5883,2191,"Yes","No","No","No ","Caulfeild","FALSE","FALSE"]
[null,8124,"Westmount","Yes","Yes","Yes","Metro Vancouver Regional District","Lower Mainland--Southwest",{"$nulls":8},"","","",null,0,0,null,null,{"$f":"IF(AB215=\"Y\",COUNT(#REF!), \"\")","v":""},null,"Westmount","N",{"v":49.343925,"d":"49.34393"},{"v":-123.209153,"d":"-123.20915"},"http://www.google.com/maps/place/49.343925,-123.209153",8124,"Urban",5883,2191,"Yes","No","Yes","No ","Westmount","FALSE","FALSE"]
[null,8125,"Lions Bay","Yes","Yes","Yes","Metro Vancouver Regional District","Lower Mainland--Southwest",{"$nulls":8},"","","",null,0,0,null,null,{"$f":"IF(AB216=\"Y\",COUNT(#REF!), \"\")","v":""},null,"Lions Bay","N",{"v":49.459058,"d":"49.45906"},{"v":-123.236102,"d":"-123.23610"},"http://www.google.com/maps/place/49.459058,-123.236102",8125,"Rural",670,277,"Yes","No","No","No ","Lions Bay","FALSE","FALSE"]
[null,8126,"Pitt Meadows","Yes","Yes","Yes","Metro Vancouver Regional District","Lower Mainland--Southwest",{"$nulls":8},"","","",null,0,0,null,null,{"$f":"IF(AB217=\"Y\",COUNT(#REF!), \"\")","v":""},null,"Pitt Meadows","N",{"v":49.217152,"d":"49.21715"},{"v":-122.686296,"d":"-122.68630"},"http://www.google.com/maps/place/49.217152,-122.686296",8126,"Urban",16904,6634,"Yes","No","Yes","No ","Pitt Meadows","FALSE","FALSE"]
[null,8127,"Maple Ridge","Yes","Yes","Yes","Metro Vancouver Regional District","Lower Mainland--Southwest",{"$nulls":8},"","","",null,0,0,null,null,{"$f":"IF(AB218=\"Y\",COUNT(#REF!), \"\")","v":""},null,"Maple Ridge","N",{"v":49.217407,"d":"49.21741"},{"v":-122.597946,"d":"-122.59795"},"http://www.google.com/maps/place/49.217407,-122.597946",8127,"Urban",34323,14482,"Yes","No","No","No ","Maple Ridge","FALSE","FALSE"]
[null,8128,"Coalmont","No","No","No","Regional District of Okanagan-Similkameen","Thompson--Okanagan",{"$nulls":8},"","","",null,0,0,null,null,{"$f":"IF(AB219=\"Y\",COUNT(#REF!), \"\")","v":""},null,"Coalmont","N",{"v":49.508898,"d":"49.50890"},{"v":-120.695433,"d":"-120.69543"},"http://www.google.com/maps/place/49.508898,-120.695433",8128,"Rural",66,50,"No","Yes","No","No ","Coalmont","FALSE","FALSE"]
[null,8129,"Tulameen","No","No","No","Regional District of Okanagan-Similkameen","Thompson--Okanagan",{"$nulls":8},"","","",null,0,0,null,null,{"$f":"IF(AB220=\"Y\",COUNT(#REF!), \"\")","v":""},null,"Tulameen","N",{"v":49.5458,"d":"49.54580"},{"v":-120.7583,"d":"-120.75830"},"http://www.google.com/maps/place/49.5458,-120.7583",8129,"Rural",239,381,"No","Yes","No","No ","Tulameen","FALSE","FALSE"]
[null,8130,"Summerland","Yes","Yes","Yes","Regional District of Okanagan-Similkameen","Thompson--Okanagan",{"$nulls":8},"","","",null,0,0,null,null,{"$f":"IF(AB221=\"Y\",COUNT(#REF!), \"\")","v":""},null,"Summerland","N",49.60544,{"v":-119.672582,"d":"-119.67258"},"http://www.google.com/maps/place/49.60544,-119.672582",8130,"Rural",8487,3876,"Yes","No","Yes","No ","Summerland","FALSE","FALSE"]
[null,8131,"Naramata","Yes","Yes","Yes","Regional District of Okanagan-Similkameen","Thompson--Okanagan",{"$nulls":8},"","","",null,0,0,null,null,{"$f":"IF(AB222=\"Y\",COUNT(#REF!), \"\")","v":""},null,"Naramata","N",{"v":49.594183,"d":"49.59418"},{"v":-119.587073,"d":"-119.58707"},"http://www.google.com/maps/place/49.594183,-119.587073",8131,"Rural",2369,1184,"Yes","No","No","No ","Naramata","FALSE","FALSE"]
[null,8132,"Peachland","Yes","Yes","Yes","Regional District of Central Okanagan","Thompson--Okanagan",{"$nulls":8},"","","",null,0,0,null,null,{"$f":"IF(AB223=\"Y\",COUNT(#REF!), \"\")","v":""},null,"Peachland","N",{"v":49.778638,"d":"49.77864"},{"v":-119.736108,"d":"-119.73611"},"http://www.google.com/maps/place/49.778638,-119.736108",8132,"Urban",3247,1704,"Yes","No","Yes","No ","Peachland","FALSE","FALSE"]
[null,8133,"Kelowna","Yes","Yes","Yes","Regional District of Central Okanagan","Thompson--Okanagan",{"$nulls":8},"","","",null,0,0,null,null,{"$f":"IF(AB224=\"Y\",COUNT(#REF!), \"\")","v":""},null,"Kelowna","N",{"v":49.883301,"d":"49.88330"},{"v":-119.4833,"d":"-119.48330"},"http://www.google.com/maps/place/49.883301,-119.4833",8133,"Urban",26435,13704,"Yes","No","Yes","No ","Kelowna","FALSE","FALSE"]
[null,8135,"Westside*","Yes","Yes","Yes","Regional District of Central Okanagan","Thompson--Okanagan",{"$nulls":8},"","","",null,0,0,null,null,{"$f":"IF(AB225=\"Y\",COUNT(#REF!), \"\")","v":0},null,"Westside","Y",49.88223,{"v":-119.535235,"d":"-119.53524"},"http://www.google.com/maps/place/49.88223,-119.535235",8135,"Urban First Nations Secondary Reserve",11559,4591,"Yes","No","No","No ","Westside*","FALSE","FALSE"]
[null,8136,{"$f":"HYPERLINK(AE226,AN226)","v":"Glenrosa"},"Yes","Yes","Yes","Regional District of Central Okanagan","Thompson--Okanagan",{"$nulls":8},{"$f":"IF(L226=\"\",\"\",\nIF(SUM((J226*L226)/M226)<=N226,\"Sufficient Capacity\",\nIF(SUM((J226*L226)/M226)>N226,\"Not Enough Capacity\",\"Error\")))","v":""},{"$f":"IF(OR(ISBLANK(J226),ISBLANK(L226),ISBLANK(M226)), \"\",(J226*L226/M226))","v":""},{"$f":"IF(AND(COUNT(N226,R226)=2, OR($O$10=\"Last-Mile\", $O$10=\"Transport & Last-Mile\")), N226-R226, \"\")","v":""},null,{"$f":"IF(AND(AB226=\"Y\",I226<>\"\"),1,0)","v":0},{"$f":"IF(AND(AB226=\"Y\",I226=\"Last-Mile & Transport\"),1,0)","v":0},null,null,{"$f":"IF(AB226=\"Y\",COUNT(#REF!), \"\")","v":""},null,"Glenrosa","N",{"v":49.847165,"d":"49.84717"},-119.66732,"http://www.google.com/maps/place/49.847165,-119.66732",8136,"Urban",832,298,"Yes","No","Yes","No ",{"$f":"IF(AB226=\"Y\", CONCATENATE(AA226,\"*\"), AA226)","v":"Glenrosa"},{"$f":"IF(I226=\"Last-Mile\",\"TRUE\",IF(I226=\"Transport & Last-Mile\",\"TRUE\",\"FALSE\"))","v":"FALSE"},{"$f":"IF(I226=\"Transport\",\"TRUE\",IF(I226=\"Transport & Last-Mile\",\"TRUE\",\"FALSE\"))","v":"FALSE"}]
[null,8137,"Westbank","Yes","Yes","Yes","Regional District of Central Okanagan","Thompson--Okanagan",{"$nulls":8},"","","",null,0,0,null,null,{"$f":"IF(AB227=\"Y\",COUNT(#REF!), \"\")","v":""},null,"Westbank","N",{"v":49.828564,"d":"49.82856"},{"v":-119.631383,"d":"-119.63138"},"http://www.google.com/maps/place/49.828564,-119.631383",8137,"Urban",20108,8809,"Yes","No","No","No ","Westbank","FALSE","FALSE"]
[null,8138,"Okanagan Mission","Yes","Yes","Yes","Regional District of Central Okanagan","Thompson--Okanagan",{"$nulls":8},"","","",null,0,0,null,null,{"$f":"IF(AB228=\"Y\",COUNT(#REF!), \"\")","v":""},null,"Okanagan Mission","N",{"v":49.816701,"d":"49.81670"},{"v":-119.4833,"d":"-119.48330"},"http://www.google.com/maps/place/49.816701,-119.4833",8138,"Urban",12549,4342,"Yes","No","Yes","No ","Okanagan Mission","FALSE","FALSE"]
[null,8139,"Braeloch","Yes","Yes","Yes","Regional District of Central Okanagan","Thompson--Okanagan",{"$nulls":8},"","","",null,0,0,null,null,{"$f":"IF(AB229=\"Y\",COUNT(#REF!), \"\")","v":""},null,"Braeloch","N",{"v":49.783299,"d":"49.78330"},{"v":-119.5167,"d":"-119.51670"},"http://www.google.com/maps/place/49.783299,-119.5167",8139,"Urban",12549,4342,"Yes","No","No","No ","Braeloch","FALSE","FALSE"]
[null,8140,"Ellison","Yes","Yes","Yes","Regional District of Central Okanagan","Thompson--Okanagan",{"$nulls":8},"","","",null,0,0,null,null,{"$f":"IF(AB230=\"Y\",COUNT(#REF!), \"\")","v":""},null,"Ellison","N",{"v":49.936266,"d":"49.93627"},{"v":-119.357592,"d":"-119.35759"},"http://www.google.com/maps/place/49.936266,-119.357592",8140,"Urban",3949,1885,"Yes","No","No","No ","Ellison","FALSE","FALSE"]
[null,8141,"Rutland","Yes","Yes","Yes","Regional District of Central Okanagan","Thompson--Okanagan",{"$nulls":8},"","","",null,0,0,null,null,{"$f":"IF(AB231=\"Y\",COUNT(#REF!), \"\")","v":""},null,"Rutland","N",{"v":49.888253,"d":"49.88825"},{"v":-119.391029,"d":"-119.39103"},"http://www.google.com/maps/place/49.888253,-119.391029",8141,"Urban",22752,9624,"Yes","No","Yes","No ","Rutland","FALSE","FALSE"]
[null,8142,"Beaverdell","No","No","Yes","Regional District of Kootenay Boundary","Kootenay",{"$nulls":8},"","","",null,0,0,null,null,{"$f":"IF(AB232=\"Y\",COUNT(#REF!), \"\")","v":""},null,"Beaverdell","N",49.43681,{"v":-119.088964,"d":"-119.08896"},"http://www.google.com/maps/place/49.43681,-119.088964",8142,"Rural",157,106,"No","Yes","No","No ","Beaverdell","FALSE","FALSE"]
[null,8143,"Carmi","No","No","Yes","Regional District of Kootenay Boundary","Kootenay",{"$nulls":8},"","","",null,0,0,null,null,{"$f":"IF(AB233=\"Y\",COUNT(#REF!), \"\")","v":""},null,"Carmi","N",49.50093,{"v":-119.121976,"d":"-119.12198"},"http://www.google.com/maps/place/49.50093,-119.121976",8143,"Rural",195,154,"No","Yes","No","No ","Carmi","FALSE","FALSE"]
[null,8144,"Okanagan*","Yes","Yes","Yes","Regional District of Central Okanagan","Thompson--Okanagan",{"$nulls":8},"","","",null,0,0,null,null,{"$f":"IF(AB234=\"Y\",COUNT(#REF!), \"\")","v":0},null,"Okanagan","Y",{"v":50.007636,"d":"50.00764"},{"v":-119.396944,"d":"-119.39694"},"http://www.google.com/maps/place/50.007636,-119.396944",8144,"Rural First Nations Secondary Reserve",1697,1401,"Yes","No","No","No ","Okanagan*","FALSE","FALSE"]
[null,8145,"Winfield","Yes","Yes","Yes","Regional District of Central Okanagan","Thompson--Okanagan",{"$nulls":8},"","","",null,0,0,null,null,{"$f":"IF(AB235=\"Y\",COUNT(#REF!), \"\")","v":""},null,"Winfield","N",{"v":50.033324,"d":"50.03332"},{"v":-119.401779,"d":"-119.40178"},"http://www.google.com/maps/place/50.033324,-119.401779",8145,"Rural",5290,2317,"Yes","No","Yes","No ","Winfield","FALSE","FALSE"]
[null,8146,"Woodsdale","Yes","Yes","Yes","Regional District of Central Okanagan","Thompson--Okanagan",{"$nulls":8},"","","",null,0,0,null,null,{"$f":"IF(AB236=\"Y\",COUNT(#REF!), \"\")","v":""},null,"Woodsdale","N",{"v":50.049457,"d":"50.04946"},{"v":-119.389763,"d":"-119.38976"},"http://www.google.com/maps/place/50.049457,-119.389763",8146,"Rural",3032,1407,"Yes","No","Yes","No ","Woodsdale","FALSE","FALSE"]
[null,8147,"Okanagan Centre","Yes","Yes","Yes","Regional District of Central Okanagan","Thompson--Okanagan",{"$nulls":8},"","","",null,0,0,null,null,{"$f":"IF(AB237=\"Y\",COUNT(#REF!), \"\")","v":""},null,"Okanagan Centre","N",{"v":50.049999,"d":"50.05000"},{"v":-119.45,"d":"-119.45000"},"http://www.google.com/maps/place/50.049999,-119.45",8147,"Rural",5290,2317,"Yes","No","No","No ","Okanagan Centre","FALSE","FALSE"]
[null,8148,"Oyama","Yes","Yes","Yes","Regional District of Central Okanagan","Thompson--Okanagan",{"$nulls":8},"","","",null,0,0,null,null,{"$f":"IF(AB238=\"Y\",COUNT(#REF!), \"\")","v":""},null,"Oyama","N",{"v":50.111076,"d":"50.11108"},{"v":-119.367611,"d":"-119.36761"},"http://www.google.com/maps/place/50.111076,-119.367611",8148,"Rural",1396,654,"Yes","No","Yes","No ","Oyama","FALSE","FALSE"]
[null,8149,"Lumby","Yes","Yes","Yes","Regional District of North Okanagan","Thompson--Okanagan",{"$nulls":8},"","","",null,0,0,null,null,{"$f":"IF(AB239=\"Y\",COUNT(#REF!), \"\")","v":""},null,"Lumby","N",{"v":50.25,"d":"50.25000"},{"v":-118.9667,"d":"-118.96670"},"http://www.google.com/maps/place/50.25,-118.9667",8149,"Rural",2004,916,"Yes","No","No","No ","Lumby","FALSE","FALSE"]
[null,8150,"Lavington","Yes","Yes","Yes","Regional District of North Okanagan","Thompson--Okanagan",{"$nulls":8},"","","",null,0,0,null,null,{"$f":"IF(AB240=\"Y\",COUNT(#REF!), \"\")","v":""},null,"Lavington","N",{"v":50.231286,"d":"50.23129"},{"v":-119.106647,"d":"-119.10665"},"http://www.google.com/maps/place/50.231286,-119.106647",8150,"Rural",1218,465,"Yes","No","Yes","No ","Lavington","FALSE","FALSE"]
[null,8151,"Blue Springs","No","No","Yes","Regional District of North Okanagan","Thompson--Okanagan",{"$nulls":8},"","","",null,0,0,null,null,{"$f":"IF(AB241=\"Y\",COUNT(#REF!), \"\")","v":""},null,"Blue Springs","N",{"v":50.249999,"d":"50.25000"},{"v":-118.850001,"d":"-118.85000"},"http://www.google.com/maps/place/50.249999,-118.850001",8151,"Rural",68,30,"No","Yes","No","No ","Blue Springs","FALSE","FALSE"]
[null,8152,"Shuswap Falls","No","No","Yes","Regional District of North Okanagan","Thompson--Okanagan",{"$nulls":8},"","","",null,0,0,null,null,{"$f":"IF(AB242=\"Y\",COUNT(#REF!), \"\")","v":""},null,"Shuswap Falls","N",{"v":50.294024,"d":"50.29402"},{"v":-118.805096,"d":"-118.80510"},"http://www.google.com/maps/place/50.294024,-118.805096",8152,"Rural",119,56,"No","Yes","Yes","No ","Shuswap Falls","FALSE","FALSE"]
[null,8153,"Silver Star","Yes","Yes","Yes","Regional District of North Okanagan","Thompson--Okanagan",{"$nulls":8},"","","",null,0,0,null,null,{"$f":"IF(AB243=\"Y\",COUNT(#REF!), \"\")","v":""},null,"Silver Star","N",{"v":50.357223,"d":"50.35722"},{"v":-119.059444,"d":"-119.05944"},"http://www.google.com/maps/place/50.357223,-119.059444",8153,"Rural",134,755,"Yes","No","Yes","No ","Silver Star","FALSE","FALSE"]
[null,8154,"Cherryville","No","No","Yes","Regional District of North Okanagan","Thompson--Okanagan",{"$nulls":8},"","","",null,0,0,null,null,{"$f":"IF(AB244=\"Y\",COUNT(#REF!), \"\")","v":""},null,"Cherryville","N",{"v":50.240746,"d":"50.24075"},{"v":-118.620518,"d":"-118.62052"},"http://www.google.com/maps/place/50.240746,-118.620518",8154,"Rural",359,160,"No","Yes","No","No ","Cherryville","FALSE","FALSE"]
[null,8155,"Big White","Yes","Yes","Yes","Regional District of Kootenay Boundary","Kootenay",{"$nulls":8},"","","",null,0,0,null,null,{"$f":"IF(AB245=\"Y\",COUNT(#REF!), \"\")","v":""},null,"Big White","N",{"v":49.721424,"d":"49.72142"},{"v":-118.940367,"d":"-118.94037"},"http://www.google.com/maps/place/49.721424,-118.940367",8155,"Rural",251,1880,"Yes","No","No","No ","Big White","FALSE","FALSE"]
[null,8156,"Squamish","Yes","Yes","Yes","Squamish-Lillooet Regional District","Lower Mainland--Southwest",{"$nulls":8},"","","",null,0,0,null,null,{"$f":"IF(AB246=\"Y\",COUNT(#REF!), \"\")","v":""},null,"Squamish","N",{"v":49.702408,"d":"49.70241"},{"v":-123.146733,"d":"-123.14673"},"http://www.google.com/maps/place/49.702408,-123.146733",8156,"Rural",5015,2183,"Yes","No","No","No ","Squamish","FALSE","FALSE"]
[null,8157,"Squamish*","Yes","Yes","Yes","Squamish-Lillooet Regional District","Lower Mainland--Southwest",{"$nulls":8},"","","",null,0,0,null,null,{"$f":"IF(AB247=\"Y\",COUNT(#REF!), \"\")","v":0},null,"Squamish","Y",{"v":49.690967,"d":"49.69097"},{"v":-123.150287,"d":"-123.15029"},"http://www.google.com/maps/place/49.690967,-123.150287",8157,"Rural First Nations Secondary Reserve",117,28,"No","No","Yes","No ","Squamish*","FALSE","FALSE"]
[null,8158,"Squamish*","Yes","Yes","Yes","Squamish-Lillooet Regional District","Lower Mainland--Southwest",{"$nulls":8},"","","",null,0,0,null,null,{"$f":"IF(AB248=\"Y\",COUNT(#REF!), \"\")","v":0},null,"Squamish","Y",{"v":49.771237,"d":"49.77124"},{"v":-123.162035,"d":"-123.16204"},"http://www.google.com/maps/place/49.771237,-123.162035",8158,"Rural First Nations Secondary Reserve",3472,1229,"Yes","No","No","No ","Squamish*","FALSE","FALSE"]
[null,8159,"Brackendale","Yes","Yes","Yes","Squamish-Lillooet Regional District","Lower Mainland--Southwest",{"$nulls":8},"","","",null,0,0,null,null,{"$f":"IF(AB249=\"Y\",COUNT(#REF!), \"\")","v":""},null,"Brackendale","N",{"v":49.7667,"d":"49.76670"},{"v":-123.149999,"d":"-123.15000"},"http://www.google.com/maps/place/49.7667,-123.149999",8159,"Rural",3472,1229,"Yes","No","No","No ","Brackendale","FALSE","FALSE"]
[null,8160,"Garibaldi Highlands","Yes","Yes","Yes","Squamish-Lillooet Regional District","Lower Mainland--Southwest",{"$nulls":8},"","","",null,0,0,null,null,{"$f":"IF(AB250=\"Y\",COUNT(#REF!), \"\")","v":""},null,"Garibaldi Highlands","N",{"v":49.741699,"d":"49.74170"},{"v":-123.134701,"d":"-123.13470"},"http://www.google.com/maps/place/49.741699,-123.134701",8160,"Rural",7995,3090,"Yes","No","No","No ","Garibaldi Highlands","FALSE","FALSE"]
[null,8161,"Squamish*","No","Yes","Yes","Squamish-Lillooet Regional District","Lower Mainland--Southwest",{"$nulls":8},"","","",null,0,0,null,null,{"$f":"IF(AB251=\"Y\",COUNT(#REF!), \"\")","v":0},null,"Squamish","Y",{"v":49.8,"d":"49.80000"},{"v":-123.183301,"d":"-123.18330"},"http://www.google.com/maps/place/49.8,-123.183301",8161,"Rural First Nations Secondary Reserve",199,92,"No","Yes","No","No ","Squamish*","FALSE","FALSE"]
[null,8162,"Whistler","Yes","Yes","Yes","Squamish-Lillooet Regional District","Lower Mainland--Southwest",{"$nulls":8},"","","",null,0,0,null,null,{"$f":"IF(AB252=\"Y\",COUNT(#REF!), \"\")","v":""},null,"Whistler","N",{"v":50.121548,"d":"50.12155"},{"v":-122.962037,"d":"-122.96204"},"http://www.google.com/maps/place/50.121548,-122.962037",8162,"Rural",5742,5456,"Yes","No","No","No ","Whistler","FALSE","FALSE"]
[null,8163,"Alpine Meadows","Yes","Yes","Yes","Squamish-Lillooet Regional District","Lower Mainland--Southwest",{"$nulls":8},"","","",null,0,0,null,null,{"$f":"IF(AB253=\"Y\",COUNT(#REF!), \"\")","v":""},null,"Alpine Meadows","N",{"v":50.149999,"d":"50.15000"},{"v":-122.9667,"d":"-122.96670"},"http://www.google.com/maps/place/50.149999,-122.9667",8163,"Rural",2057,1089,"Yes","No","No","No ","Alpine Meadows","FALSE","FALSE"]
[null,8164,"Whistler Creek","Yes","Yes","Yes","Squamish-Lillooet Regional District","Lower Mainland--Southwest",{"$nulls":8},"","","",null,0,0,null,null,{"$f":"IF(AB254=\"Y\",COUNT(#REF!), \"\")","v":""},null,"Whistler Creek","N",{"v":50.093461,"d":"50.09346"},{"v":-122.993468,"d":"-122.99347"},"http://www.google.com/maps/place/50.093461,-122.993468",8164,"Rural",5742,5456,"Yes","No","Yes","No ","Whistler Creek","FALSE","FALSE"]
[null,8165,"Pemberton","Yes","Yes","Yes","Squamish-Lillooet Regional District","Lower Mainland--Southwest",{"$nulls":8},"","","",null,0,0,null,null,{"$f":"IF(AB255=\"Y\",COUNT(#REF!), \"\")","v":""},null,"Pemberton","N",{"v":50.318067,"d":"50.31807"},{"v":-122.798189,"d":"-122.79819"},"http://www.google.com/maps/place/50.318067,-122.798189",8165,"Rural",790,331,"Yes","No","Yes","No ","Pemberton","FALSE","FALSE"]
[null,8166,"Mount Currie","Yes","Yes","Yes","Squamish-Lillooet Regional District","Lower Mainland--Southwest",{"$nulls":8},"","","",null,0,0,null,null,{"$f":"IF(AB256=\"Y\",COUNT(#REF!), \"\")","v":""},null,"Mount Currie","N",{"v":50.314754,"d":"50.31475"},{"v":-122.717994,"d":"-122.71799"},"http://www.google.com/maps/place/50.314754,-122.717994",8166,"Rural",874,435,"Yes","No","No","No ","Mount Currie","FALSE","FALSE"]
[null,8168,"Birken","No","No","No","Squamish-Lillooet Regional District","Lower Mainland--Southwest",{"$nulls":8},"","","",null,0,0,null,null,{"$f":"IF(AB257=\"Y\",COUNT(#REF!), \"\")","v":""},null,"Birken","N",{"v":50.4833,"d":"50.48330"},{"v":-122.6167,"d":"-122.61670"},"http://www.google.com/maps/place/50.4833,-122.6167",8168,"Rural",74,37,"No","Yes","Yes","No ","Birken","FALSE","FALSE"]
[null,8169,"D'Arcy*","No","No","No","Squamish-Lillooet Regional District","Lower Mainland--Southwest",{"$nulls":8},"","","",null,0,0,null,null,{"$f":"IF(AB258=\"Y\",COUNT(#REF!), \"\")","v":0},null,"D'Arcy","Y",{"v":50.55,"d":"50.55000"},{"v":-122.4833,"d":"-122.48330"},"http://www.google.com/maps/place/50.55,-122.4833",8169,"Rural First Nations Secondary Reserve",185,105,"No","Yes","No","No ","D'Arcy*","FALSE","FALSE"]
[null,8170,"Pemberton Meadows","Yes","Yes","Yes","Squamish-Lillooet Regional District","Lower Mainland--Southwest",{"$nulls":8},"","","",null,0,0,null,null,{"$f":"IF(AB259=\"Y\",COUNT(#REF!), \"\")","v":""},null,"Pemberton Meadows","N",{"v":50.4417,"d":"50.44170"},{"v":-122.9167,"d":"-122.91670"},"http://www.google.com/maps/place/50.4417,-122.9167",8170,"Rural",53,30,"Yes","No","Yes","No ","Pemberton Meadows","FALSE","FALSE"]
[null,8171,"Ogden","No","No","No","Squamish-Lillooet Regional District","Lower Mainland--Southwest",{"$nulls":8},"","","",null,0,0,null,null,{"$f":"IF(AB260=\"Y\",COUNT(#REF!), \"\")","v":""},null,"Ogden","N",{"v":50.7819,"d":"50.78190"},{"v":-122.8222,"d":"-122.82220"},"http://www.google.com/maps/place/50.7819,-122.8222",8171,"Rural",57,128,"No","Yes","Yes","No ","Ogden","FALSE","FALSE"]
[null,8172,"Gold Bridge","No","No","No","Squamish-Lillooet Regional District","Lower Mainland--Southwest",{"$nulls":8},"","","",null,0,0,null,null,{"$f":"IF(AB261=\"Y\",COUNT(#REF!), \"\")","v":""},null,"Gold Bridge","N",{"v":50.85,"d":"50.85000"},{"v":-122.833301,"d":"-122.83330"},"http://www.google.com/maps/place/50.85,-122.833301",8172,"Rural",67,184,"No","Yes","Yes","No ","Gold Bridge","FALSE","FALSE"]
[null,8173,"Horseshoe Bay","Yes","Yes","Yes","Metro Vancouver Regional District","Lower Mainland--Southwest",{"$nulls":8},"","","",null,0,0,null,null,{"$f":"IF(AB262=\"Y\",COUNT(#REF!), \"\")","v":""},null,"Horseshoe Bay","N",{"v":49.367379,"d":"49.36738"},{"v":-123.273102,"d":"-123.27310"},"http://www.google.com/maps/place/49.367379,-123.273102",8173,"Urban",5586,2300,"Yes","No","Yes","No ","Horseshoe Bay","FALSE","FALSE"]
[null,8174,"Snug Cove","Yes","Yes","Yes","Metro Vancouver Regional District","Lower Mainland--Southwest",{"$nulls":8},"","","",null,0,0,null,null,{"$f":"IF(AB263=\"Y\",COUNT(#REF!), \"\")","v":""},null,"Snug Cove","N",{"v":49.382937,"d":"49.38294"},{"v":-123.335712,"d":"-123.33571"},"http://www.google.com/maps/place/49.382937,-123.335712",8174,"Rural",1918,944,"No","Yes","Yes","No ","Snug Cove","FALSE","FALSE"]
[null,8175,"Gambier Harbour","Yes","Yes","Yes","Metro Vancouver Regional District","Lower Mainland--Southwest",{"$nulls":8},"","","",null,0,0,null,null,{"$f":"IF(AB264=\"Y\",COUNT(#REF!), \"\")","v":""},null,"Gambier Harbour","N",{"v":49.372801,"d":"49.37280"},{"v":-123.413788,"d":"-123.41379"},"http://www.google.com/maps/place/49.372801,-123.413788",8175,"Rural",1192,594,"No","Yes","No","No ","Gambier Harbour","FALSE","FALSE"]
[null,8176,"New Brighton","No","Yes","Yes","Sunshine Coast Regional District","Lower Mainland--Southwest",{"$nulls":8},"","","",null,0,0,null,null,{"$f":"IF(AB265=\"Y\",COUNT(#REF!), \"\")","v":""},null,"New Brighton","N",{"v":49.45,"d":"49.45000"},{"v":-123.433299,"d":"-123.43330"},"http://www.google.com/maps/place/49.45,-123.433299",8176,"Rural",101,323,"No","Yes","No","No ","New Brighton","FALSE","FALSE"]
[null,8177,"Gibsons","Yes","Yes","Yes","Sunshine Coast Regional District","Lower Mainland--Southwest",{"$nulls":8},"","","",null,0,0,null,null,{"$f":"IF(AB266=\"Y\",COUNT(#REF!), \"\")","v":""},null,"Gibsons","N",{"v":49.401757,"d":"49.40176"},{"v":-123.514423,"d":"-123.51442"},"http://www.google.com/maps/place/49.401757,-123.514423",8177,"Rural",8698,4192,"Yes","No","No","No ","Gibsons","FALSE","FALSE"]
[null,8178,"Williamsons Landing","Yes","Yes","Yes","Sunshine Coast Regional District","Lower Mainland--Southwest",{"$nulls":8},"","","",null,0,0,null,null,{"$f":"IF(AB267=\"Y\",COUNT(#REF!), \"\")","v":""},null,"Williamsons Landing","N",{"v":49.449749,"d":"49.44975"},{"v":-123.468572,"d":"-123.46857"},"http://www.google.com/maps/place/49.449749,-123.468572",8178,"Rural",1388,786,"Yes","No","Yes","No ","Williamsons Landing","FALSE","FALSE"]
[null,8179,"Langdale","Yes","Yes","Yes","Sunshine Coast Regional District","Lower Mainland--Southwest",{"$nulls":8},"","","",null,0,0,null,null,{"$f":"IF(AB268=\"Y\",COUNT(#REF!), \"\")","v":""},null,"Langdale","N",{"v":49.434078,"d":"49.43408"},{"v":-123.476525,"d":"-123.47653"},"http://www.google.com/maps/place/49.434078,-123.476525",8179,"Rural",1388,786,"Yes","No","Yes","No ","Langdale","FALSE","FALSE"]
[null,8180,"Roberts Creek","Yes","Yes","Yes","Sunshine Coast Regional District","Lower Mainland--Southwest",{"$nulls":8},"","","",null,0,0,null,null,{"$f":"IF(AB269=\"Y\",COUNT(#REF!), \"\")","v":""},null,"Roberts Creek","N",{"v":49.426045,"d":"49.42605"},{"v":-123.645618,"d":"-123.64562"},"http://www.google.com/maps/place/49.426045,-123.645618",8180,"Rural",1330,725,"Yes","No","Yes","No ","Roberts Creek","FALSE","FALSE"]
[null,8182,"Sechelt","Yes","Yes","Yes","Sunshine Coast Regional District","Lower Mainland--Southwest",{"$nulls":8},"","","",null,0,0,null,null,{"$f":"IF(AB270=\"Y\",COUNT(#REF!), \"\")","v":""},null,"Sechelt","N",{"v":49.479394,"d":"49.47939"},{"v":-123.762234,"d":"-123.76223"},"http://www.google.com/maps/place/49.479394,-123.762234",8182,"Rural",5865,2977,"Yes","No","Yes","No ","Sechelt","FALSE","FALSE"]
[null,8183,"Wilson Creek","Yes","Yes","Yes","Sunshine Coast Regional District","Lower Mainland--Southwest",{"$nulls":8},"","","",null,0,0,null,null,{"$f":"IF(AB271=\"Y\",COUNT(#REF!), \"\")","v":""},null,"Wilson Creek","N",{"v":49.440944,"d":"49.44094"},-123.71285,"http://www.google.com/maps/place/49.440944,-123.71285",8183,"Rural",2316,1208,"Yes","No","No","No ","Wilson Creek","FALSE","FALSE"]
[null,8184,"Davis Bay","Yes","Yes","Yes","Sunshine Coast Regional District","Lower Mainland--Southwest",{"$nulls":8},"","","",null,0,0,null,null,{"$f":"IF(AB272=\"Y\",COUNT(#REF!), \"\")","v":""},null,"Davis Bay","N",{"v":49.445312,"d":"49.44531"},{"v":-123.725533,"d":"-123.72553"},"http://www.google.com/maps/place/49.445312,-123.725533",8184,"Rural",2316,1208,"Yes","No","No","No ","Davis Bay","FALSE","FALSE"]
[null,8185,"Selma Park","Yes","Yes","Yes","Sunshine Coast Regional District","Lower Mainland--Southwest",{"$nulls":8},"","","",null,0,0,null,null,{"$f":"IF(AB273=\"Y\",COUNT(#REF!), \"\")","v":""},null,"Selma Park","N",{"v":49.458471,"d":"49.45847"},{"v":-123.733333,"d":"-123.73333"},"http://www.google.com/maps/place/49.458471,-123.733333",8185,"Rural",5865,2977,"Yes","No","No","No ","Selma Park","FALSE","FALSE"]
[null,8186,"Welcome Beach","Yes","Yes","Yes","Sunshine Coast Regional District","Lower Mainland--Southwest",{"$nulls":8},"","","",null,0,0,null,null,{"$f":"IF(AB274=\"Y\",COUNT(#REF!), \"\")","v":""},null,"Welcome Beach","N",{"v":49.480507,"d":"49.48051"},{"v":-123.891579,"d":"-123.89158"},"http://www.google.com/maps/place/49.480507,-123.891579",8186,"Rural",1276,626,"Yes","No","Yes","No ","Welcome Beach","FALSE","FALSE"]
[null,8187,"Halfmoon Bay","Yes","Yes","Yes","Sunshine Coast Regional District","Lower Mainland--Southwest",{"$nulls":8},"","","",null,0,0,null,null,{"$f":"IF(AB275=\"Y\",COUNT(#REF!), \"\")","v":""},null,"Halfmoon Bay","N",{"v":49.514568,"d":"49.51457"},-123.90862,"http://www.google.com/maps/place/49.514568,-123.90862",8187,"Rural",659,476,"Yes","No","Yes","No ","Halfmoon Bay","FALSE","FALSE"]
[null,8188,"Secret Cove","Yes","Yes","Yes","Sunshine Coast Regional District","Lower Mainland--Southwest",{"$nulls":8},"","","",null,0,0,null,null,{"$f":"IF(AB276=\"Y\",COUNT(#REF!), \"\")","v":""},null,"Secret Cove","N",{"v":49.536264,"d":"49.53626"},{"v":-123.951887,"d":"-123.95189"},"http://www.google.com/maps/place/49.536264,-123.951887",8188,"Rural",340,279,"Yes","No","Yes","No ","Secret Cove","FALSE","FALSE"]
[null,8189,"Madeira Park","Yes","Yes","Yes","Sunshine Coast Regional District","Lower Mainland--Southwest",{"$nulls":8},"","","",null,0,0,null,null,{"$f":"IF(AB277=\"Y\",COUNT(#REF!), \"\")","v":""},null,"Madeira Park","N",49.61573,{"v":-124.019742,"d":"-124.01974"},"http://www.google.com/maps/place/49.61573,-124.019742",8189,"Rural",1422,1062,"Yes","No","Yes","No ","Madeira Park","FALSE","FALSE"]
[null,8190,"Pope Landing","Yes","Yes","Yes","Sunshine Coast Regional District","Lower Mainland--Southwest",{"$nulls":8},"","","",null,0,0,null,null,{"$f":"IF(AB278=\"Y\",COUNT(#REF!), \"\")","v":""},null,"Pope Landing","N",{"v":49.614544,"d":"49.61454"},{"v":-124.048368,"d":"-124.04837"},"http://www.google.com/maps/place/49.614544,-124.048368",8190,"Rural",1422,1062,"Yes","No","No","No ","Pope Landing","FALSE","FALSE"]
[null,8191,"Donnely Landing","Yes","Yes","Yes","Sunshine Coast Regional District","Lower Mainland--Southwest",{"$nulls":8},"","","",null,0,0,null,null,{"$f":"IF(AB279=\"Y\",COUNT(#REF!), \"\")","v":""},null,"Donnely Landing","N",{"v":49.624961,"d":"49.62496"},{"v":-124.043204,"d":"-124.04320"},"http://www.google.com/maps/place/49.624961,-124.043204",8191,"Rural",1422,1062,"Yes","No","No","No ","Donnely Landing","FALSE","FALSE"]
[null,8192,"Garden Bay","Yes","Yes","Yes","Sunshine Coast Regional District","Lower Mainland--Southwest",{"$nulls":8},"","","",null,0,0,null,null,{"$f":"IF(AB280=\"Y\",COUNT(#REF!), \"\")","v":""},null,"Garden Bay","N",{"v":49.636639,"d":"49.63664"},{"v":-124.033622,"d":"-124.03362"},"http://www.google.com/maps/place/49.636639,-124.033622",8192,"Rural",1422,1062,"Yes","No","No","No ","Garden Bay","FALSE","FALSE"]
[null,8193,"Gillies Bay","No","No","Yes","qathet Regional District","Vancouver Island and Coast",{"$nulls":8},"","","",null,0,0,null,null,{"$f":"IF(AB281=\"Y\",COUNT(#REF!), \"\")","v":""},null,"Gillies Bay","N",{"v":49.6833,"d":"49.68330"},{"v":-124.4833,"d":"-124.48330"},"http://www.google.com/maps/place/49.6833,-124.4833",8193,"Rural",391,252,"No","Yes","No","No ","Gillies Bay","FALSE","FALSE"]
[null,8194,"Stillwater","Yes","Yes","Yes","qathet Regional District","Vancouver Island and Coast",{"$nulls":8},"","","",null,0,0,null,null,{"$f":"IF(AB282=\"Y\",COUNT(#REF!), \"\")","v":""},null,"Stillwater","N",{"v":49.7667,"d":"49.76670"},{"v":-124.3,"d":"-124.30000"},"http://www.google.com/maps/place/49.7667,-124.3",8194,"Rural",131,95,"Yes","No","No","No ","Stillwater","FALSE","FALSE"]
[null,8195,"Marshall School Junction","No","No","Yes","qathet Regional District","Vancouver Island and Coast",{"$nulls":8},"","","",null,0,0,null,null,{"$f":"IF(AB283=\"Y\",COUNT(#REF!), \"\")","v":""},null,"Marshall School Junction","N",{"v":49.7111,"d":"49.71110"},{"v":-124.5086,"d":"-124.50860"},"http://www.google.com/maps/place/49.7111,-124.5086",8195,"Rural",120,84,"No","Yes","No","No ","Marshall School Junction","FALSE","FALSE"]
[null,8196,"Van Anda","No","Yes","Yes","qathet Regional District","Vancouver Island and Coast",{"$nulls":8},"","","",null,0,0,null,null,{"$f":"IF(AB284=\"Y\",COUNT(#REF!), \"\")","v":""},null,"Van Anda","N",{"v":49.7583,"d":"49.75830"},{"v":-124.550001,"d":"-124.55000"},"http://www.google.com/maps/place/49.7583,-124.550001",8196,"Rural",322,220,"No","Yes","Yes","No ","Van Anda","FALSE","FALSE"]
[null,8197,"Lang Bay","Yes","Yes","Yes","qathet Regional District","Vancouver Island and Coast",{"$nulls":8},"","","",null,0,0,null,null,{"$f":"IF(AB285=\"Y\",COUNT(#REF!), \"\")","v":""},null,"Lang Bay","N",{"v":49.779184,"d":"49.77918"},{"v":-124.345665,"d":"-124.34567"},"http://www.google.com/maps/place/49.779184,-124.345665",8197,"Rural",1213,645,"Yes","No","Yes","No ","Lang Bay","FALSE","FALSE"]
[null,8198,"Brew Bay","Yes","Yes","Yes","qathet Regional District","Vancouver Island and Coast",{"$nulls":8},"","","",null,0,0,null,null,{"$f":"IF(AB286=\"Y\",COUNT(#REF!), \"\")","v":""},null,"Brew Bay","N",{"v":49.775789,"d":"49.77579"},{"v":-124.371108,"d":"-124.37111"},"http://www.google.com/maps/place/49.775789,-124.371108",8198,"Rural",1213,645,"Yes","No","No","No ","Brew Bay","FALSE","FALSE"]
[null,8199,"Myrtle Point","Yes","Yes","Yes","qathet Regional District","Vancouver Island and Coast",{"$nulls":8},"","","",null,0,0,null,null,{"$f":"IF(AB287=\"Y\",COUNT(#REF!), \"\")","v":""},null,"Myrtle Point","N",{"v":49.801185,"d":"49.80119"},{"v":-124.480551,"d":"-124.48055"},"http://www.google.com/maps/place/49.801185,-124.480551",8199,"Rural",7874,3801,"Yes","No","No","No ","Myrtle Point","FALSE","FALSE"]
[null,8200,"Barney's Bar","Yes","Yes","Yes","qathet Regional District","Vancouver Island and Coast",{"$nulls":8},"","","",null,0,0,null,null,{"$f":"IF(AB288=\"Y\",COUNT(#REF!), \"\")","v":""},null,"Barney's Bar","N",{"v":49.784503,"d":"49.78450"},{"v":-124.444137,"d":"-124.44414"},"http://www.google.com/maps/place/49.784503,-124.444137",8200,"Rural",943,472,"Yes","No","Yes","No ","Barney's Bar","FALSE","FALSE"]
[null,8201,"Pinetree","Yes","Yes","Yes","qathet Regional District","Vancouver Island and Coast",{"$nulls":8},"","","",null,0,0,null,null,{"$f":"IF(AB289=\"Y\",COUNT(#REF!), \"\")","v":""},null,"Pinetree","N",{"v":49.775021,"d":"49.77502"},{"v":-124.418874,"d":"-124.41887"},"http://www.google.com/maps/place/49.775021,-124.418874",8201,"Rural",943,472,"Yes","No","No","No ","Pinetree","FALSE","FALSE"]
[null,8202,{"$f":"HYPERLINK(AE290,AN290)","v":"Black Point"},"Yes","Yes","Yes","qathet Regional District","Vancouver Island and Coast",{"$nulls":8},{"$f":"IF(L290=\"\",\"\",\nIF(SUM((J290*L290)/M290)<=N290,\"Sufficient Capacity\",\nIF(SUM((J290*L290)/M290)>N290,\"Not Enough Capacity\",\"Error\")))","v":""},{"$f":"IF(OR(ISBLANK(J290),ISBLANK(L290),ISBLANK(M290)), \"\",(J290*L290/M290))","v":""},{"$f":"IF(AND(COUNT(N290,R290)=2, OR($O$10=\"Last-Mile\", $O$10=\"Transport & Last-Mile\")), N290-R290, \"\")","v":""},null,{"$f":"IF(AND(AB290=\"Y\",I290<>\"\"),1,0)","v":0},{"$f":"IF(AND(AB290=\"Y\",I290=\"Last-Mile & Transport\"),1,0)","v":0},null,null,{"$f":"IF(AB290=\"Y\",COUNT(#REF!), \"\")","v":""},null,"Black Point","N",{"v":49.773964,"d":"49.77396"},{"v":-124.394159,"d":"-124.39416"},"http://www.google.com/maps/place/49.773964,-124.394159",8202,"Rural",1213,645,"Yes","No","No","No ",{"$f":"IF(AB290=\"Y\", CONCATENATE(AA290,\"*\"), AA290)","v":"Black Point"},{"$f":"IF(I290=\"Last-Mile\",\"TRUE\",IF(I290=\"Transport & Last-Mile\",\"TRUE\",\"FALSE\"))","v":"FALSE"},{"$f":"IF(I290=\"Transport\",\"TRUE\",IF(I290=\"Transport & Last-Mile\",\"TRUE\",\"FALSE\"))","v":"FALSE"}]
[null,8203,"Lasqueti","No","No","Yes","qathet Regional District","Vancouver Island and Coast",{"$nulls":8},"","","",null,0,0,null,null,{"$f":"IF(AB291=\"Y\",COUNT(#REF!), \"\")","v":""},null,"Lasqueti","N",{"v":49.491822,"d":"49.49182"},{"v":-124.346824,"d":"-124.34682"},"http://www.google.com/maps/place/49.491822,-124.346824",8203,"Rural",208,241,"No","Yes","Yes","No ","Lasqueti","FALSE","FALSE"]
[null,8204,"Earls Cove","No","No","Yes","Sunshine Coast Regional District","Lower Mainland--Southwest",{"$nulls":8},"","","",null,0,0,null,null,{"$f":"IF(AB292=\"Y\",COUNT(#REF!), \"\")","v":""},null,"Earls Cove","N",{"v":49.75,"d":"49.75000"},{"v":-124.000001,"d":"-124.00000"},"http://www.google.com/maps/place/49.75,-124.000001",8204,"Rural",80,68,"No","Yes","No","No ","Earls Cove","FALSE","FALSE"]
[null,8205,"Egmont","No","No","Yes","Sunshine Coast Regional District","Lower Mainland--Southwest",{"$nulls":8},"","","",null,0,0,null,null,{"$f":"IF(AB293=\"Y\",COUNT(#REF!), \"\")","v":""},null,"Egmont","N",{"v":49.75,"d":"49.75000"},{"v":-123.9333,"d":"-123.93330"},"http://www.google.com/maps/place/49.75,-123.9333",8205,"Rural",70,77,"No","Yes","Yes","No ","Egmont","FALSE","FALSE"]
[null,8206,"Tuwanek","Yes","Yes","Yes","Sunshine Coast Regional District","Lower Mainland--Southwest",{"$nulls":8},"","","",null,0,0,null,null,{"$f":"IF(AB294=\"Y\",COUNT(#REF!), \"\")","v":""},null,"Tuwanek","N",{"v":49.544235,"d":"49.54424"},{"v":-123.756808,"d":"-123.75681"},"http://www.google.com/maps/place/49.544235,-123.756808",8206,"Rural",142,143,"Yes","No","Yes","No ","Tuwanek","FALSE","FALSE"]
[null,8207,"Saltery Bay","No","No","Yes","qathet Regional District","Vancouver Island and Coast",{"$nulls":8},"","","",null,0,0,null,null,{"$f":"IF(AB295=\"Y\",COUNT(#REF!), \"\")","v":""},null,"Saltery Bay","N",{"v":49.7833,"d":"49.78330"},{"v":-124.183299,"d":"-124.18330"},"http://www.google.com/maps/place/49.7833,-124.183299",8207,"Rural",181,90,"No","Yes","Yes","No ","Saltery Bay","FALSE","FALSE"]
[null,8208,"Powell River","Yes","Yes","Yes","qathet Regional District","Vancouver Island and Coast",{"$nulls":8},"","","",null,0,0,null,null,{"$f":"IF(AB296=\"Y\",COUNT(#REF!), \"\")","v":""},null,"Powell River","N",{"v":49.871999,"d":"49.87200"},{"v":-124.546497,"d":"-124.54650"},"http://www.google.com/maps/place/49.871999,-124.546497",8208,"Rural",2342,1183,"Yes","No","Yes","No ","Powell River","FALSE","FALSE"]
[null,8210,"Wildwood","Yes","Yes","Yes","qathet Regional District","Vancouver Island and Coast",{"$nulls":8},"","","",null,0,0,null,null,{"$f":"IF(AB297=\"Y\",COUNT(#REF!), \"\")","v":""},null,"Wildwood","N",{"v":49.891027,"d":"49.89103"},{"v":-124.557127,"d":"-124.55713"},"http://www.google.com/maps/place/49.891027,-124.557127",8210,"Rural",1569,743,"Yes","No","Yes","No ","Wildwood","FALSE","FALSE"]
[null,8211,"Westview","Yes","Yes","Yes","qathet Regional District","Vancouver Island and Coast",{"$nulls":8},"","","",null,0,0,null,null,{"$f":"IF(AB298=\"Y\",COUNT(#REF!), \"\")","v":""},null,"Westview","N",{"v":49.836397,"d":"49.83640"},{"v":-124.524637,"d":"-124.52464"},"http://www.google.com/maps/place/49.836397,-124.524637",8211,"Rural",7874,3801,"Yes","No","Yes","No ","Westview","FALSE","FALSE"]
[null,8212,"Cranberry","Yes","Yes","Yes","qathet Regional District","Vancouver Island and Coast",{"$nulls":8},"","","",null,0,0,null,null,{"$f":"IF(AB299=\"Y\",COUNT(#REF!), \"\")","v":""},null,"Cranberry","N",{"v":49.870214,"d":"49.87021"},{"v":-124.523161,"d":"-124.52316"},"http://www.google.com/maps/place/49.870214,-124.523161",8212,"Rural",2267,1093,"Yes","No","No","No ","Cranberry","FALSE","FALSE"]
[null,8213,"Lund","No","No","Yes","qathet Regional District","Vancouver Island and Coast",{"$nulls":8},"","","",null,0,0,null,null,{"$f":"IF(AB300=\"Y\",COUNT(#REF!), \"\")","v":""},null,"Lund","N",{"v":49.981775,"d":"49.98178"},{"v":-124.756873,"d":"-124.75687"},"http://www.google.com/maps/place/49.981775,-124.756873",8213,"Rural",442,260,"No","Yes","Yes","No ","Lund","FALSE","FALSE"]
[null,8214,"Malibu","No","No","No","Sunshine Coast Regional District","Lower Mainland--Southwest",{"$nulls":8},"","","",null,0,0,null,null,{"$f":"IF(AB301=\"Y\",COUNT(#REF!), \"\")","v":""},null,"Malibu","N",{"v":50.167134,"d":"50.16713"},{"v":-123.851158,"d":"-123.85116"},"http://www.google.com/maps/place/50.167134,-123.851158",8214,"Rural",35,43,"No","Yes","No","No ","Malibu","FALSE","FALSE"]
[null,8215,"Garibaldi","Yes","Yes","Yes","Squamish-Lillooet Regional District","Lower Mainland--Southwest",{"$nulls":8},"","","",null,0,0,null,null,{"$f":"IF(AB302=\"Y\",COUNT(#REF!), \"\")","v":""},null,"Garibaldi","N",{"v":49.966699,"d":"49.96670"},{"v":-123.15,"d":"-123.15000"},"http://www.google.com/maps/place/49.966699,-123.15",8215,"Rural",15,12,"No","Yes","No","No ","Garibaldi","FALSE","FALSE"]
[null,8216,"Mansons Landing","No","No","Yes","Strathcona Regional District","Vancouver Island and Coast",{"$nulls":8},"","","",null,0,0,null,null,{"$f":"IF(AB303=\"Y\",COUNT(#REF!), \"\")","v":""},null,"Mansons Landing","N",{"v":50.058144,"d":"50.05814"},{"v":-124.979574,"d":"-124.97957"},"http://www.google.com/maps/place/50.058144,-124.979574",8216,"Rural",222,173,"No","Yes","No","No ","Mansons Landing","FALSE","FALSE"]
[null,8218,"Whaletown","No","No","Yes","Strathcona Regional District","Vancouver Island and Coast",{"$nulls":8},"","","",null,0,0,null,null,{"$f":"IF(AB304=\"Y\",COUNT(#REF!), \"\")","v":""},null,"Whaletown","N",{"v":50.101192,"d":"50.10119"},{"v":-125.046777,"d":"-125.04678"},"http://www.google.com/maps/place/50.101192,-125.046777",8218,"Rural",321,221,"No","Yes","Yes","No ","Whaletown","FALSE","FALSE"]
[null,8219,"Read Island","No","No","Yes","Strathcona Regional District","Vancouver Island and Coast",{"$nulls":8},"","","",null,0,0,null,null,{"$f":"IF(AB305=\"Y\",COUNT(#REF!), \"\")","v":""},null,"Read Island","N",{"v":50.181173,"d":"50.18117"},{"v":-125.085931,"d":"-125.08593"},"http://www.google.com/maps/place/50.181173,-125.085931",8219,"Rural",33,28,"No","Yes","Yes","No ","Read Island","FALSE","FALSE"]
[null,8220,"Samahquam*","No","No","No","Fraser Valley Regional District","Lower Mainland--Southwest",{"$nulls":8},"","","",null,0,0,null,null,{"$f":"IF(AB306=\"Y\",COUNT(#REF!), \"\")","v":0},null,"Samahquam","Y",{"v":50.051308,"d":"50.05131"},{"v":-122.539473,"d":"-122.53947"},"http://www.google.com/maps/place/50.051308,-122.539473",8220,"Rural First Nations Secondary Reserve",80,24,"No","Yes","No","No ","Samahquam*","FALSE","FALSE"]
[null,8222,"Tipella","No","No","No","Fraser Valley Regional District","Lower Mainland--Southwest",{"$nulls":8},"","","",null,0,0,null,null,{"$f":"IF(AB307=\"Y\",COUNT(#REF!), \"\")","v":""},null,"Tipella","N",{"v":49.744625,"d":"49.74463"},{"v":-122.153829,"d":"-122.15383"},"http://www.google.com/maps/place/49.744625,-122.153829",8222,"Rural",11,9,"No","Yes","Yes","No ","Tipella","FALSE","FALSE"]
[null,8223,"Bear Creek","No","No ","No","Fraser Valley Regional District","Lower Mainland--Southwest",{"$nulls":8},"","","",null,0,0,null,null,{"$f":"IF(AB308=\"Y\",COUNT(#REF!), \"\")","v":""},null,"Bear Creek","N",49.52898,{"v":-121.761295,"d":"-121.76130"},"http://www.google.com/maps/place/49.52898,-121.761295",8223,"Rural",1,5,"No","Yes","No","No ","Bear Creek","FALSE","FALSE"]
[null,8224,"Silver River","No","No","No","Fraser Valley Regional District","Lower Mainland--Southwest",{"$nulls":8},"","","",null,0,0,null,null,{"$f":"IF(AB309=\"Y\",COUNT(#REF!), \"\")","v":""},null,"Silver River","N",49.57559,{"v":-121.818071,"d":"-121.81807"},"http://www.google.com/maps/place/49.57559,-121.818071",8224,"Rural",1,5,"No","Yes","Yes","No ","Silver River","FALSE","FALSE"]
[null,8225,"Dogwood Valley","No","Yes","Yes","Fraser Valley Regional District","Lower Mainland--Southwest",{"$nulls":8},"","","",null,0,0,null,null,{"$f":"IF(AB310=\"Y\",COUNT(#REF!), \"\")","v":""},null,"Dogwood Valley","N",{"v":49.484456,"d":"49.48446"},{"v":-121.425192,"d":"-121.42519"},"http://www.google.com/maps/place/49.484456,-121.425192",8225,"Rural",179,103,"No","Yes","Yes","No ","Dogwood Valley","FALSE","FALSE"]
[null,8226,"Squeah","No","No","Yes","Fraser Valley Regional District","Lower Mainland--Southwest",{"$nulls":8},"","","",null,0,0,null,null,{"$f":"IF(AB311=\"Y\",COUNT(#REF!), \"\")","v":""},null,"Squeah","N",49.50422,{"v":-121.420497,"d":"-121.42050"},"http://www.google.com/maps/place/49.50422,-121.420497",8226,"Rural",179,103,"No","Yes","No","No ","Squeah","FALSE","FALSE"]
[null,8228,"Yale*","No","Yes","Yes","Fraser Valley Regional District","Lower Mainland--Southwest",{"$nulls":8},"","","",null,0,0,null,null,{"$f":"IF(AB312=\"Y\",COUNT(#REF!), \"\")","v":0},null,"Yale","Y",{"v":49.471157,"d":"49.47116"},{"v":-121.425282,"d":"-121.42528"},"http://www.google.com/maps/place/49.471157,-121.425282",8228,"Rural First Nations Secondary Reserve",179,103,"No","Yes","Yes","No ","Yale*","FALSE","FALSE"]
[null,8229,"Spuzzum","Yes","Yes","Yes","Fraser Valley Regional District","Lower Mainland--Southwest",{"$nulls":8},"","","",null,0,0,null,null,{"$f":"IF(AB313=\"Y\",COUNT(#REF!), \"\")","v":""},null,"Spuzzum","N",49.68864,{"v":-121.416755,"d":"-121.41676"},"http://www.google.com/maps/place/49.68864,-121.416755",8229,"Rural",22,17,"No","Yes","No","No ","Spuzzum","FALSE","FALSE"]
[null,8231,"North Bend","Yes","Yes","Yes","Fraser Valley Regional District","Lower Mainland--Southwest",{"$nulls":8},"","","",null,0,0,null,null,{"$f":"IF(AB314=\"Y\",COUNT(#REF!), \"\")","v":""},null,"North Bend","N",{"v":49.883299,"d":"49.88330"},{"v":-121.449999,"d":"-121.45000"},"http://www.google.com/maps/place/49.883299,-121.449999",8231,"Rural",96,83,"Yes","No","Yes","No ","North Bend","FALSE","FALSE"]
[null,8232,"Boston Bar","Yes","Yes","Yes","Fraser Valley Regional District","Lower Mainland--Southwest",{"$nulls":8},"","","",null,0,0,null,null,{"$f":"IF(AB315=\"Y\",COUNT(#REF!), \"\")","v":""},null,"Boston Bar","N",49.86244,{"v":-121.443288,"d":"-121.44329"},"http://www.google.com/maps/place/49.86244,-121.443288",8232,"Rural",232,165,"Yes","No","No","No ","Boston Bar","FALSE","FALSE"]
[null,8236,"Lytton*","No","No","Yes","Thompson-Nicola Regional District","Thompson--Okanagan",{"$nulls":8},"","","",null,0,0,null,null,{"$f":"IF(AB316=\"Y\",COUNT(#REF!), \"\")","v":0},null,"Lytton","Y",{"v":50.200935,"d":"50.20094"},-121.57214,"http://www.google.com/maps/place/50.200935,-121.57214",8236,"Rural First Nations Secondary Reserve",43,18,"No","No","Yes","No ","Lytton*","FALSE","FALSE"]
[null,8237,"Lytton","Yes","Yes","Yes","Thompson-Nicola Regional District","Thompson--Okanagan",{"$nulls":8},"","","",null,0,0,null,null,{"$f":"IF(AB317=\"Y\",COUNT(#REF!), \"\")","v":""},null,"Lytton","N",{"v":50.231566,"d":"50.23157"},{"v":-121.582557,"d":"-121.58256"},"http://www.google.com/maps/place/50.231566,-121.582557",8237,"Rural",607,276,"Yes","No","Yes","No ","Lytton","FALSE","FALSE"]
[null,8239,"Lower Nicola","Yes","Yes","Yes","Thompson-Nicola Regional District","Thompson--Okanagan",{"$nulls":8},"","","",null,0,0,null,null,{"$f":"IF(AB318=\"Y\",COUNT(#REF!), \"\")","v":""},null,"Lower Nicola","N",{"v":50.159696,"d":"50.15970"},{"v":-120.878304,"d":"-120.87830"},"http://www.google.com/maps/place/50.159696,-120.878304",8239,"Rural",1090,539,"No","Yes","No","No ","Lower Nicola","FALSE","FALSE"]
[null,8240,"Merritt","Yes","Yes","Yes","Thompson-Nicola Regional District","Thompson--Okanagan",{"$nulls":8},"","","",null,0,0,null,null,{"$f":"IF(AB319=\"Y\",COUNT(#REF!), \"\")","v":""},null,"Merritt","N",{"v":50.111408,"d":"50.11141"},{"v":-120.789691,"d":"-120.78969"},"http://www.google.com/maps/place/50.111408,-120.789691",8240,"Rural",2977,1433,"Yes","No","No","No ","Merritt","FALSE","FALSE"]
[null,8244,"Lytton*","No","No","Yes","Thompson-Nicola Regional District","Thompson--Okanagan",{"$nulls":8},"","","",null,0,0,null,null,{"$f":"IF(AB320=\"Y\",COUNT(#REF!), \"\")","v":0},null,"Lytton","Y",{"v":50.304382,"d":"50.30438"},{"v":-121.649164,"d":"-121.64916"},"http://www.google.com/maps/place/50.304382,-121.649164",8244,"Rural First Nations Secondary Reserve",27,12,"No","Yes","Yes","No ","Lytton*","FALSE","FALSE"]
[null,8246,"Lillooet","No","Yes","Yes","Squamish-Lillooet Regional District","Lower Mainland--Southwest",{"$nulls":8},"","","",null,0,0,null,null,{"$f":"IF(AB321=\"Y\",COUNT(#REF!), \"\")","v":""},null,"Lillooet","N",{"v":50.694058,"d":"50.69406"},{"v":-121.938662,"d":"-121.93866"},"http://www.google.com/maps/place/50.694058,-121.938662",8246,"Rural",1790,965,"No","Yes","Yes","No ","Lillooet","FALSE","FALSE"]
[null,8251,"South Shalalth","No","No","No","Squamish-Lillooet Regional District","Lower Mainland--Southwest",{"$nulls":8},"","","",null,0,0,null,null,{"$f":"IF(AB322=\"Y\",COUNT(#REF!), \"\")","v":""},null,"South Shalalth","N",50.72883,{"v":-122.244354,"d":"-122.24435"},"http://www.google.com/maps/place/50.72883,-122.244354",8251,"Rural",38,25,"No","Yes","No","No ","South Shalalth","FALSE","FALSE"]
[null,8252,"Seton Portage","No","No","No","Squamish-Lillooet Regional District","Lower Mainland--Southwest",{"$nulls":8},"","","",null,0,0,null,null,{"$f":"IF(AB323=\"Y\",COUNT(#REF!), \"\")","v":""},null,"Seton Portage","N",{"v":50.706903,"d":"50.70690"},{"v":-122.288958,"d":"-122.28896"},"http://www.google.com/maps/place/50.706903,-122.288958",8252,"Rural",79,48,"No","Yes","No","No ","Seton Portage","FALSE","FALSE"]
[null,8253,"Seton Lake*","No","No","No","Squamish-Lillooet Regional District","Lower Mainland--Southwest",{"$nulls":8},"","","",null,0,0,null,null,{"$f":"IF(AB324=\"Y\",COUNT(#REF!), \"\")","v":0},null,"Seton Lake","Y",{"v":50.704731,"d":"50.70473"},{"v":-122.281307,"d":"-122.28131"},"http://www.google.com/maps/place/50.704731,-122.281307",8253,"Rural First Nations Primary Reserve",79,48,"No","Yes","Yes","No ","Seton Lake*","FALSE","FALSE"]
[null,8254,"Ts'kw'aylaxw*","No","No","No","Thompson-Nicola Regional District","Thompson--Okanagan",{"$nulls":8},"","","",null,0,0,null,null,{"$f":"IF(AB325=\"Y\",COUNT(#REF!), \"\")","v":0},null,"Ts'kw'aylaxw","Y",{"v":50.8167,"d":"50.81670"},{"v":-121.666701,"d":"-121.66670"},"http://www.google.com/maps/place/50.8167,-121.666701",8254,"Rural First Nations Secondary Reserve",32,14,"No","Yes","No","No ","Ts'kw'aylaxw*","FALSE","FALSE"]
[null,8255,"Upper Hat Creek 1 (Bonaparte)*","No","No","No","Thompson-Nicola Regional District","Thompson--Okanagan",{"$nulls":8},"","","",null,0,0,null,null,{"$f":"IF(AB326=\"Y\",COUNT(#REF!), \"\")","v":0},null,"Upper Hat Creek 1 (Bonaparte)","Y",{"v":50.8167,"d":"50.81670"},{"v":-121.5833,"d":"-121.58330"},"http://www.google.com/maps/place/50.8167,-121.5833",8255,"Rural First Nations Secondary Reserve",23,12,"No","Yes","No","No ","Upper Hat Creek 1 (Bonaparte)*","FALSE","FALSE"]
[null,8256,"Lower Hat Creek 2 (Bonaparte)*","No","No","No","Thompson-Nicola Regional District","Thompson--Okanagan",{"$nulls":8},"","","",null,0,0,null,null,{"$f":"IF(AB327=\"Y\",COUNT(#REF!), \"\")","v":0},null,"Lower Hat Creek 2 (Bonaparte)","Y",{"v":50.88402222,"d":"50.88402"},{"v":-121.493,"d":"-121.49300"},"http://www.google.com/maps/place/50.88402222,-121.493",8256,"Rural First Nations Secondary Reserve",23,17,"No","Yes","Yes","No ","Lower Hat Creek 2 (Bonaparte)*","FALSE","FALSE"]
[null,8258,"Moha","No","No","No","Squamish-Lillooet Regional District","Lower Mainland--Southwest",{"$nulls":8},"","","",null,0,0,null,null,{"$f":"IF(AB328=\"Y\",COUNT(#REF!), \"\")","v":""},null,"Moha","N",{"v":50.864141,"d":"50.86414"},{"v":-122.169651,"d":"-122.16965"},"http://www.google.com/maps/place/50.864141,-122.169651",8258,"Rural",18,14,"No","Yes","No","No ","Moha","FALSE","FALSE"]
[null,8259,"Lytton*","No","No","No","Thompson-Nicola Regional District","Thompson--Okanagan",{"$nulls":8},"","","",null,0,0,null,null,{"$f":"IF(AB329=\"Y\",COUNT(#REF!), \"\")","v":0},null,"Lytton","Y",{"v":50.441462,"d":"50.44146"},{"v":-121.712542,"d":"-121.71254"},"http://www.google.com/maps/place/50.441462,-121.712542",8259,"Rural First Nations Secondary Reserve",14,10,"No","Yes","Yes","No ","Lytton*","FALSE","FALSE"]
[null,8260,"T'it'q'et*","No","No","Yes","Squamish-Lillooet Regional District","Lower Mainland--Southwest",{"$nulls":8},"","","",null,0,0,null,null,{"$f":"IF(AB330=\"Y\",COUNT(#REF!), \"\")","v":0},null,"T'it'q'et","Y",{"v":50.5833,"d":"50.58330"},{"v":-121.85,"d":"-121.85000"},"http://www.google.com/maps/place/50.5833,-121.85",8260,"Rural First Nations Secondary Reserve",116,54,"No","Yes","Yes","No ","T'it'q'et*","FALSE","FALSE"]
[null,8261,"Clinton","Yes","Yes","Yes","Thompson-Nicola Regional District","Thompson--Okanagan",{"$nulls":8},"","","",null,0,0,null,null,{"$f":"IF(AB331=\"Y\",COUNT(#REF!), \"\")","v":""},null,"Clinton","N",{"v":51.094184,"d":"51.09418"},-121.58679,"http://www.google.com/maps/place/51.094184,-121.58679",8261,"Rural",688,403,"No","Yes","Yes","No ","Clinton","FALSE","FALSE"]
[null,8262,"Chasm","No","No","Yes","Thompson-Nicola Regional District","Thompson--Okanagan",{"$nulls":8},"","","",null,0,0,null,null,{"$f":"IF(AB332=\"Y\",COUNT(#REF!), \"\")","v":""},null,"Chasm","N",{"v":51.216699,"d":"51.21670"},{"v":-121.483301,"d":"-121.48330"},"http://www.google.com/maps/place/51.216699,-121.483301",8262,"Rural",14,9,"No","Yes","No","No ","Chasm","FALSE","FALSE"]
[null,8263,"70 Mile House","No","Yes","Yes","Thompson-Nicola Regional District","Thompson--Okanagan",{"$nulls":8},"","","",null,0,0,null,null,{"$f":"IF(AB333=\"Y\",COUNT(#REF!), \"\")","v":""},null,"70 Mile House","N",{"v":51.308437,"d":"51.30844"},{"v":-121.396005,"d":"-121.39601"},"http://www.google.com/maps/place/51.308437,-121.396005",8263,"Rural",56,40,"No","Yes","No","No ","70 Mile House","FALSE","FALSE"]
[null,8265,"Cache Creek","Yes","Yes","Yes","Thompson-Nicola Regional District","Thompson--Okanagan",{"$nulls":8},"","","",null,0,0,null,null,{"$f":"IF(AB334=\"Y\",COUNT(#REF!), \"\")","v":""},null,"Cache Creek","N",{"v":50.811944,"d":"50.81194"},{"v":-121.323334,"d":"-121.32333"},"http://www.google.com/maps/place/50.811944,-121.323334",8265,"Rural",1008,516,"No","Yes","No","No ","Cache Creek","FALSE","FALSE"]
[null,8266,"Ashcroft","Yes","Yes","Yes","Thompson-Nicola Regional District","Thompson--Okanagan",{"$nulls":8},"","","",null,0,0,null,null,{"$f":"IF(AB335=\"Y\",COUNT(#REF!), \"\")","v":""},null,"Ashcroft","N",{"v":50.721109,"d":"50.72111"},{"v":-121.280668,"d":"-121.28067"},"http://www.google.com/maps/place/50.721109,-121.280668",8266,"Rural",1302,669,"No","Yes","No","No ","Ashcroft","FALSE","FALSE"]
[null,8268,"Boston Flats","No","No","Yes","Thompson-Nicola Regional District","Thompson--Okanagan",{"$nulls":8},"","","",null,0,0,null,null,{"$f":"IF(AB336=\"Y\",COUNT(#REF!), \"\")","v":""},null,"Boston Flats","N",{"v":50.769855,"d":"50.76986"},{"v":-121.304062,"d":"-121.30406"},"http://www.google.com/maps/place/50.769855,-121.304062",8268,"Rural",1008,516,"No","Yes","No","No ","Boston Flats","FALSE","FALSE"]
[null,8269,"Walhachin","No","No","Yes","Thompson-Nicola Regional District","Thompson--Okanagan",{"$nulls":8},"","","",null,0,0,null,null,{"$f":"IF(AB337=\"Y\",COUNT(#REF!), \"\")","v":""},null,"Walhachin","N",50.75145,{"v":-120.990691,"d":"-120.99069"},"http://www.google.com/maps/place/50.75145,-120.990691",8269,"Rural",396,235,"No","Yes","Yes","No ","Walhachin","FALSE","FALSE"]
[null,8270,"Oregon Jack Creek*","No","No","Yes","Thompson-Nicola Regional District","Thompson--Okanagan",{"$nulls":8},"","","",null,0,0,null,null,{"$f":"IF(AB338=\"Y\",COUNT(#REF!), \"\")","v":0},null,"Oregon Jack Creek","Y",{"v":50.666701,"d":"50.66670"},{"v":-121.266699,"d":"-121.26670"},"http://www.google.com/maps/place/50.666701,-121.266699",8270,"Rural First Nations Secondary Reserve",54,19,"No","Yes","Yes","No ","Oregon Jack Creek*","FALSE","FALSE"]
[null,8272,"Spences Bridge","No","Yes","Yes","Thompson-Nicola Regional District","Thompson--Okanagan",{"$nulls":8},"","","",null,0,0,null,null,{"$f":"IF(AB339=\"Y\",COUNT(#REF!), \"\")","v":""},null,"Spences Bridge","N",{"v":50.423355,"d":"50.42336"},{"v":-121.344062,"d":"-121.34406"},"http://www.google.com/maps/place/50.423355,-121.344062",8272,"Rural",114,69,"No","Yes","Yes","No ","Spences Bridge","FALSE","FALSE"]
[null,8276,"Logan Lake","No","No","Yes","Thompson-Nicola Regional District","Thompson--Okanagan",{"$nulls":8},"","","",null,0,0,null,null,{"$f":"IF(AB340=\"Y\",COUNT(#REF!), \"\")","v":""},null,"Logan Lake","N",{"v":50.491255,"d":"50.49126"},-120.81303,"http://www.google.com/maps/place/50.491255,-120.81303",8276,"Rural",1998,1112,"No","Yes","Yes","No ","Logan Lake","FALSE","FALSE"]
[null,8277,"Coldwater*","No","No","Yes","Thompson-Nicola Regional District","Thompson--Okanagan",{"$nulls":8},"","","",null,0,0,null,null,{"$f":"IF(AB341=\"Y\",COUNT(#REF!), \"\")","v":0},null,"Coldwater","Y",{"v":50.002411,"d":"50.00241"},-120.98532,"http://www.google.com/maps/place/50.002411,-120.98532",8277,"Rural First Nations Secondary Reserve",9,5,"No","Yes","No","No ","Coldwater*","FALSE","FALSE"]
[null,8278,"Brookmere","No","No","No","Thompson-Nicola Regional District","Thompson--Okanagan",{"$nulls":8},"","","",null,0,0,null,null,{"$f":"IF(AB342=\"Y\",COUNT(#REF!), \"\")","v":""},null,"Brookmere","N",{"v":49.818099,"d":"49.81810"},{"v":-120.875001,"d":"-120.87500"},"http://www.google.com/maps/place/49.818099,-120.875001",8278,"Rural",33,47,"No","Yes","Yes","No ","Brookmere","FALSE","FALSE"]
[null,8279,"Allison Lake","No","No","No","Regional District of Okanagan-Similkameen","Thompson--Okanagan",{"$nulls":8},"","","",null,0,0,null,null,{"$f":"IF(AB343=\"Y\",COUNT(#REF!), \"\")","v":""},null,"Allison Lake","N",{"v":49.688901,"d":"49.68890"},{"v":-120.6014,"d":"-120.60140"},"http://www.google.com/maps/place/49.688901,-120.6014",8279,"Rural",124,130,"No","Yes","Yes","No ","Allison Lake","FALSE","FALSE"]
[null,8280,"Bankeir","No","No","No","Regional District of Okanagan-Similkameen","Thompson--Okanagan",{"$nulls":8},"","","",null,0,0,null,null,{"$f":"IF(AB344=\"Y\",COUNT(#REF!), \"\")","v":""},null,"Bankeir","N",{"v":49.710727,"d":"49.71073"},{"v":-120.224912,"d":"-120.22491"},"http://www.google.com/maps/place/49.710727,-120.224912",8280,"Rural",162,226,"No","Yes","No","No ","Bankeir","FALSE","FALSE"]
[null,8281,"Upper Nicola*","No","No","Yes","Thompson-Nicola Regional District","Thompson--Okanagan",{"$nulls":8},"","","",null,0,0,null,null,{"$f":"IF(AB345=\"Y\",COUNT(#REF!), \"\")","v":0},null,"Upper Nicola","Y",50.21971,{"v":-120.462118,"d":"-120.46212"},"http://www.google.com/maps/place/50.21971,-120.462118",8281,"Rural First Nations Secondary Reserve",112,56,"No","Yes","No","No ","Upper Nicola*","FALSE","FALSE"]
[null,8282,"Vernon","Yes","Yes","Yes","Regional District of North Okanagan","Thompson--Okanagan",{"$nulls":8},"","","",null,0,0,null,null,{"$f":"IF(AB346=\"Y\",COUNT(#REF!), \"\")","v":""},null,"Vernon","N",{"v":50.264224,"d":"50.26422"},{"v":-119.268887,"d":"-119.26889"},"http://www.google.com/maps/place/50.264224,-119.268887",8282,"Urban",25595,12000,"Yes","No","Yes","No ","Vernon","FALSE","FALSE"]
[null,8283,"Coldstream","Yes","Yes","Yes","Regional District of North Okanagan","Thompson--Okanagan",{"$nulls":8},"","","",null,0,0,null,null,{"$f":"IF(AB347=\"Y\",COUNT(#REF!), \"\")","v":""},null,"Coldstream","N",{"v":50.229201,"d":"50.22920"},{"v":-119.226609,"d":"-119.22661"},"http://www.google.com/maps/place/50.229201,-119.226609",8283,"Urban",6256,2450,"Yes","No","No","No ","Coldstream","FALSE","FALSE"]
[null,8284,"Okanagan*","Yes","Yes","Yes","Regional District of North Okanagan","Thompson--Okanagan",{"$nulls":8},"","","",null,0,0,null,null,{"$f":"IF(AB348=\"Y\",COUNT(#REF!), \"\")","v":0},null,"Okanagan","Y",{"v":50.247252,"d":"50.24725"},{"v":-119.337691,"d":"-119.33769"},"http://www.google.com/maps/place/50.247252,-119.337691",8284,"Urban First Nations Secondary Reserve",11899,5307,"Yes","No","No","No ","Okanagan*","FALSE","FALSE"]
[null,8285,"Killiney Beach","Yes","Yes","Yes","Regional District of Central Okanagan","Thompson--Okanagan",{"$nulls":8},"","","",null,0,0,null,null,{"$f":"IF(AB349=\"Y\",COUNT(#REF!), \"\")","v":""},null,"Killiney Beach","N",{"v":50.189921,"d":"50.18992"},{"v":-119.506208,"d":"-119.50621"},"http://www.google.com/maps/place/50.189921,-119.506208",8285,"Rural",757,462,"Yes","No","Yes","No ","Killiney Beach","FALSE","FALSE"]
[null,8286,"Fintry","Yes","Yes","Yes","Regional District of Central Okanagan","Thompson--Okanagan",{"$nulls":8},"","","",null,0,0,null,null,{"$f":"IF(AB350=\"Y\",COUNT(#REF!), \"\")","v":""},null,"Fintry","N",{"v":50.131639,"d":"50.13164"},{"v":-119.506372,"d":"-119.50637"},"http://www.google.com/maps/place/50.131639,-119.506372",8286,"Rural",304,410,"Yes","No","No","No ","Fintry","FALSE","FALSE"]
[null,8287,"Wilson Landing","Yes","Yes","Yes","Regional District of Central Okanagan","Thompson--Okanagan",{"$nulls":8},"","","",null,0,0,null,null,{"$f":"IF(AB351=\"Y\",COUNT(#REF!), \"\")","v":""},null,"Wilson Landing","N",{"v":49.9821,"d":"49.98210"},{"v":-119.497268,"d":"-119.49727"},"http://www.google.com/maps/place/49.9821,-119.497268",8287,"Rural",99,102,"Yes","No","Yes","No ","Wilson Landing","FALSE","FALSE"]
[null,8288,"Nahun","No","Yes","Yes","Regional District of Central Okanagan","Thompson--Okanagan",{"$nulls":8},"","","",null,0,0,null,null,{"$f":"IF(AB352=\"Y\",COUNT(#REF!), \"\")","v":""},null,"Nahun","N",{"v":50.083301,"d":"50.08330"},{"v":-119.499999,"d":"-119.50000"},"http://www.google.com/maps/place/50.083301,-119.499999",8288,"Rural",304,410,"Yes","No","No","No ","Nahun","FALSE","FALSE"]
[null,8289,"Caesars","No","Yes","Yes","Regional District of Central Okanagan","Thompson--Okanagan",{"$nulls":8},"","","",null,0,0,null,null,{"$f":"IF(AB353=\"Y\",COUNT(#REF!), \"\")","v":""},null,"Caesars","N",{"v":50.0667,"d":"50.06670"},{"v":-119.500001,"d":"-119.50000"},"http://www.google.com/maps/place/50.0667,-119.500001",8289,"Rural",49,90,"No","Yes","No","No ","Caesars","FALSE","FALSE"]
[null,8290,{"$f":"HYPERLINK(AE354,AN354)","v":"Traders Cove"},"Yes","Yes","Yes","Regional District of Central Okanagan","Thompson--Okanagan",{"$nulls":8},{"$f":"IF(L354=\"\",\"\",\nIF(SUM((J354*L354)/M354)<=N354,\"Sufficient Capacity\",\nIF(SUM((J354*L354)/M354)>N354,\"Not Enough Capacity\",\"Error\")))","v":""},{"$f":"IF(OR(ISBLANK(J354),ISBLANK(L354),ISBLANK(M354)), \"\",(J354*L354/M354))","v":""},{"$f":"IF(AND(COUNT(N354,R354)=2, OR($O$10=\"Last-Mile\", $O$10=\"Transport & Last-Mile\")), N354-R354, \"\")","v":""},null,{"$f":"IF(AND(AB354=\"Y\",I354<>\"\"),1,0)","v":0},{"$f":"IF(AND(AB354=\"Y\",I354=\"Last-Mile & Transport\"),1,0)","v":0},null,null,{"$f":"IF(AB354=\"Y\",COUNT(#REF!), \"\")","v":""},null,"Traders Cove","N",{"v":49.936086,"d":"49.93609"},{"v":-119.504107,"d":"-119.50411"},"http://www.google.com/maps/place/49.936086,-119.504107",8290,"Rural",612,290,"Yes","No","No","No ",{"$f":"IF(AB354=\"Y\", CONCATENATE(AA354,\"*\"), AA354)","v":"Traders Cove"},{"$f":"IF(I354=\"Last-Mile\",\"TRUE\",IF(I354=\"Transport & Last-Mile\",\"TRUE\",\"FALSE\"))","v":"FALSE"},{"$f":"IF(I354=\"Transport\",\"TRUE\",IF(I354=\"Transport & Last-Mile\",\"TRUE\",\"FALSE\"))","v":"FALSE"}]
[null,8291,"Kedleston","Yes","Yes","Yes","Regional District of North Okanagan","Thompson--Okanagan",{"$nulls":8},"","","",null,0,0,null,null,{"$f":"IF(AB355=\"Y\",COUNT(#REF!), \"\")","v":""},null,"Kedleston","N",{"v":50.316699,"d":"50.31670"},{"v":-119.1833,"d":"-119.18330"},"http://www.google.com/maps/place/50.316699,-119.1833",8291,"Rural",2703,1041,"Yes","No","Yes","No ","Kedleston","FALSE","FALSE"]
[null,8293,"Okanagan*","No","Yes","Yes","Regional District of North Okanagan","Thompson--Okanagan",{"$nulls":8},"","","",null,0,0,null,null,{"$f":"IF(AB356=\"Y\",COUNT(#REF!), \"\")","v":0},null,"Okanagan","Y",{"v":50.234306,"d":"50.23431"},{"v":-119.448288,"d":"-119.44829"},"http://www.google.com/maps/place/50.234306,-119.448288",8293,"Rural First Nations Secondary Reserve",1282,884,"No","No","Yes","No ","Okanagan*","FALSE","FALSE"]
[null,8294,"Armstrong","Yes","Yes","Yes","Regional District of North Okanagan","Thompson--Okanagan",{"$nulls":8},"","","",null,0,0,null,null,{"$f":"IF(AB357=\"Y\",COUNT(#REF!), \"\")","v":""},null,"Armstrong","N",{"v":50.446115,"d":"50.44612"},{"v":-119.199171,"d":"-119.19917"},"http://www.google.com/maps/place/50.446115,-119.199171",8294,"Rural",5907,2464,"Yes","No","No","No ","Armstrong","FALSE","FALSE"]
[null,8295,"Enderby","Yes","Yes","Yes","Regional District of North Okanagan","Thompson--Okanagan",{"$nulls":8},"","","",null,0,0,null,null,{"$f":"IF(AB358=\"Y\",COUNT(#REF!), \"\")","v":""},null,"Enderby","N",{"v":50.554854,"d":"50.55485"},{"v":-119.140979,"d":"-119.14098"},"http://www.google.com/maps/place/50.554854,-119.140979",8295,"Rural",1985,970,"Yes","No","No","No ","Enderby","FALSE","FALSE"]
[null,8296,"Okanagan*","No","Yes","Yes","Columbia-Shuswap Regional District","Thompson--Okanagan",{"$nulls":8},"","","",null,0,0,null,null,{"$f":"IF(AB359=\"Y\",COUNT(#REF!), \"\")","v":0},null,"Okanagan","Y",{"v":50.430341,"d":"50.43034"},{"v":-119.341435,"d":"-119.34144"},"http://www.google.com/maps/place/50.430341,-119.341435",8296,"Rural First Nations Secondary Reserve",66,33,"No","Yes","Yes","No ","Okanagan*","FALSE","FALSE"]
[null,8297,"Glenemma","Yes","Yes","Yes","Columbia-Shuswap Regional District","Thompson--Okanagan",{"$nulls":8},"","","",null,0,0,null,null,{"$f":"IF(AB360=\"Y\",COUNT(#REF!), \"\")","v":""},null,"Glenemma","N",50.46937,{"v":-119.352475,"d":"-119.35248"},"http://www.google.com/maps/place/50.46937,-119.352475",8297,"Rural",310,130,"No","Yes","No","No ","Glenemma","FALSE","FALSE"]
[null,8298,"Hullcar","No","No","Yes","Regional District of North Okanagan","Thompson--Okanagan",{"$nulls":8},"","","",null,0,0,null,null,{"$f":"IF(AB361=\"Y\",COUNT(#REF!), \"\")","v":""},null,"Hullcar","N",{"v":50.503031,"d":"50.50303"},{"v":-119.269805,"d":"-119.26981"},"http://www.google.com/maps/place/50.503031,-119.269805",8298,"Rural",187,77,"No","Yes","No","No ","Hullcar","FALSE","FALSE"]
[null,8300,"Ashton Creek","Yes","Yes","Yes","Regional District of North Okanagan","Thompson--Okanagan",{"$nulls":8},"","","",null,0,0,null,null,{"$f":"IF(AB362=\"Y\",COUNT(#REF!), \"\")","v":""},null,"Ashton Creek","N",{"v":50.555993,"d":"50.55599"},{"v":-119.012635,"d":"-119.01264"},"http://www.google.com/maps/place/50.555993,-119.012635",8300,"Rural",164,68,"Yes","No","No","No ","Ashton Creek","FALSE","FALSE"]
[null,8301,"Yankee Flats","No","No","Yes","Columbia-Shuswap Regional District","Thompson--Okanagan",{"$nulls":8},"","","",null,0,0,null,null,{"$f":"IF(AB363=\"Y\",COUNT(#REF!), \"\")","v":""},null,"Yankee Flats","N",{"v":50.516355,"d":"50.51636"},{"v":-119.375489,"d":"-119.37549"},"http://www.google.com/maps/place/50.516355,-119.375489",8301,"Rural",244,109,"No","No","Yes","No ","Yankee Flats","FALSE","FALSE"]
[null,8302,"Silver Creek","Yes","Yes","Yes","Columbia-Shuswap Regional District","Thompson--Okanagan",{"$nulls":8},"","","",null,0,0,null,null,{"$f":"IF(AB364=\"Y\",COUNT(#REF!), \"\")","v":""},null,"Silver Creek","N",{"v":50.596111,"d":"50.59611"},{"v":-119.365439,"d":"-119.36544"},"http://www.google.com/maps/place/50.596111,-119.365439",8302,"Rural",636,294,"No","No","No","No ","Silver Creek","FALSE","FALSE"]
[null,8303,"Falkland","Yes","Yes","Yes","Columbia-Shuswap Regional District","Thompson--Okanagan",{"$nulls":8},"","","",null,0,0,null,null,{"$f":"IF(AB365=\"Y\",COUNT(#REF!), \"\")","v":""},null,"Falkland","N",{"v":50.500939,"d":"50.50094"},-119.55701,"http://www.google.com/maps/place/50.500939,-119.55701",8303,"Rural",718,350,"Yes","No","No","No ","Falkland","FALSE","FALSE"]
[null,8304,"Grindrod","Yes","Yes","Yes","Regional District of North Okanagan","Thompson--Okanagan",{"$nulls":8},"","","",null,0,0,null,null,{"$f":"IF(AB366=\"Y\",COUNT(#REF!), \"\")","v":""},null,"Grindrod","N",{"v":50.627637,"d":"50.62764"},{"v":-119.122547,"d":"-119.12255"},"http://www.google.com/maps/place/50.627637,-119.122547",8304,"Rural",907,421,"No","No","Yes","No ","Grindrod","FALSE","FALSE"]
[null,8305,"Ranchero","Yes","Yes","Yes","Columbia-Shuswap Regional District","Thompson--Okanagan",{"$nulls":8},"","","",null,0,0,null,null,{"$f":"IF(AB367=\"Y\",COUNT(#REF!), \"\")","v":""},null,"Ranchero","N",{"v":50.657044,"d":"50.65704"},{"v":-119.198328,"d":"-119.19833"},"http://www.google.com/maps/place/50.657044,-119.198328",8305,"Rural",1244,533,"Yes","No","Yes","No ","Ranchero","FALSE","FALSE"]
[null,8306,"Deep Creek","No","No","Yes","Columbia-Shuswap Regional District","Thompson--Okanagan",{"$nulls":8},"","","",null,0,0,null,null,{"$f":"IF(AB368=\"Y\",COUNT(#REF!), \"\")","v":""},null,"Deep Creek","N",{"v":50.609368,"d":"50.60937"},{"v":-119.213438,"d":"-119.21344"},"http://www.google.com/maps/place/50.609368,-119.213438",8306,"Rural",985,444,"No","No","No","No ","Deep Creek","FALSE","FALSE"]
[null,8307,"Six Mile Point","Yes","Yes","Yes","Columbia-Shuswap Regional District","Thompson--Okanagan",{"$nulls":8},"","","",null,0,0,null,null,{"$f":"IF(AB369=\"Y\",COUNT(#REF!), \"\")","v":""},null,"Six Mile Point","N",{"v":50.769637,"d":"50.76964"},{"v":-119.011192,"d":"-119.01119"},"http://www.google.com/maps/place/50.769637,-119.011192",8307,"Rural",122,214,"Yes","No","Yes","No ","Six Mile Point","FALSE","FALSE"]
[null,8308,"Mara","Yes","Yes","Yes","Regional District of North Okanagan","Thompson--Okanagan",{"$nulls":8},"","","",null,0,0,null,null,{"$f":"IF(AB370=\"Y\",COUNT(#REF!), \"\")","v":""},null,"Mara","N",{"v":50.685283,"d":"50.68528"},{"v":-119.067452,"d":"-119.06745"},"http://www.google.com/maps/place/50.685283,-119.067452",8308,"Rural",225,104,"No","No","No","No ","Mara","FALSE","FALSE"]
[null,8309,"Annis","No","No","Yes","Columbia-Shuswap Regional District","Thompson--Okanagan",{"$nulls":8},"","","",null,0,0,null,null,{"$f":"IF(AB371=\"Y\",COUNT(#REF!), \"\")","v":""},null,"Annis","N",{"v":50.790686,"d":"50.79069"},{"v":-119.081785,"d":"-119.08179"},"http://www.google.com/maps/place/50.790686,-119.081785",8309,"Rural",38,69,"No","Yes","No","No ","Annis","FALSE","FALSE"]
[null,8310,"Sicamous","Yes","Yes","Yes","Columbia-Shuswap Regional District","Thompson--Okanagan",{"$nulls":8},"","","",null,0,0,null,null,{"$f":"IF(AB372=\"Y\",COUNT(#REF!), \"\")","v":""},null,"Sicamous","N",{"v":50.835017,"d":"50.83502"},{"v":-118.980232,"d":"-118.98023"},"http://www.google.com/maps/place/50.835017,-118.980232",8310,"Rural",1779,1297,"No","No","Yes","No ","Sicamous","FALSE","FALSE"]
[null,8311,"Salmon Arm","Yes","Yes","Yes","Columbia-Shuswap Regional District","Thompson--Okanagan",{"$nulls":8},"","","",null,0,0,null,null,{"$f":"IF(AB373=\"Y\",COUNT(#REF!), \"\")","v":""},null,"Salmon Arm","N",{"v":50.7,"d":"50.70000"},{"v":-119.2667,"d":"-119.26670"},"http://www.google.com/maps/place/50.7,-119.2667",8311,"Rural",11456,5026,"Yes","No","No","No ","Salmon Arm","FALSE","FALSE"]
[null,8312,"Canoe","Yes","Yes","Yes","Columbia-Shuswap Regional District","Thompson--Okanagan",{"$nulls":8},"","","",null,0,0,null,null,{"$f":"IF(AB374=\"Y\",COUNT(#REF!), \"\")","v":""},null,"Canoe","N",{"v":50.751501,"d":"50.75150"},{"v":-119.227389,"d":"-119.22739"},"http://www.google.com/maps/place/50.751501,-119.227389",8312,"Rural",3051,1330,"Yes","No","No","No ","Canoe","FALSE","FALSE"]
[null,8313,"Sunnybrae","No","Yes","Yes","Columbia-Shuswap Regional District","Thompson--Okanagan",{"$nulls":8},"","","",null,0,0,null,null,{"$f":"IF(AB375=\"Y\",COUNT(#REF!), \"\")","v":""},null,"Sunnybrae","N",{"v":50.773243,"d":"50.77324"},{"v":-119.269944,"d":"-119.26994"},"http://www.google.com/maps/place/50.773243,-119.269944",8313,"Rural",229,149,"No","Yes","No","No ","Sunnybrae","FALSE","FALSE"]
[null,8314,"Tappen*","No","No","Yes","Columbia-Shuswap Regional District","Thompson--Okanagan",{"$nulls":8},"","","",null,0,0,null,null,{"$f":"IF(AB376=\"Y\",COUNT(#REF!), \"\")","v":0},null,"Tappen","Y",{"v":50.783988,"d":"50.78399"},{"v":-119.330606,"d":"-119.33061"},"http://www.google.com/maps/place/50.783988,-119.330606",8314,"Rural First Nations Secondary Reserve",752,363,"No","No","Yes","No ","Tappen*","FALSE","FALSE"]
[null,8315,"Adams Lake*","Yes","Yes","Yes","Columbia-Shuswap Regional District","Thompson--Okanagan",{"$nulls":8},"","","",null,0,0,null,null,{"$f":"IF(AB377=\"Y\",COUNT(#REF!), \"\")","v":0},null,"Adams Lake","Y",{"v":50.736567,"d":"50.73657"},{"v":-119.320557,"d":"-119.32056"},"http://www.google.com/maps/place/50.736567,-119.320557",8315,"Rural First Nations Secondary Reserve",1613,803,"Yes","No","No","No ","Adams Lake*","FALSE","FALSE"]
[null,8316,"Monte Lake","No","Yes","Yes","Thompson-Nicola Regional District","Thompson--Okanagan",{"$nulls":8},"","","",null,0,0,null,null,{"$f":"IF(AB378=\"Y\",COUNT(#REF!), \"\")","v":""},null,"Monte Lake","N",{"v":50.525429,"d":"50.52543"},{"v":-119.832451,"d":"-119.83245"},"http://www.google.com/maps/place/50.525429,-119.832451",8316,"Rural",172,87,"No","Yes","No","No ","Monte Lake","FALSE","FALSE"]
[null,8317,"Westwold","No","Yes","Yes","Thompson-Nicola Regional District","Thompson--Okanagan",{"$nulls":8},"","","",null,0,0,null,null,{"$f":"IF(AB379=\"Y\",COUNT(#REF!), \"\")","v":""},null,"Westwold","N",{"v":50.467906,"d":"50.46791"},-119.74665,"http://www.google.com/maps/place/50.467906,-119.74665",8317,"Rural",99,52,"No","Yes","Yes","No ","Westwold","FALSE","FALSE"]
[null,8318,"Holmwood","No","No","Yes","Thompson-Nicola Regional District","Thompson--Okanagan",{"$nulls":8},"","","",null,0,0,null,null,{"$f":"IF(AB380=\"Y\",COUNT(#REF!), \"\")","v":""},null,"Holmwood","N",{"v":50.618933,"d":"50.61893"},{"v":-119.954043,"d":"-119.95404"},"http://www.google.com/maps/place/50.618933,-119.954043",8318,"Rural",362,170,"Yes","No","Yes","No ","Holmwood","FALSE","FALSE"]
[null,8319,"Duck Range","No","No","Yes","Thompson-Nicola Regional District","Thompson--Okanagan",{"$nulls":8},"","","",null,0,0,null,null,{"$f":"IF(AB381=\"Y\",COUNT(#REF!), \"\")","v":""},null,"Duck Range","N",{"v":50.619152,"d":"50.61915"},{"v":-119.830225,"d":"-119.83023"},"http://www.google.com/maps/place/50.619152,-119.830225",8319,"Rural",111,50,"No","Yes","No","No ","Duck Range","FALSE","FALSE"]
[null,8320,"Martin Prairie","No","No","Yes","Thompson-Nicola Regional District","Thompson--Okanagan",{"$nulls":8},"","","",null,0,0,null,null,{"$f":"IF(AB382=\"Y\",COUNT(#REF!), \"\")","v":""},null,"Martin Prairie","N",{"v":50.662374,"d":"50.66237"},{"v":-119.811827,"d":"-119.81183"},"http://www.google.com/maps/place/50.662374,-119.811827",8320,"Rural",307,133,"No","Yes","No","No ","Martin Prairie","FALSE","FALSE"]
[null,8321,"Pritchard","No","No","Yes","Thompson-Nicola Regional District","Thompson--Okanagan",{"$nulls":8},"","","",null,0,0,null,null,{"$f":"IF(AB383=\"Y\",COUNT(#REF!), \"\")","v":""},null,"Pritchard","N",{"v":50.685139,"d":"50.68514"},{"v":-119.812186,"d":"-119.81219"},"http://www.google.com/maps/place/50.685139,-119.812186",8321,"Rural",307,133,"No","Yes","Yes","Yes ","Pritchard","FALSE","FALSE"]
[null,8322,"Shuswap","No","No","Yes","Thompson-Nicola Regional District","Thompson--Okanagan",{"$nulls":8},"","","",null,0,0,null,null,{"$f":"IF(AB384=\"Y\",COUNT(#REF!), \"\")","v":""},null,"Shuswap","N",{"v":50.789607,"d":"50.78961"},{"v":-119.708753,"d":"-119.70875"},"http://www.google.com/maps/place/50.789607,-119.708753",8322,"Rural",287,118,"No","No","Yes","No ","Shuswap","FALSE","FALSE"]
[null,8324,"Chase","No","No","Yes","Thompson-Nicola Regional District","Thompson--Okanagan",{"$nulls":8},"","","",null,0,0,null,null,{"$f":"IF(AB385=\"Y\",COUNT(#REF!), \"\")","v":""},null,"Chase","N",{"v":50.822105,"d":"50.82211"},{"v":-119.6883,"d":"-119.68830"},"http://www.google.com/maps/place/50.822105,-119.6883",8324,"Rural",2605,1302,"No","Yes","No","No ","Chase","FALSE","FALSE"]
[null,8325,"Malakwa","No","No","Yes","Columbia-Shuswap Regional District","Thompson--Okanagan",{"$nulls":8},"","","",null,0,0,null,null,{"$f":"IF(AB386=\"Y\",COUNT(#REF!), \"\")","v":""},null,"Malakwa","N",{"v":50.939952,"d":"50.93995"},{"v":-118.788805,"d":"-118.78881"},"http://www.google.com/maps/place/50.939952,-118.788805",8325,"Rural",359,202,"No","Yes","No","No ","Malakwa","FALSE","FALSE"]
[null,8326,"Solsqua","No","No","Yes","Columbia-Shuswap Regional District","Thompson--Okanagan",{"$nulls":8},"","","",null,0,0,null,null,{"$f":"IF(AB387=\"Y\",COUNT(#REF!), \"\")","v":""},null,"Solsqua","N",{"v":50.870685,"d":"50.87069"},{"v":-118.939534,"d":"-118.93953"},"http://www.google.com/maps/place/50.870685,-118.939534",8326,"Rural",262,160,"No","No","Yes","No ","Solsqua","FALSE","FALSE"]
[null,8327,"Blind Bay","Yes","Yes","Yes","Columbia-Shuswap Regional District","Thompson--Okanagan",{"$nulls":8},"","","",null,0,0,null,null,{"$f":"IF(AB388=\"Y\",COUNT(#REF!), \"\")","v":""},null,"Blind Bay","N",{"v":50.8833,"d":"50.88330"},{"v":-119.383301,"d":"-119.38330"},"http://www.google.com/maps/place/50.8833,-119.383301",8327,"Rural",1855,1047,"Yes","No","No","No ","Blind Bay","FALSE","FALSE"]
[null,8328,"Revelstoke","Yes","Yes","Yes","Columbia-Shuswap Regional District","Thompson--Okanagan",{"$nulls":8},"","","",null,0,0,null,null,{"$f":"IF(AB389=\"Y\",COUNT(#REF!), \"\")","v":""},null,"Revelstoke","N",{"v":51.001215,"d":"51.00122"},{"v":-118.196239,"d":"-118.19624"},"http://www.google.com/maps/place/51.001215,-118.196239",8328,"Rural",3377,1602,"Yes","No","Yes","No ","Revelstoke","FALSE","FALSE"]
[null,8329,"Kingfisher","No","No","No","Regional District of North Okanagan","Thompson--Okanagan",{"$nulls":8},"","","",null,0,0,null,null,{"$f":"IF(AB390=\"Y\",COUNT(#REF!), \"\")","v":""},null,"Kingfisher","N",{"v":50.616701,"d":"50.61670"},{"v":-118.733299,"d":"-118.73330"},"http://www.google.com/maps/place/50.616701,-118.733299",8329,"Rural",196,452,"No","Yes","Yes","No ","Kingfisher","FALSE","FALSE"]
[null,8330,"Seymour Arm","No","No","No","Columbia-Shuswap Regional District","Thompson--Okanagan",{"$nulls":8},"","","",null,0,0,null,null,{"$f":"IF(AB391=\"Y\",COUNT(#REF!), \"\")","v":""},null,"Seymour Arm","N",{"v":51.248414,"d":"51.24841"},{"v":-118.939566,"d":"-118.93957"},"http://www.google.com/maps/place/51.248414,-118.939566",8330,"Rural",94,366,"No","Yes","Yes","No ","Seymour Arm","FALSE","FALSE"]
[null,8331,"Canyon Hot Springs","No","Yes","Yes","Columbia-Shuswap Regional District","Thompson--Okanagan",{"$nulls":8},"","","",null,0,0,null,null,{"$f":"IF(AB392=\"Y\",COUNT(#REF!), \"\")","v":""},null,"Canyon Hot Springs","N",{"v":51.136933,"d":"51.13693"},{"v":-117.852168,"d":"-117.85217"},"http://www.google.com/maps/place/51.136933,-117.852168",8331,"Rural",3,1,"No","Yes","No","No ","Canyon Hot Springs","FALSE","FALSE"]
[null,8332,"Rogers Pass","No","Yes","Yes","Columbia-Shuswap Regional District","Thompson--Okanagan",{"$nulls":8},"","","",null,0,0,null,null,{"$f":"IF(AB393=\"Y\",COUNT(#REF!), \"\")","v":""},null,"Rogers Pass","N",{"v":51.300856,"d":"51.30086"},{"v":-117.521284,"d":"-117.52128"},"http://www.google.com/maps/place/51.300856,-117.521284",8332,"Rural",0,0,"No","Yes","Yes","No ","Rogers Pass","FALSE","FALSE"]
[null,8333,"Blaeberry","No","No","Yes","Columbia-Shuswap Regional District","Thompson--Okanagan",{"$nulls":8},"","","",null,0,0,null,null,{"$f":"IF(AB394=\"Y\",COUNT(#REF!), \"\")","v":""},null,"Blaeberry","N",{"v":51.433301,"d":"51.43330"},{"v":-117.0667,"d":"-117.06670"},"http://www.google.com/maps/place/51.433301,-117.0667",8333,"Rural",83,45,"No","Yes","No","No ","Blaeberry","FALSE","FALSE"]
[null,8334,"Donald","No","Yes","Yes","Columbia-Shuswap Regional District","Thompson--Okanagan",{"$nulls":8},"","","",null,0,0,null,null,{"$f":"IF(AB395=\"Y\",COUNT(#REF!), \"\")","v":""},null,"Donald","N",{"v":51.4958,"d":"51.49580"},{"v":-117.173599,"d":"-117.17360"},"http://www.google.com/maps/place/51.4958,-117.173599",8334,"Rural",50,26,"No","Yes","No","No ","Donald","FALSE","FALSE"]
[null,8335,"Golden","Yes","Yes","Yes","Columbia-Shuswap Regional District","Thompson--Okanagan",{"$nulls":8},"","","",null,0,0,null,null,{"$f":"IF(AB396=\"Y\",COUNT(#REF!), \"\")","v":""},null,"Golden","N",{"v":51.294882,"d":"51.29488"},{"v":-116.963859,"d":"-116.96386"},"http://www.google.com/maps/place/51.294882,-116.963859",8335,"Rural",2959,1403,"No","Yes","Yes","No ","Golden","FALSE","FALSE"]
[null,8336,"Nicholson","Yes","Yes","Yes","Columbia-Shuswap Regional District","Thompson--Okanagan",{"$nulls":8},"","","",null,0,0,null,null,{"$f":"IF(AB397=\"Y\",COUNT(#REF!), \"\")","v":""},null,"Nicholson","N",{"v":51.2481,"d":"51.24810"},{"v":-116.901429,"d":"-116.90143"},"http://www.google.com/maps/place/51.2481,-116.901429",8336,"Rural",694,384,"No","Yes","Yes","No ","Nicholson","FALSE","FALSE"]
[null,8337,"Parson","No","No","No","Columbia-Shuswap Regional District","Thompson--Okanagan",{"$nulls":8},"","","",null,0,0,null,null,{"$f":"IF(AB398=\"Y\",COUNT(#REF!), \"\")","v":""},null,"Parson","N",{"v":51.070818,"d":"51.07082"},{"v":-116.632488,"d":"-116.63249"},"http://www.google.com/maps/place/51.070818,-116.632488",8337,"Rural",85,42,"No","Yes","Yes","No ","Parson","FALSE","FALSE"]
[null,8338,"Harrogate","No","No","Yes","Columbia-Shuswap Regional District","Thompson--Okanagan",{"$nulls":8},"","","",null,0,0,null,null,{"$f":"IF(AB399=\"Y\",COUNT(#REF!), \"\")","v":""},null,"Harrogate","N",{"v":50.9833,"d":"50.98330"},{"v":-116.450001,"d":"-116.45000"},"http://www.google.com/maps/place/50.9833,-116.450001",8338,"Rural",31,19,"No","Yes","No","No ","Harrogate","FALSE","FALSE"]
[null,8339,"Spillimacheen","No","Yes","Yes","Regional District of East Kootenay","Kootenay",{"$nulls":8},"","","",null,0,0,null,null,{"$f":"IF(AB400=\"Y\",COUNT(#REF!), \"\")","v":""},null,"Spillimacheen","N",{"v":50.907249,"d":"50.90725"},{"v":-116.363519,"d":"-116.36352"},"http://www.google.com/maps/place/50.907249,-116.363519",8339,"Rural",63,55,"No","Yes","Yes","No ","Spillimacheen","FALSE","FALSE"]
[null,8340,"Brisco","No","Yes","Yes","Regional District of East Kootenay","Kootenay",{"$nulls":8},"","","",null,0,0,null,null,{"$f":"IF(AB401=\"Y\",COUNT(#REF!), \"\")","v":""},null,"Brisco","N",{"v":50.8333,"d":"50.83330"},{"v":-116.266699,"d":"-116.26670"},"http://www.google.com/maps/place/50.8333,-116.266699",8340,"Rural",7,6,"No","Yes","No","No ","Brisco","FALSE","FALSE"]
[null,8341,"Dry Gulch","Yes","Yes","Yes","Regional District of East Kootenay","Kootenay",{"$nulls":8},"","","",null,0,0,null,null,{"$f":"IF(AB402=\"Y\",COUNT(#REF!), \"\")","v":""},null,"Dry Gulch","N",{"v":50.584162,"d":"50.58416"},{"v":-116.041436,"d":"-116.04144"},"http://www.google.com/maps/place/50.584162,-116.041436",8341,"Rural",917,996,"Yes","No","Yes","No ","Dry Gulch","FALSE","FALSE"]
[null,8342,"Field","No","Yes","Yes","Columbia-Shuswap Regional District","Thompson--Okanagan",{"$nulls":8},"","","",null,0,0,null,null,{"$f":"IF(AB403=\"Y\",COUNT(#REF!), \"\")","v":""},null,"Field","N",{"v":51.394902778,"d":"51.39490"},{"v":-116.49001667,"d":"-116.49002"},"http://www.google.com/maps/place/51.394902778,-116.49001667",8342,"Rural",230,112,"No","Yes","No","No ","Field","FALSE","FALSE"]
[null,8343,"Shelter Bay","No","No","No","Columbia-Shuswap Regional District","Thompson--Okanagan",{"$nulls":8},"","","",null,0,0,null,null,{"$f":"IF(AB404=\"Y\",COUNT(#REF!), \"\")","v":""},null,"Shelter Bay","N",{"v":50.635234,"d":"50.63523"},{"v":-117.925232,"d":"-117.92523"},"http://www.google.com/maps/place/50.635234,-117.925232",8343,"Rural",0,0,"No","Yes","Yes","No ","Shelter Bay","FALSE","FALSE"]
[null,8344,"Galena","No","No","No","Columbia-Shuswap Regional District","Thompson--Okanagan",{"$nulls":8},"","","",null,0,0,null,null,{"$f":"IF(AB405=\"Y\",COUNT(#REF!), \"\")","v":""},null,"Galena","N",{"v":50.616701,"d":"50.61670"},{"v":-117.8667,"d":"-117.86670"},"http://www.google.com/maps/place/50.616701,-117.8667",8344,"Rural",1,1,"No","Yes","No","No ","Galena","FALSE","FALSE"]
[null,8345,"Galena Bay","No","No","No","Columbia-Shuswap Regional District","Thompson--Okanagan",{"$nulls":8},"","","",null,0,0,null,null,{"$f":"IF(AB406=\"Y\",COUNT(#REF!), \"\")","v":""},null,"Galena Bay","N",{"v":50.666699,"d":"50.66670"},{"v":-117.850001,"d":"-117.85000"},"http://www.google.com/maps/place/50.666699,-117.850001",8345,"Rural",7,18,"No","Yes","No","No ","Galena Bay","FALSE","FALSE"]
[null,8346,"Beaton","No","No","No","Columbia-Shuswap Regional District","Thompson--Okanagan",{"$nulls":8},"","","",null,0,0,null,null,{"$f":"IF(AB407=\"Y\",COUNT(#REF!), \"\")","v":""},null,"Beaton","N",{"v":50.733301,"d":"50.73330"},{"v":-117.7333,"d":"-117.73330"},"http://www.google.com/maps/place/50.733301,-117.7333",8346,"Rural",6,20,"No","Yes","No","No ","Beaton","FALSE","FALSE"]
[null,8347,"Trout Lake","No","No","No","Columbia-Shuswap Regional District","Thompson--Okanagan",{"$nulls":8},"","","",null,0,0,null,null,{"$f":"IF(AB408=\"Y\",COUNT(#REF!), \"\")","v":""},null,"Trout Lake","N",{"v":50.6472,"d":"50.64720"},{"v":-117.538899,"d":"-117.53890"},"http://www.google.com/maps/place/50.6472,-117.538899",8347,"Rural",38,65,"No","Yes","No","No ","Trout Lake","FALSE","FALSE"]
[null,8348,"Ferguson","No","No","No","Columbia-Shuswap Regional District","Thompson--Okanagan",{"$nulls":8},"","","",null,0,0,null,null,{"$f":"IF(AB409=\"Y\",COUNT(#REF!), \"\")","v":""},null,"Ferguson","N",{"v":50.683301,"d":"50.68330"},{"v":-117.4833,"d":"-117.48330"},"http://www.google.com/maps/place/50.683301,-117.4833",8348,"Rural",6,26,"No","Yes","Yes","No ","Ferguson","FALSE","FALSE"]
[null,8349,"Brouse","No","Yes","Yes","Regional District of Central Kootenay","Kootenay",{"$nulls":8},"","","",null,0,0,null,null,{"$f":"IF(AB410=\"Y\",COUNT(#REF!), \"\")","v":""},null,"Brouse","N",{"v":50.2167,"d":"50.21670"},{"v":-117.750001,"d":"-117.75000"},"http://www.google.com/maps/place/50.2167,-117.750001",8349,"Rural",399,192,"No","Yes","No","No ","Brouse","FALSE","FALSE"]
[null,8350,"Carrolls Landing","No","No","Yes","Regional District of Central Kootenay","Kootenay",{"$nulls":8},"","","",null,0,0,null,null,{"$f":"IF(AB411=\"Y\",COUNT(#REF!), \"\")","v":""},null,"Carrolls Landing","N",{"v":50.0333,"d":"50.03330"},{"v":-117.9,"d":"-117.90000"},"http://www.google.com/maps/place/50.0333,-117.9",8350,"Rural",1,1,"No","Yes","No","No ","Carrolls Landing","FALSE","FALSE"]
[null,8351,"Rosebery","Yes","Yes","Yes","Regional District of Central Kootenay","Kootenay",{"$nulls":8},"","","",null,0,0,null,null,{"$f":"IF(AB412=\"Y\",COUNT(#REF!), \"\")","v":""},null,"Rosebery","N",{"v":50.0333,"d":"50.03330"},{"v":-117.411099,"d":"-117.41110"},"http://www.google.com/maps/place/50.0333,-117.411099",8351,"Rural",175,129,"No","Yes","Yes","No ","Rosebery","FALSE","FALSE"]
[null,8352,"Howser","No","No","No","Regional District of Central Kootenay","Kootenay",{"$nulls":8},"","","",null,0,0,null,null,{"$f":"IF(AB413=\"Y\",COUNT(#REF!), \"\")","v":""},null,"Howser","N",{"v":50.3,"d":"50.30000"},{"v":-116.95,"d":"-116.95000"},"http://www.google.com/maps/place/50.3,-116.95",8352,"Rural",1,1,"No","Yes","No","No ","Howser","FALSE","FALSE"]
[null,8353,"Crowsnest","No","No","Yes","Regional District of East Kootenay","Kootenay",{"$nulls":8},"","","",null,0,0,null,null,{"$f":"IF(AB414=\"Y\",COUNT(#REF!), \"\")","v":""},null,"Crowsnest","N",{"v":49.636767,"d":"49.63677"},{"v":-114.695344,"d":"-114.69534"},"http://www.google.com/maps/place/49.636767,-114.695344",8353,"Rural",5,1,"No","Yes","No","No ","Crowsnest","FALSE","FALSE"]
[null,8354,"Skookumchuck","No","No","Yes","Regional District of East Kootenay","Kootenay",{"$nulls":8},"","","",null,0,0,null,null,{"$f":"IF(AB415=\"Y\",COUNT(#REF!), \"\")","v":""},null,"Skookumchuck","N",{"v":49.916701,"d":"49.91670"},{"v":-115.7333,"d":"-115.73330"},"http://www.google.com/maps/place/49.916701,-115.7333",8354,"Rural",37,22,"No","Yes","Yes","No ","Skookumchuck","FALSE","FALSE"]
[null,8355,"Balmoral","No","Yes","Yes","Columbia-Shuswap Regional District","Thompson--Okanagan",{"$nulls":8},"","","",null,0,0,null,null,{"$f":"IF(AB416=\"Y\",COUNT(#REF!), \"\")","v":""},null,"Balmoral","N",{"v":50.853118,"d":"50.85312"},{"v":-119.354588,"d":"-119.35459"},"http://www.google.com/maps/place/50.853118,-119.354588",8355,"Rural",1297,694,"Yes","No","Yes","No ","Balmoral","FALSE","FALSE"]
[null,8356,"Notch Hill","No","No","Yes","Columbia-Shuswap Regional District","Thompson--Okanagan",{"$nulls":8},"","","",null,0,0,null,null,{"$f":"IF(AB417=\"Y\",COUNT(#REF!), \"\")","v":""},null,"Notch Hill","N",{"v":50.852836,"d":"50.85284"},{"v":-119.435111,"d":"-119.43511"},"http://www.google.com/maps/place/50.852836,-119.435111",8356,"Rural",1069,651,"Yes","No","Yes","No ","Notch Hill","FALSE","FALSE"]
[null,8357,{"$f":"HYPERLINK(AE418,AN418)","v":"Sorrento"},"Yes","Yes","Yes","Columbia-Shuswap Regional District","Thompson--Okanagan",{"$nulls":8},{"$f":"IF(L418=\"\",\"\",\nIF(SUM((J418*L418)/M418)<=N418,\"Sufficient Capacity\",\nIF(SUM((J418*L418)/M418)>N418,\"Not Enough Capacity\",\"Error\")))","v":""},{"$f":"IF(OR(ISBLANK(J418),ISBLANK(L418),ISBLANK(M418)), \"\",(J418*L418/M418))","v":""},{"$f":"IF(AND(COUNT(N418,R418)=2, OR($O$10=\"Last-Mile\", $O$10=\"Transport & Last-Mile\")), N418-R418, \"\")","v":""},null,{"$f":"IF(AND(AB418=\"Y\",I418<>\"\"),1,0)","v":0},{"$f":"IF(AND(AB418=\"Y\",I418=\"Last-Mile & Transport\"),1,0)","v":0},null,null,{"$f":"IF(AB418=\"Y\",COUNT(#REF!), \"\")","v":""},null,"Sorrento","N",{"v":50.878242,"d":"50.87824"},{"v":-119.467115,"d":"-119.46712"},"http://www.google.com/maps/place/50.878242,-119.467115",8357,"Rural",1069,651,"Yes","No","Yes","No ",{"$f":"IF(AB418=\"Y\", CONCATENATE(AA418,\"*\"), AA418)","v":"Sorrento"},{"$f":"IF(I418=\"Last-Mile\",\"TRUE\",IF(I418=\"Transport & Last-Mile\",\"TRUE\",\"FALSE\"))","v":"FALSE"},{"$f":"IF(I418=\"Transport\",\"TRUE\",IF(I418=\"Transport & Last-Mile\",\"TRUE\",\"FALSE\"))","v":"FALSE"}]
[null,8358,"Scotch Creek","Yes","Yes","Yes","Columbia-Shuswap Regional District","Thompson--Okanagan",{"$nulls":8},"","","",null,0,0,null,null,{"$f":"IF(AB419=\"Y\",COUNT(#REF!), \"\")","v":""},null,"Scotch Creek","N",{"v":50.901374,"d":"50.90137"},{"v":-119.450878,"d":"-119.45088"},"http://www.google.com/maps/place/50.901374,-119.450878",8358,"Rural",594,932,"Yes","No","No","No ","Scotch Creek","FALSE","FALSE"]
[null,8359,"Celista","No","No","Yes","Columbia-Shuswap Regional District","Thompson--Okanagan",{"$nulls":8},"","","",null,0,0,null,null,{"$f":"IF(AB420=\"Y\",COUNT(#REF!), \"\")","v":""},null,"Celista","N",{"v":50.944405,"d":"50.94441"},{"v":-119.348962,"d":"-119.34896"},"http://www.google.com/maps/place/50.944405,-119.348962",8359,"Rural",283,264,"No","No","No","No ","Celista","FALSE","FALSE"]
[null,8360,"Anglemont","No","Yes","Yes","Columbia-Shuswap Regional District","Thompson--Okanagan",{"$nulls":8},"","","",null,0,0,null,null,{"$f":"IF(AB421=\"Y\",COUNT(#REF!), \"\")","v":""},null,"Anglemont","N",{"v":50.9667,"d":"50.96670"},{"v":-119.166701,"d":"-119.16670"},"http://www.google.com/maps/place/50.9667,-119.166701",8360,"Rural",463,568,"No","Yes","No","No ","Anglemont","FALSE","FALSE"]
[null,8361,"Magna Bay","No","Yes","Yes","Columbia-Shuswap Regional District","Thompson--Okanagan",{"$nulls":8},"","","",null,0,0,null,null,{"$f":"IF(AB422=\"Y\",COUNT(#REF!), \"\")","v":""},null,"Magna Bay","N",{"v":50.961837,"d":"50.96184"},{"v":-119.283581,"d":"-119.28358"},"http://www.google.com/maps/place/50.961837,-119.283581",8361,"Rural",323,558,"No","Yes","Yes","No ","Magna Bay","FALSE","FALSE"]
[null,8362,"Eagle Bay","No","No","Yes","Columbia-Shuswap Regional District","Thompson--Okanagan",{"$nulls":8},"","","",null,0,0,null,null,{"$f":"IF(AB423=\"Y\",COUNT(#REF!), \"\")","v":""},null,"Eagle Bay","N",{"v":50.9333,"d":"50.93330"},{"v":-119.216701,"d":"-119.21670"},"http://www.google.com/maps/place/50.9333,-119.216701",8362,"Rural",146,187,"No","Yes","No","No ","Eagle Bay","FALSE","FALSE"]
[null,8363,"White Lake","No","No","Yes","Columbia-Shuswap Regional District","Thompson--Okanagan",{"$nulls":8},"","","",null,0,0,null,null,{"$f":"IF(AB424=\"Y\",COUNT(#REF!), \"\")","v":""},null,"White Lake","N",{"v":50.879754,"d":"50.87975"},{"v":-119.3015,"d":"-119.30150"},"http://www.google.com/maps/place/50.879754,-119.3015",8363,"Rural",567,281,"No","Yes","Yes","No ","White Lake","FALSE","FALSE"]
[null,8364,"Lee Creek","Yes","Yes","Yes","Columbia-Shuswap Regional District","Thompson--Okanagan",{"$nulls":8},"","","",null,0,0,null,null,{"$f":"IF(AB425=\"Y\",COUNT(#REF!), \"\")","v":""},null,"Lee Creek","N",{"v":50.907833,"d":"50.90783"},{"v":-119.534093,"d":"-119.53409"},"http://www.google.com/maps/place/50.907833,-119.534093",8364,"Rural",282,236,"Yes","No","Yes","No ","Lee Creek","FALSE","FALSE"]
[null,8367,"Pinantan Lake","No","No","No","Thompson-Nicola Regional District","Thompson--Okanagan",{"$nulls":8},"","","",null,0,0,null,null,{"$f":"IF(AB426=\"Y\",COUNT(#REF!), \"\")","v":""},null,"Pinantan Lake","N",{"v":50.726423,"d":"50.72642"},{"v":-120.036217,"d":"-120.03622"},"http://www.google.com/maps/place/50.726423,-120.036217",8367,"Rural",650,264,"No","Yes","Yes","No ","Pinantan Lake","FALSE","FALSE"]
[null,8368,"Monte Creek","Yes","Yes","Yes","Thompson-Nicola Regional District","Thompson--Okanagan",{"$nulls":8},"","","",null,0,0,null,null,{"$f":"IF(AB427=\"Y\",COUNT(#REF!), \"\")","v":""},null,"Monte Creek","N",50.64874,{"v":-119.958111,"d":"-119.95811"},"http://www.google.com/maps/place/50.64874,-119.958111",8368,"Rural",362,170,"Yes","No","No","No ","Monte Creek","FALSE","FALSE"]
[null,8369,"Campbell Creek","Yes","Yes","Yes","Thompson-Nicola Regional District","Thompson--Okanagan",{"$nulls":8},"","","",null,0,0,null,null,{"$f":"IF(AB428=\"Y\",COUNT(#REF!), \"\")","v":""},null,"Campbell Creek","N",{"v":50.654021,"d":"50.65402"},{"v":-120.084969,"d":"-120.08497"},"http://www.google.com/maps/place/50.654021,-120.084969",8369,"Rural",680,257,"Yes","No","No","No ","Campbell Creek","FALSE","FALSE"]
[null,8370,"Dallas","Yes","Yes","Yes","Thompson-Nicola Regional District","Thompson--Okanagan",{"$nulls":8},"","","",null,0,0,null,null,{"$f":"IF(AB429=\"Y\",COUNT(#REF!), \"\")","v":""},null,"Dallas","N",{"v":50.666699,"d":"50.66670"},{"v":-120.166699,"d":"-120.16670"},"http://www.google.com/maps/place/50.666699,-120.166699",8370,"Rural",5591,2162,"Yes","No","No","No ","Dallas","FALSE","FALSE"]
[null,8371,"Barnhartvale","Yes","Yes","Yes","Thompson-Nicola Regional District","Thompson--Okanagan",{"$nulls":8},"","","",null,0,0,null,null,{"$f":"IF(AB430=\"Y\",COUNT(#REF!), \"\")","v":""},null,"Barnhartvale","N",{"v":50.650535,"d":"50.65054"},{"v":-120.170485,"d":"-120.17049"},"http://www.google.com/maps/place/50.650535,-120.170485",8371,"Rural",5591,2162,"Yes","No","Yes","No ","Barnhartvale","FALSE","FALSE"]
[null,8372,"Valleyview","Yes","Yes","Yes","Thompson-Nicola Regional District","Thompson--Okanagan",{"$nulls":8},"","","",null,0,0,null,null,{"$f":"IF(AB431=\"Y\",COUNT(#REF!), \"\")","v":""},null,"Valleyview","N",{"v":50.673821,"d":"50.67382"},{"v":-120.249667,"d":"-120.24967"},"http://www.google.com/maps/place/50.673821,-120.249667",8372,"Urban",7330,3074,"Yes","No","No","No ","Valleyview","FALSE","FALSE"]
[null,8373,"Kamloops","Yes","Yes","Yes","Thompson-Nicola Regional District","Thompson--Okanagan",{"$nulls":8},"","","",null,0,0,null,null,{"$f":"IF(AB432=\"Y\",COUNT(#REF!), \"\")","v":""},null,"Kamloops","N",{"v":50.678251,"d":"50.67825"},{"v":-120.347731,"d":"-120.34773"},"http://www.google.com/maps/place/50.678251,-120.347731",8373,"Urban",22684,11949,"Yes","No","No","No ","Kamloops","FALSE","FALSE"]
[null,8374,"Rayleigh","Yes","Yes","Yes","Thompson-Nicola Regional District","Thompson--Okanagan",{"$nulls":8},"","","",null,0,0,null,null,{"$f":"IF(AB433=\"Y\",COUNT(#REF!), \"\")","v":""},null,"Rayleigh","N",{"v":50.797384,"d":"50.79738"},{"v":-120.319733,"d":"-120.31973"},"http://www.google.com/maps/place/50.797384,-120.319733",8374,"Urban",5176,1931,"Yes","No","Yes","No ","Rayleigh","FALSE","FALSE"]
[null,8375,"Westsyde","Yes","Yes","Yes","Thompson-Nicola Regional District","Thompson--Okanagan",{"$nulls":8},"","","",null,0,0,null,null,{"$f":"IF(AB434=\"Y\",COUNT(#REF!), \"\")","v":""},null,"Westsyde","N",{"v":50.763669,"d":"50.76367"},-120.34848,"http://www.google.com/maps/place/50.763669,-120.34848",8375,"Urban",6479,2647,"Yes","No","Yes","No ","Westsyde","FALSE","FALSE"]
[null,8376,"Heffley Creek","Yes","Yes","Yes","Thompson-Nicola Regional District","Thompson--Okanagan",{"$nulls":8},"","","",null,0,0,null,null,{"$f":"IF(AB435=\"Y\",COUNT(#REF!), \"\")","v":""},null,"Heffley Creek","N",{"v":50.858306,"d":"50.85831"},{"v":-120.270636,"d":"-120.27064"},"http://www.google.com/maps/place/50.858306,-120.270636",8376,"Rural",679,346,"Yes","No","No","No ","Heffley Creek","FALSE","FALSE"]
[null,8377,"Sun Peaks","Yes","Yes","Yes","Thompson-Nicola Regional District","Thompson--Okanagan",{"$nulls":8},"","","",null,0,0,null,null,{"$f":"IF(AB436=\"Y\",COUNT(#REF!), \"\")","v":""},null,"Sun Peaks","N",{"v":50.878038,"d":"50.87804"},{"v":-119.908131,"d":"-119.90813"},"http://www.google.com/maps/place/50.878038,-119.908131",8377,"Rural",215,298,"Yes","No","Yes","No ","Sun Peaks","FALSE","FALSE"]
[null,8378,"Kamloops*","Yes","Yes","Yes","Thompson-Nicola Regional District","Thompson--Okanagan",{"$nulls":8},"","","",null,0,0,null,null,{"$f":"IF(AB437=\"Y\",COUNT(#REF!), \"\")","v":0},null,"Kamloops","Y",{"v":50.689234,"d":"50.68923"},{"v":-120.325803,"d":"-120.32580"},"http://www.google.com/maps/place/50.689234,-120.325803",8378,"Rural First Nations Primary Reserve",22684,11949,"Yes","No","No","No ","Kamloops*","FALSE","FALSE"]
[null,8379,"Tranquille","No","No","Yes","Thompson-Nicola Regional District","Thompson--Okanagan",{"$nulls":8},"","","",null,0,0,null,null,{"$f":"IF(AB438=\"Y\",COUNT(#REF!), \"\")","v":""},null,"Tranquille","N",{"v":50.720004,"d":"50.72000"},{"v":-120.520801,"d":"-120.52080"},"http://www.google.com/maps/place/50.720004,-120.520801",8379,"Rural",15,30,"No","Yes","No","No ","Tranquille","FALSE","FALSE"]
[null,8380,"Savona","No","Yes","Yes","Thompson-Nicola Regional District","Thompson--Okanagan",{"$nulls":8},"","","",null,0,0,null,null,{"$f":"IF(AB439=\"Y\",COUNT(#REF!), \"\")","v":""},null,"Savona","N",50.75111,{"v":-120.840527,"d":"-120.84053"},"http://www.google.com/maps/place/50.75111,-120.840527",8380,"Rural",473,257,"No","Yes","Yes","No ","Savona","FALSE","FALSE"]
[null,8381,"Cherry Creek","No","No","Yes","Thompson-Nicola Regional District","Thompson--Okanagan",{"$nulls":8},"","","",null,0,0,null,null,{"$f":"IF(AB440=\"Y\",COUNT(#REF!), \"\")","v":""},null,"Cherry Creek","N",{"v":50.7125,"d":"50.71250"},{"v":-120.624998,"d":"-120.62500"},"http://www.google.com/maps/place/50.7125,-120.624998",8381,"Rural",202,92,"No","Yes","No","No ","Cherry Creek","FALSE","FALSE"]
[null,8382,"Hustalen 1 (Adams Lake)*","No","Yes","Yes","Columbia-Shuswap Regional District","Thompson--Okanagan",{"$nulls":8},"","","",null,0,0,null,null,{"$f":"IF(AB441=\"Y\",COUNT(#REF!), \"\")","v":0},null,"Hustalen 1 (Adams Lake)","Y",50.95325,{"v":-119.66673611,"d":"-119.66674"},"http://www.google.com/maps/place/50.95325,-119.66673611",8382,"Rural First Nations Secondary Reserve",21,34,"No","Yes","No","No ","Hustalen 1 (Adams Lake)*","FALSE","FALSE"]
[null,8383,"Lac Le Jeune","No","No","Yes","Thompson-Nicola Regional District","Thompson--Okanagan",{"$nulls":8},"","","",null,0,0,null,null,{"$f":"IF(AB442=\"Y\",COUNT(#REF!), \"\")","v":""},null,"Lac Le Jeune","N",{"v":50.481712,"d":"50.48171"},{"v":-120.493017,"d":"-120.49302"},"http://www.google.com/maps/place/50.481712,-120.493017",8383,"Rural",180,111,"No","Yes","Yes","No ","Lac Le Jeune","FALSE","FALSE"]
[null,8384,"Stump Lake","No","No","No","Thompson-Nicola Regional District","Thompson--Okanagan",{"$nulls":8},"","","",null,0,0,null,null,{"$f":"IF(AB443=\"Y\",COUNT(#REF!), \"\")","v":""},null,"Stump Lake","N",{"v":50.388316,"d":"50.38832"},{"v":-120.327795,"d":"-120.32780"},"http://www.google.com/maps/place/50.388316,-120.327795",8384,"Rural",20,38,"No","Yes","No","No ","Stump Lake","FALSE","FALSE"]
[null,8385,"Douglas Lake","No","No","No","Thompson-Nicola Regional District","Thompson--Okanagan",{"$nulls":8},"","","",null,0,0,null,null,{"$f":"IF(AB444=\"Y\",COUNT(#REF!), \"\")","v":""},null,"Douglas Lake","N",{"v":50.1667,"d":"50.16670"},{"v":-120.2,"d":"-120.20000"},"http://www.google.com/maps/place/50.1667,-120.2",8385,"Rural",23,28,"No","Yes","No","No ","Douglas Lake","FALSE","FALSE"]
[null,8387,"Black Pines","No","No","No","Thompson-Nicola Regional District","Thompson--Okanagan",{"$nulls":8},"","","",null,0,0,null,null,{"$f":"IF(AB445=\"Y\",COUNT(#REF!), \"\")","v":""},null,"Black Pines","N",{"v":50.933875,"d":"50.93388"},{"v":-120.258378,"d":"-120.25838"},"http://www.google.com/maps/place/50.933875,-120.258378",8387,"Rural",131,53,"No","Yes","No","No ","Black Pines","FALSE","FALSE"]
[null,8389,"Cahilty","No","No","No","Thompson-Nicola Regional District","Thompson--Okanagan",{"$nulls":8},"","","",null,0,0,null,null,{"$f":"IF(AB446=\"Y\",COUNT(#REF!), \"\")","v":""},null,"Cahilty","N",{"v":50.949999,"d":"50.95000"},{"v":-120.016701,"d":"-120.01670"},"http://www.google.com/maps/place/50.949999,-120.016701",8389,"Rural",12,7,"No","Yes","No","No ","Cahilty","FALSE","FALSE"]
[null,8390,"McLure","No","Yes","Yes","Thompson-Nicola Regional District","Thompson--Okanagan",{"$nulls":8},"","","",null,0,0,null,null,{"$f":"IF(AB447=\"Y\",COUNT(#REF!), \"\")","v":""},null,"McLure","N",{"v":51.053898,"d":"51.05390"},-120.22455,"http://www.google.com/maps/place/51.053898,-120.22455",8390,"Rural",113,53,"No","Yes","No","No ","McLure","FALSE","FALSE"]
[null,8391,"Louis Creek","No","No","Yes","Thompson-Nicola Regional District","Thompson--Okanagan",{"$nulls":8},"","","",null,0,0,null,null,{"$f":"IF(AB448=\"Y\",COUNT(#REF!), \"\")","v":""},null,"Louis Creek","N",{"v":51.140109,"d":"51.14011"},{"v":-120.121611,"d":"-120.12161"},"http://www.google.com/maps/place/51.140109,-120.121611",8391,"Rural",93,52,"No","Yes","Yes","No ","Louis Creek","FALSE","FALSE"]
[null,8392,"Barriere","No","No","Yes","Thompson-Nicola Regional District","Thompson--Okanagan",{"$nulls":8},"","","",null,0,0,null,null,{"$f":"IF(AB449=\"Y\",COUNT(#REF!), \"\")","v":""},null,"Barriere","N",51.18191,-120.13341,"http://www.google.com/maps/place/51.18191,-120.13341",8392,"Rural",928,438,"No","Yes","Yes","No ","Barriere","FALSE","FALSE"]
[null,8393,"Chinook Cove","No","No","Yes","Thompson-Nicola Regional District","Thompson--Okanagan",{"$nulls":8},"","","",null,0,0,null,null,{"$f":"IF(AB450=\"Y\",COUNT(#REF!), \"\")","v":""},null,"Chinook Cove","N",{"v":51.233299,"d":"51.23330"},{"v":-120.1667,"d":"-120.16670"},"http://www.google.com/maps/place/51.233299,-120.1667",8393,"Rural",148,72,"No","Yes","No","No ","Chinook Cove","FALSE","FALSE"]
[null,8394,"Simpcw*","No","No","Yes","Thompson-Nicola Regional District","Thompson--Okanagan",{"$nulls":8},"","","",null,0,0,null,null,{"$f":"IF(AB451=\"Y\",COUNT(#REF!), \"\")","v":0},null,"Simpcw","Y",{"v":51.265369,"d":"51.26537"},{"v":-120.151162,"d":"-120.15116"},"http://www.google.com/maps/place/51.265369,-120.151162",8394,"Rural First Nations Primary Reserve",148,72,"No","Yes","Yes","No ","Simpcw*","FALSE","FALSE"]
[null,8395,"Darfield","No","No","Yes","Thompson-Nicola Regional District","Thompson--Okanagan",{"$nulls":8},"","","",null,0,0,null,null,{"$f":"IF(AB452=\"Y\",COUNT(#REF!), \"\")","v":""},null,"Darfield","N",{"v":51.3,"d":"51.30000"},{"v":-120.183299,"d":"-120.18330"},"http://www.google.com/maps/place/51.3,-120.183299",8395,"Rural",157,77,"No","Yes","Yes","No ","Darfield","FALSE","FALSE"]
[null,8396,"Little Fort","No","Yes","Yes","Thompson-Nicola Regional District","Thompson--Okanagan",{"$nulls":8},"","","",null,0,0,null,null,{"$f":"IF(AB453=\"Y\",COUNT(#REF!), \"\")","v":""},null,"Little Fort","N",{"v":51.424856,"d":"51.42486"},-120.20693,"http://www.google.com/maps/place/51.424856,-120.20693",8396,"Rural",132,63,"No","Yes","Yes","No ","Little Fort","FALSE","FALSE"]
[null,8397,"Clearwater","No","Yes","Yes","Thompson-Nicola Regional District","Thompson--Okanagan",{"$nulls":8},"","","",null,0,0,null,null,{"$f":"IF(AB454=\"Y\",COUNT(#REF!), \"\")","v":""},null,"Clearwater","N",{"v":51.65,"d":"51.65000"},{"v":-120.0333,"d":"-120.03330"},"http://www.google.com/maps/place/51.65,-120.0333",8397,"Rural",858,406,"No","Yes","No","No ","Clearwater","FALSE","FALSE"]
[null,8398,"Blackpool","No","Yes","Yes","Thompson-Nicola Regional District","Thompson--Okanagan",{"$nulls":8},"","","",null,0,0,null,null,{"$f":"IF(AB455=\"Y\",COUNT(#REF!), \"\")","v":""},null,"Blackpool","N",{"v":51.596903,"d":"51.59690"},{"v":-120.119771,"d":"-120.11977"},"http://www.google.com/maps/place/51.596903,-120.119771",8398,"Rural",517,323,"No","Yes","Yes","No ","Blackpool","FALSE","FALSE"]
[null,8399,"Birch Island","No","No","Yes","Thompson-Nicola Regional District","Thompson--Okanagan",{"$nulls":8},"","","",null,0,0,null,null,{"$f":"IF(AB456=\"Y\",COUNT(#REF!), \"\")","v":""},null,"Birch Island","N",{"v":51.597084,"d":"51.59708"},{"v":-119.910417,"d":"-119.91042"},"http://www.google.com/maps/place/51.597084,-119.910417",8399,"Rural",31,13,"No","Yes","Yes","No ","Birch Island","FALSE","FALSE"]
[null,8400,"Vavenby","No","Yes","Yes","Thompson-Nicola Regional District","Thompson--Okanagan",{"$nulls":8},"","","",null,0,0,null,null,{"$f":"IF(AB457=\"Y\",COUNT(#REF!), \"\")","v":""},null,"Vavenby","N",{"v":51.585763,"d":"51.58576"},{"v":-119.726132,"d":"-119.72613"},"http://www.google.com/maps/place/51.585763,-119.726132",8400,"Rural",270,136,"No","Yes","No","No ","Vavenby","FALSE","FALSE"]
[null,8401,"Avola","No","No","Yes","Thompson-Nicola Regional District","Thompson--Okanagan",{"$nulls":8},"","","",null,0,0,null,null,{"$f":"IF(AB458=\"Y\",COUNT(#REF!), \"\")","v":""},null,"Avola","N",{"v":51.781182,"d":"51.78118"},-119.32323,"http://www.google.com/maps/place/51.781182,-119.32323",8401,"Rural",56,45,"No","Yes","No","No ","Avola","FALSE","FALSE"]
[null,8402,"Blue River","No","No","Yes","Thompson-Nicola Regional District","Thompson--Okanagan",{"$nulls":8},"","","",null,0,0,null,null,{"$f":"IF(AB459=\"Y\",COUNT(#REF!), \"\")","v":""},null,"Blue River","N",{"v":52.106146,"d":"52.10615"},{"v":-119.305862,"d":"-119.30586"},"http://www.google.com/maps/place/52.106146,-119.305862",8402,"Rural",159,162,"No","Yes","No","No ","Blue River","FALSE","FALSE"]
[null,8403,"Mica Creek","No","No","No","Columbia-Shuswap Regional District","Thompson--Okanagan",{"$nulls":8},"","","",null,0,0,null,null,{"$f":"IF(AB460=\"Y\",COUNT(#REF!), \"\")","v":""},null,"Mica Creek","N",{"v":52.005881,"d":"52.00588"},{"v":-118.561519,"d":"-118.56152"},"http://www.google.com/maps/place/52.005881,-118.561519",8403,"Rural",5,56,"No","Yes","No","No ","Mica Creek","FALSE","FALSE"]
[null,8404,"Summit Lake","No","No","No","Regional District of Central Kootenay","Kootenay",{"$nulls":8},"","","",null,0,0,null,null,{"$f":"IF(AB461=\"Y\",COUNT(#REF!), \"\")","v":""},null,"Summit Lake","N",{"v":50.152267,"d":"50.15227"},{"v":-117.660714,"d":"-117.66071"},"http://www.google.com/maps/place/50.152267,-117.660714",8404,"Rural",1,1,"No","Yes","No","No ","Summit Lake","FALSE","FALSE"]
[null,8405,"Shoreholme","No","Yes","Yes","Regional District of Central Kootenay","Kootenay",{"$nulls":8},"","","",null,0,0,null,null,{"$f":"IF(AB462=\"Y\",COUNT(#REF!), \"\")","v":""},null,"Shoreholme","N",{"v":50.299999,"d":"50.30000"},{"v":-117.850001,"d":"-117.85000"},"http://www.google.com/maps/place/50.299999,-117.850001",8405,"Rural",1,1,"No","Yes","Yes","No ","Shoreholme","FALSE","FALSE"]
[null,8406,"Albreda","Yes","Yes","No","Regional District of Fraser-Fort George","Cariboo",{"$nulls":8},"","","",null,0,0,null,null,{"$f":"IF(AB463=\"Y\",COUNT(#REF!), \"\")","v":""},null,"Albreda","N",{"v":52.6375,"d":"52.63750"},{"v":-119.1625,"d":"-119.16250"},"http://www.google.com/maps/place/52.6375,-119.1625",8406,"Rural",3,3,"No","Yes","No","No ","Albreda","FALSE","FALSE"]
[null,8407,"Valemount","Yes","Yes","Yes","Regional District of Fraser-Fort George","Cariboo",{"$nulls":8},"","","",null,0,0,null,null,{"$f":"IF(AB464=\"Y\",COUNT(#REF!), \"\")","v":""},null,"Valemount","N",{"v":52.830511,"d":"52.83051"},{"v":-119.265048,"d":"-119.26505"},"http://www.google.com/maps/place/52.830511,-119.265048",8407,"Rural",758,427,"No","Yes","No","No ","Valemount","FALSE","FALSE"]
[null,8408,"Cedarside","No","No","Yes","Regional District of Fraser-Fort George","Cariboo",{"$nulls":8},"","","",null,0,0,null,null,{"$f":"IF(AB465=\"Y\",COUNT(#REF!), \"\")","v":""},null,"Cedarside","N",{"v":52.782348,"d":"52.78235"},-119.25013,"http://www.google.com/maps/place/52.782348,-119.25013",8408,"Rural",758,427,"No","Yes","No","No ","Cedarside","FALSE","FALSE"]
[null,8409,"Tête Jaune Cache","No","No","Yes","Regional District of Fraser-Fort George","Cariboo",{"$nulls":8},"","","",null,0,0,null,null,{"$f":"IF(AB466=\"Y\",COUNT(#REF!), \"\")","v":""},null,"Tête Jaune Cache","N",{"v":52.9667,"d":"52.96670"},{"v":-119.4292,"d":"-119.42920"},"http://www.google.com/maps/place/52.9667,-119.4292",8409,"Rural",112,58,"No","Yes","Yes","No ","Tête Jaune Cache","FALSE","FALSE"]
[null,8410,"Mount Robson","No","No","No","Regional District of Fraser-Fort George","Cariboo",{"$nulls":8},"","","",null,0,0,null,null,{"$f":"IF(AB467=\"Y\",COUNT(#REF!), \"\")","v":""},null,"Mount Robson","N",{"v":53.030941,"d":"53.03094"},{"v":-119.227711,"d":"-119.22771"},"http://www.google.com/maps/place/53.030941,-119.227711",8410,"Rural",36,19,"No","Yes","No","No ","Mount Robson","FALSE","FALSE"]
[null,8411,"Dunster","No","No","Yes","Regional District of Fraser-Fort George","Cariboo",{"$nulls":8},"","","",null,0,0,null,null,{"$f":"IF(AB468=\"Y\",COUNT(#REF!), \"\")","v":""},null,"Dunster","N",{"v":53.126983,"d":"53.12698"},{"v":-119.838844,"d":"-119.83884"},"http://www.google.com/maps/place/53.126983,-119.838844",8411,"Rural",92,51,"No","Yes","Yes","No ","Dunster","FALSE","FALSE"]
[null,8412,"McBride","No","Yes","Yes","Regional District of Fraser-Fort George","Cariboo",{"$nulls":8},"","","",null,0,0,null,null,{"$f":"IF(AB469=\"Y\",COUNT(#REF!), \"\")","v":""},null,"McBride","N",{"v":53.299999,"d":"53.30000"},{"v":-120.166701,"d":"-120.16670"},"http://www.google.com/maps/place/53.299999,-120.166701",8412,"Rural",654,342,"No","Yes","No","No ","McBride","FALSE","FALSE"]
[null,8413,"Crescent Spur","No","No","Yes","Regional District of Fraser-Fort George","Cariboo",{"$nulls":8},"","","",null,0,0,null,null,{"$f":"IF(AB470=\"Y\",COUNT(#REF!), \"\")","v":""},null,"Crescent Spur","N",{"v":53.571733,"d":"53.57173"},{"v":-120.695463,"d":"-120.69546"},"http://www.google.com/maps/place/53.571733,-120.695463",8413,"Rural",37,18,"No","Yes","Yes","No ","Crescent Spur","FALSE","FALSE"]
[null,8414,"Loos","No","No","Yes","Regional District of Fraser-Fort George","Cariboo",{"$nulls":8},"","","",null,0,0,null,null,{"$f":"IF(AB471=\"Y\",COUNT(#REF!), \"\")","v":""},null,"Loos","N",{"v":53.602086,"d":"53.60209"},{"v":-120.718867,"d":"-120.71887"},"http://www.google.com/maps/place/53.602086,-120.718867",8414,"Rural",37,18,"No","Yes","Yes","No ","Loos","FALSE","FALSE"]
[null,8415,"Dome Creek","No","No","Yes","Regional District of Fraser-Fort George","Cariboo",{"$nulls":8},"","","",null,0,0,null,null,{"$f":"IF(AB472=\"Y\",COUNT(#REF!), \"\")","v":""},null,"Dome Creek","N",{"v":53.742521,"d":"53.74252"},{"v":-121.026079,"d":"-121.02608"},"http://www.google.com/maps/place/53.742521,-121.026079",8415,"Rural",25,15,"No","Yes","Yes","No ","Dome Creek","FALSE","FALSE"]
[null,8416,"Penny","No","No","Yes","Regional District of Fraser-Fort George","Cariboo",{"$nulls":8},"","","",null,0,0,null,null,{"$f":"IF(AB473=\"Y\",COUNT(#REF!), \"\")","v":""},null,"Penny","N",{"v":53.847405,"d":"53.84741"},{"v":-121.283521,"d":"-121.28352"},"http://www.google.com/maps/place/53.847405,-121.283521",8416,"Rural",0,0,"No","Yes","Yes","No ","Penny","FALSE","FALSE"]
[null,8417,"Sinclair Mills","No","No","No","Regional District of Fraser-Fort George","Cariboo",{"$nulls":8},"","","",null,0,0,null,null,{"$f":"IF(AB474=\"Y\",COUNT(#REF!), \"\")","v":""},null,"Sinclair Mills","N",{"v":54.016699,"d":"54.01670"},{"v":-121.683301,"d":"-121.68330"},"http://www.google.com/maps/place/54.016699,-121.683301",8417,"Rural",10,7,"No","Yes","Yes","No ","Sinclair Mills","FALSE","FALSE"]
[null,8418,"Upper Fraser","No","No","No","Regional District of Fraser-Fort George","Cariboo",{"$nulls":8},"","","",null,0,0,null,null,{"$f":"IF(AB475=\"Y\",COUNT(#REF!), \"\")","v":""},null,"Upper Fraser","N",{"v":54.108237,"d":"54.10824"},{"v":-121.930563,"d":"-121.93056"},"http://www.google.com/maps/place/54.108237,-121.930563",8418,"Rural",1,0,"No","Yes","Yes","No ","Upper Fraser","FALSE","FALSE"]
[null,8419,"Aleza Lake","No","No","Yes","Regional District of Fraser-Fort George","Cariboo",{"$nulls":8},"","","",null,0,0,null,null,{"$f":"IF(AB476=\"Y\",COUNT(#REF!), \"\")","v":""},null,"Aleza Lake","N",54.11433,{"v":-122.033734,"d":"-122.03373"},"http://www.google.com/maps/place/54.11433,-122.033734",8419,"Rural",16,11,"No","Yes","No","No ","Aleza Lake","FALSE","FALSE"]
[null,8420,"Willow River","No","No","Yes","Regional District of Fraser-Fort George","Cariboo",{"$nulls":8},"","","",null,0,0,null,null,{"$f":"IF(AB477=\"Y\",COUNT(#REF!), \"\")","v":""},null,"Willow River","N",{"v":54.078726,"d":"54.07873"},{"v":-122.474372,"d":"-122.47437"},"http://www.google.com/maps/place/54.078726,-122.474372",8420,"Rural",175,96,"No","Yes","Yes","No ","Willow River","FALSE","FALSE"]
[null,8421,"Giscome","No","No","Yes","Regional District of Fraser-Fort George","Cariboo",{"$nulls":8},"","","",null,0,0,null,null,{"$f":"IF(AB478=\"Y\",COUNT(#REF!), \"\")","v":""},null,"Giscome","N",{"v":54.0667,"d":"54.06670"},{"v":-122.366701,"d":"-122.36670"},"http://www.google.com/maps/place/54.0667,-122.366701",8421,"Rural",66,31,"No","Yes","No","No ","Giscome","FALSE","FALSE"]
[null,8422,"Prince George","Yes","Yes","Yes","Regional District of Fraser-Fort George","Cariboo",{"$nulls":8},"","","",null,0,0,null,null,{"$f":"IF(AB479=\"Y\",COUNT(#REF!), \"\")","v":""},null,"Prince George","N",{"v":53.911582,"d":"53.91158"},{"v":-122.775661,"d":"-122.77566"},"http://www.google.com/maps/place/53.911582,-122.775661",8422,"Urban",14186,7134,"Yes","No","Yes","No ","Prince George","FALSE","FALSE"]
[null,8423,"Shelley","Yes","Yes","Yes","Regional District of Fraser-Fort George","Cariboo",{"$nulls":8},"","","",null,0,0,null,null,{"$f":"IF(AB480=\"Y\",COUNT(#REF!), \"\")","v":""},null,"Shelley","N",{"v":54,"d":"54.00000"},{"v":-122.616699,"d":"-122.61670"},"http://www.google.com/maps/place/54,-122.616699",8423,"Rural",305,119,"No","No","Yes","No ","Shelley","FALSE","FALSE"]
[null,8425,"Foreman","No","No","Yes","Regional District of Fraser-Fort George","Cariboo",{"$nulls":8},"","","",null,0,0,null,null,{"$f":"IF(AB481=\"Y\",COUNT(#REF!), \"\")","v":""},null,"Foreman","N",{"v":53.95,"d":"53.95000"},{"v":-122.6833,"d":"-122.68330"},"http://www.google.com/maps/place/53.95,-122.6833",8425,"Rural",69,32,"No","No","No","No ","Foreman","FALSE","FALSE"]
[null,8426,{"$f":"HYPERLINK(AE482,AN482)","v":"Bonnet Hill"},"Yes","Yes","Yes","Regional District of Fraser-Fort George","Cariboo",{"$nulls":8},{"$f":"IF(L482=\"\",\"\",\nIF(SUM((J482*L482)/M482)<=N482,\"Sufficient Capacity\",\nIF(SUM((J482*L482)/M482)>N482,\"Not Enough Capacity\",\"Error\")))","v":""},{"$f":"IF(OR(ISBLANK(J482),ISBLANK(L482),ISBLANK(M482)), \"\",(J482*L482/M482))","v":""},{"$f":"IF(AND(COUNT(N482,R482)=2, OR($O$10=\"Last-Mile\", $O$10=\"Transport & Last-Mile\")), N482-R482, \"\")","v":""},null,{"$f":"IF(AND(AB482=\"Y\",I482<>\"\"),1,0)","v":0},{"$f":"IF(AND(AB482=\"Y\",I482=\"Last-Mile & Transport\"),1,0)","v":0},null,null,{"$f":"IF(AB482=\"Y\",COUNT(#REF!), \"\")","v":""},null,"Bonnet Hill","N",{"v":53.9,"d":"53.90000"},{"v":-122.616699,"d":"-122.61670"},"http://www.google.com/maps/place/53.9,-122.616699",8426,"Rural",1260,538,"Yes","No","No","No ",{"$f":"IF(AB482=\"Y\", CONCATENATE(AA482,\"*\"), AA482)","v":"Bonnet Hill"},{"$f":"IF(I482=\"Last-Mile\",\"TRUE\",IF(I482=\"Transport & Last-Mile\",\"TRUE\",\"FALSE\"))","v":"FALSE"},{"$f":"IF(I482=\"Transport\",\"TRUE\",IF(I482=\"Transport & Last-Mile\",\"TRUE\",\"FALSE\"))","v":"FALSE"}]
[null,8427,"Miworth","Yes","Yes","Yes","Regional District of Fraser-Fort George","Cariboo",{"$nulls":8},"","","",null,0,0,null,null,{"$f":"IF(AB483=\"Y\",COUNT(#REF!), \"\")","v":""},null,"Miworth","N",{"v":53.939852,"d":"53.93985"},{"v":-122.949121,"d":"-122.94912"},"http://www.google.com/maps/place/53.939852,-122.949121",8427,"Rural",406,157,"No","No","No","No ","Miworth","FALSE","FALSE"]
[null,8428,"Summit Lake","No","Yes","Yes","Regional District of Fraser-Fort George","Cariboo",{"$nulls":8},"","","",null,0,0,null,null,{"$f":"IF(AB484=\"Y\",COUNT(#REF!), \"\")","v":""},null,"Summit Lake","N",{"v":54.25,"d":"54.25000"},{"v":-122.633299,"d":"-122.63330"},"http://www.google.com/maps/place/54.25,-122.633299",8428,"Rural",39,86,"No","No","Yes","No ","Summit Lake","FALSE","FALSE"]
[null,8429,"Bear Lake","No","Yes","Yes","Regional District of Fraser-Fort George","Cariboo",{"$nulls":8},"","","",null,0,0,null,null,{"$f":"IF(AB485=\"Y\",COUNT(#REF!), \"\")","v":""},null,"Bear Lake","N",{"v":54.495906,"d":"54.49591"},-122.67922,"http://www.google.com/maps/place/54.495906,-122.67922",8429,"Rural",null,null,"No","No","Yes","No ","Bear Lake","FALSE","FALSE"]
[null,8430,"Buckhorn","Yes","Yes","Yes","Regional District of Fraser-Fort George","Cariboo",{"$nulls":8},"","","",null,0,0,null,null,{"$f":"IF(AB486=\"Y\",COUNT(#REF!), \"\")","v":""},null,"Buckhorn","N",{"v":53.794224,"d":"53.79422"},{"v":-122.654717,"d":"-122.65472"},"http://www.google.com/maps/place/53.794224,-122.654717",8430,"Rural",409,163,"No","No","No","No ","Buckhorn","FALSE","FALSE"]
[null,8431,"Pineview","No","No","Yes","Regional District of Fraser-Fort George","Cariboo",{"$nulls":8},"","","",null,0,0,null,null,{"$f":"IF(AB487=\"Y\",COUNT(#REF!), \"\")","v":""},null,"Pineview","N",{"v":53.836664,"d":"53.83666"},-122.65769,"http://www.google.com/maps/place/53.836664,-122.65769",8431,"Rural",1068,476,"No","No","Yes","No ","Pineview","FALSE","FALSE"]
[null,8432,"Red Rock","No","No","Yes","Regional District of Fraser-Fort George","Cariboo",{"$nulls":8},"","","",null,0,0,null,null,{"$f":"IF(AB488=\"Y\",COUNT(#REF!), \"\")","v":""},null,"Red Rock","N",53.68862,{"v":-122.670865,"d":"-122.67087"},"http://www.google.com/maps/place/53.68862,-122.670865",8432,"Rural",154,69,"No","Yes","Yes","No ","Red Rock","FALSE","FALSE"]
[null,8433,"Stoner","No","No","Yes","Regional District of Fraser-Fort George","Cariboo",{"$nulls":8},"","","",null,0,0,null,null,{"$f":"IF(AB489=\"Y\",COUNT(#REF!), \"\")","v":""},null,"Stoner","N",{"v":53.629067,"d":"53.62907"},{"v":-122.662451,"d":"-122.66245"},"http://www.google.com/maps/place/53.629067,-122.662451",8433,"Rural",101,45,"No","Yes","No","No ","Stoner","FALSE","FALSE"]
[null,8434,"Hixon","No","No","Yes","Regional District of Fraser-Fort George","Cariboo",{"$nulls":8},"","","",null,0,0,null,null,{"$f":"IF(AB490=\"Y\",COUNT(#REF!), \"\")","v":""},null,"Hixon","N",{"v":53.420422,"d":"53.42042"},{"v":-122.586186,"d":"-122.58619"},"http://www.google.com/maps/place/53.420422,-122.586186",8434,"Rural",75,37,"No","Yes","Yes","No ","Hixon","FALSE","FALSE"]
[null,8435,"Salmon Valley","No","Yes","Yes","Regional District of Fraser-Fort George","Cariboo",{"$nulls":8},"","","",null,0,0,null,null,{"$f":"IF(AB491=\"Y\",COUNT(#REF!), \"\")","v":""},null,"Salmon Valley","N",{"v":54.0833,"d":"54.08330"},{"v":-122.699998,"d":"-122.70000"},"http://www.google.com/maps/place/54.0833,-122.699998",8435,"Rural",59,24,"No","Yes","Yes","No ","Salmon Valley","FALSE","FALSE"]
[null,8436,"Cinema","No","No","Yes","Cariboo Regional District","Cariboo",{"$nulls":8},"","","",null,0,0,null,null,{"$f":"IF(AB492=\"Y\",COUNT(#REF!), \"\")","v":""},null,"Cinema","N",{"v":53.2333,"d":"53.23330"},{"v":-122.449999,"d":"-122.45000"},"http://www.google.com/maps/place/53.2333,-122.449999",8436,"Rural",54,33,"No","Yes","No","No ","Cinema","FALSE","FALSE"]
[null,8437,"Ten Mile Lake","No","No","Yes","Cariboo Regional District","Cariboo",{"$nulls":8},"","","",null,0,0,null,null,{"$f":"IF(AB493=\"Y\",COUNT(#REF!), \"\")","v":""},null,"Ten Mile Lake","N",{"v":53.088274,"d":"53.08827"},{"v":-122.440349,"d":"-122.44035"},"http://www.google.com/maps/place/53.088274,-122.440349",8437,"Rural",297,131,"No","Yes","Yes","No ","Ten Mile Lake","FALSE","FALSE"]
[null,8438,"Barlow Creek","Yes","Yes","Yes","Cariboo Regional District","Cariboo",{"$nulls":8},"","","",null,0,0,null,null,{"$f":"IF(AB494=\"Y\",COUNT(#REF!), \"\")","v":""},null,"Barlow Creek","N",{"v":53.023013,"d":"53.02301"},{"v":-122.445283,"d":"-122.44528"},"http://www.google.com/maps/place/53.023013,-122.445283",8438,"Rural",2347,981,"Yes","No","No","No ","Barlow Creek","FALSE","FALSE"]
[null,8439,"Quesnel","Yes","Yes","Yes","Cariboo Regional District","Cariboo",{"$nulls":8},"","","",null,0,0,null,null,{"$f":"IF(AB495=\"Y\",COUNT(#REF!), \"\")","v":""},null,"Quesnel","N",{"v":52.980551,"d":"52.98055"},-122.50429,"http://www.google.com/maps/place/52.980551,-122.50429",8439,"Rural",7927,3944,"Yes","No","Yes","No ","Quesnel","FALSE","FALSE"]
[null,8440,"Red Bluff","Yes","Yes","Yes","Cariboo Regional District","Cariboo",{"$nulls":8},"","","",null,0,0,null,null,{"$f":"IF(AB496=\"Y\",COUNT(#REF!), \"\")","v":""},null,"Red Bluff","N",{"v":52.965374,"d":"52.96537"},{"v":-122.460751,"d":"-122.46075"},"http://www.google.com/maps/place/52.965374,-122.460751",8440,"Rural",3835,1670,"Yes","No","No","No ","Red Bluff","FALSE","FALSE"]
[null,8442,"Rich Bar","Yes","Yes","Yes","Cariboo Regional District","Cariboo",{"$nulls":8},"","","",null,0,0,null,null,{"$f":"IF(AB497=\"Y\",COUNT(#REF!), \"\")","v":""},null,"Rich Bar","N",{"v":52.914898,"d":"52.91490"},-122.45647,"http://www.google.com/maps/place/52.914898,-122.45647",8442,"Rural",3835,1670,"Yes","No","No","No ","Rich Bar","FALSE","FALSE"]
[null,8443,"Bouchie Lake","Yes","Yes","Yes","Cariboo Regional District","Cariboo",{"$nulls":8},"","","",null,0,0,null,null,{"$f":"IF(AB498=\"Y\",COUNT(#REF!), \"\")","v":""},null,"Bouchie Lake","N",{"v":53.026172,"d":"53.02617"},-122.59733,"http://www.google.com/maps/place/53.026172,-122.59733",8443,"Rural",988,449,"No","No","No","No ","Bouchie Lake","FALSE","FALSE"]
[null,8444,"Cottonwood","No","No","No","Cariboo Regional District","Cariboo",{"$nulls":8},"","","",null,0,0,null,null,{"$f":"IF(AB499=\"Y\",COUNT(#REF!), \"\")","v":""},null,"Cottonwood","N",{"v":53.052208,"d":"53.05221"},{"v":-122.156352,"d":"-122.15635"},"http://www.google.com/maps/place/53.052208,-122.156352",8444,"Rural",20,12,"No","Yes","No","No ","Cottonwood","FALSE","FALSE"]
[null,8445,"Wells","Yes","Yes","No","Cariboo Regional District","Cariboo",{"$nulls":8},"","","",null,0,0,null,null,{"$f":"IF(AB500=\"Y\",COUNT(#REF!), \"\")","v":""},null,"Wells","N",{"v":53.104141,"d":"53.10414"},{"v":-121.570533,"d":"-121.57053"},"http://www.google.com/maps/place/53.104141,-121.570533",8445,"Rural",142,101,"No","Yes","No","No ","Wells","FALSE","FALSE"]
[null,8446,"Horsefly","No","No","No","Cariboo Regional District","Cariboo",{"$nulls":8},"","","",null,0,0,null,null,{"$f":"IF(AB501=\"Y\",COUNT(#REF!), \"\")","v":""},null,"Horsefly","N",{"v":52.333299,"d":"52.33330"},{"v":-121.416701,"d":"-121.41670"},"http://www.google.com/maps/place/52.333299,-121.416701",8446,"Rural",137,65,"No","Yes","No","No ","Horsefly","FALSE","FALSE"]
[null,8447,"Likely","No","No","No","Cariboo Regional District","Cariboo",{"$nulls":8},"","","",null,0,0,null,null,{"$f":"IF(AB502=\"Y\",COUNT(#REF!), \"\")","v":""},null,"Likely","N",{"v":52.618679,"d":"52.61868"},{"v":-121.564712,"d":"-121.56471"},"http://www.google.com/maps/place/52.618679,-121.564712",8447,"Rural",69,63,"No","Yes","Yes","No ","Likely","FALSE","FALSE"]
[null,8448,"Hydraulic","No","No","No","Cariboo Regional District","Cariboo",{"$nulls":8},"","","",null,0,0,null,null,{"$f":"IF(AB503=\"Y\",COUNT(#REF!), \"\")","v":""},null,"Hydraulic","N",{"v":52.614799,"d":"52.61480"},{"v":-121.706996,"d":"-121.70700"},"http://www.google.com/maps/place/52.614799,-121.706996",8448,"Rural",31,30,"No","Yes","Yes","No ","Hydraulic","FALSE","FALSE"]
[null,8449,"Big Lake Ranch","No","No","No","Cariboo Regional District","Cariboo",{"$nulls":8},"","","",null,0,0,null,null,{"$f":"IF(AB504=\"Y\",COUNT(#REF!), \"\")","v":""},null,"Big Lake Ranch","N",{"v":52.404901,"d":"52.40490"},{"v":-121.876238,"d":"-121.87624"},"http://www.google.com/maps/place/52.404901,-121.876238",8449,"Rural",61,33,"No","Yes","No","No ","Big Lake Ranch","FALSE","FALSE"]
[null,8450,"Quesnel Forks","No","No","No","Cariboo Regional District","Cariboo",{"$nulls":8},"","","",null,0,0,null,null,{"$f":"IF(AB505=\"Y\",COUNT(#REF!), \"\")","v":""},null,"Quesnel Forks","N",{"v":52.656395,"d":"52.65640"},{"v":-121.662565,"d":"-121.66257"},"http://www.google.com/maps/place/52.656395,-121.662565",8450,"Rural",2,4,"No","Yes","Yes","No ","Quesnel Forks","FALSE","FALSE"]
[null,8451,"Kersley","No","Yes","Yes","Cariboo Regional District","Cariboo",{"$nulls":8},"","","",null,0,0,null,null,{"$f":"IF(AB506=\"Y\",COUNT(#REF!), \"\")","v":""},null,"Kersley","N",{"v":52.835805,"d":"52.83581"},{"v":-122.418491,"d":"-122.41849"},"http://www.google.com/maps/place/52.835805,-122.418491",8451,"Rural",395,167,"No","Yes","Yes","No ","Kersley","FALSE","FALSE"]
[null,8452,"Gravelle Ferry","No","Yes","Yes","Cariboo Regional District","Cariboo",{"$nulls":8},"","","",null,0,0,null,null,{"$f":"IF(AB507=\"Y\",COUNT(#REF!), \"\")","v":""},null,"Gravelle Ferry","N",{"v":52.849999,"d":"52.85000"},{"v":-122.2333,"d":"-122.23330"},"http://www.google.com/maps/place/52.849999,-122.2333",8452,"Rural",14,6,"No","Yes","No","No ","Gravelle Ferry","FALSE","FALSE"]
[null,8453,"McLeese Lake","No","No","Yes","Cariboo Regional District","Cariboo",{"$nulls":8},"","","",null,0,0,null,null,{"$f":"IF(AB508=\"Y\",COUNT(#REF!), \"\")","v":""},null,"McLeese Lake","N",{"v":52.413659,"d":"52.41366"},-122.29621,"http://www.google.com/maps/place/52.413659,-122.29621",8453,"Rural",66,41,"No","Yes","No","No ","McLeese Lake","FALSE","FALSE"]
[null,8454,"Soda Creek*","Yes","Yes","No","Cariboo Regional District","Cariboo",{"$nulls":8},"","","",null,0,0,null,null,{"$f":"IF(AB509=\"Y\",COUNT(#REF!), \"\")","v":0},null,"Soda Creek","Y",{"v":52.327502,"d":"52.32750"},{"v":-122.274759,"d":"-122.27476"},"http://www.google.com/maps/place/52.327502,-122.274759",8454,"Rural First Nations Secondary Reserve",80,25,"No","Yes","Yes","No ","Soda Creek*","FALSE","FALSE"]
[null,8455,"Soda Creek","No","No","No","Cariboo Regional District","Cariboo",{"$nulls":8},"","","",null,0,0,null,null,{"$f":"IF(AB510=\"Y\",COUNT(#REF!), \"\")","v":""},null,"Soda Creek","N",{"v":52.346582,"d":"52.34658"},{"v":-122.292173,"d":"-122.29217"},"http://www.google.com/maps/place/52.346582,-122.292173",8455,"Rural",128,71,"No","Yes","Yes","No ","Soda Creek","FALSE","FALSE"]
[null,8456,"Williams Lake","Yes","Yes","Yes","Cariboo Regional District","Cariboo",{"$nulls":8},"","","",null,0,0,null,null,{"$f":"IF(AB511=\"Y\",COUNT(#REF!), \"\")","v":""},null,"Williams Lake","N",{"v":52.141472,"d":"52.14147"},{"v":-122.142883,"d":"-122.14288"},"http://www.google.com/maps/place/52.141472,-122.142883",8456,"Rural",9762,4441,"Yes","No","Yes","No ","Williams Lake","FALSE","FALSE"]
[null,8458,"150 Mile House","No","No","Yes","Cariboo Regional District","Cariboo",{"$nulls":8},"","","",null,0,0,null,null,{"$f":"IF(AB512=\"Y\",COUNT(#REF!), \"\")","v":""},null,"150 Mile House","N",{"v":52.114653,"d":"52.11465"},{"v":-121.935482,"d":"-121.93548"},"http://www.google.com/maps/place/52.114653,-121.935482",8458,"Rural",438,191,"No","Yes","No","No ","150 Mile House","FALSE","FALSE"]
[null,8459,"Esler","Yes","Yes","Yes","Cariboo Regional District","Cariboo",{"$nulls":8},"","","",null,0,0,null,null,{"$f":"IF(AB513=\"Y\",COUNT(#REF!), \"\")","v":""},null,"Esler","N",{"v":52.104183,"d":"52.10418"},{"v":-122.184318,"d":"-122.18432"},"http://www.google.com/maps/place/52.104183,-122.184318",8459,"Rural",542,251,"Yes","No","No","No ","Esler","FALSE","FALSE"]
[null,8460,"Chilcotin Road Area","Yes","Yes","Yes","Cariboo Regional District","Cariboo",{"$nulls":8},"","","",null,0,0,null,null,{"$f":"IF(AB514=\"Y\",COUNT(#REF!), \"\")","v":""},null,"Chilcotin Road Area","N",{"v":52.116587,"d":"52.11659"},{"v":-122.179007,"d":"-122.17901"},"http://www.google.com/maps/place/52.116587,-122.179007",8460,"Rural",542,251,"Yes","No","Yes","No ","Chilcotin Road Area","FALSE","FALSE"]
[null,8461,"Dog Creek","Yes","Yes","Yes","Cariboo Regional District","Cariboo",{"$nulls":8},"","","",null,0,0,null,null,{"$f":"IF(AB515=\"Y\",COUNT(#REF!), \"\")","v":""},null,"Dog Creek","N",{"v":52.094361,"d":"52.09436"},{"v":-122.114278,"d":"-122.11428"},"http://www.google.com/maps/place/52.094361,-122.114278",8461,"Rural",1928,868,"Yes","No","Yes","No ","Dog Creek","FALSE","FALSE"]
[null,8462,"South Lakeside","Yes","Yes","Yes","Cariboo Regional District","Cariboo",{"$nulls":8},"","","",null,0,0,null,null,{"$f":"IF(AB516=\"Y\",COUNT(#REF!), \"\")","v":""},null,"South Lakeside","N",{"v":52.1083,"d":"52.10830"},{"v":-122.0972,"d":"-122.09720"},"http://www.google.com/maps/place/52.1083,-122.0972",8462,"Rural",1550,804,"Yes","No","No","No ","South Lakeside","FALSE","FALSE"]
[null,8463,"Pine Valley","Yes","Yes","Yes","Cariboo Regional District","Cariboo",{"$nulls":8},"","","",null,0,0,null,null,{"$f":"IF(AB517=\"Y\",COUNT(#REF!), \"\")","v":""},null,"Pine Valley","N",{"v":52.175254,"d":"52.17525"},{"v":-122.089671,"d":"-122.08967"},"http://www.google.com/maps/place/52.175254,-122.089671",8463,"Rural",727,280,"No","No","No","No ","Pine Valley","FALSE","FALSE"]
[null,8464,"Fox Mountain","No","No","Yes","Cariboo Regional District","Cariboo",{"$nulls":8},"","","",null,0,0,null,null,{"$f":"IF(AB518=\"Y\",COUNT(#REF!), \"\")","v":""},null,"Fox Mountain","N",{"v":52.140229,"d":"52.14023"},-122.11632,"http://www.google.com/maps/place/52.140229,-122.11632",8464,"Rural",9762,4441,"Yes","No","Yes","No ","Fox Mountain","FALSE","FALSE"]
[null,8465,"Commodore Heights","Yes","Yes","Yes","Cariboo Regional District","Cariboo",{"$nulls":8},"","","",null,0,0,null,null,{"$f":"IF(AB519=\"Y\",COUNT(#REF!), \"\")","v":""},null,"Commodore Heights","N",{"v":52.166699,"d":"52.16670"},{"v":-122.1333,"d":"-122.13330"},"http://www.google.com/maps/place/52.166699,-122.1333",8465,"Rural",9762,4441,"Yes","No","No","No ","Commodore Heights","FALSE","FALSE"]
[null,8466,"Wildwood","Yes","Yes","Yes","Cariboo Regional District","Cariboo",{"$nulls":8},"","","",null,0,0,null,null,{"$f":"IF(AB520=\"Y\",COUNT(#REF!), \"\")","v":""},null,"Wildwood","N",{"v":52.213421,"d":"52.21342"},{"v":-122.088781,"d":"-122.08878"},"http://www.google.com/maps/place/52.213421,-122.088781",8466,"Rural",513,235,"Yes","No","Yes","No ","Wildwood","FALSE","FALSE"]
[null,8467,"Miocene","No","No","No","Cariboo Regional District","Cariboo",{"$nulls":8},"","","",null,0,0,null,null,{"$f":"IF(AB521=\"Y\",COUNT(#REF!), \"\")","v":""},null,"Miocene","N",52.25033,{"v":-121.771385,"d":"-121.77139"},"http://www.google.com/maps/place/52.25033,-121.771385",8467,"Rural",424,186,"No","Yes","No","No ","Miocene","FALSE","FALSE"]
[null,8468,"Black Creek","No","No","No","Cariboo Regional District","Cariboo",{"$nulls":8},"","","",null,0,0,null,null,{"$f":"IF(AB522=\"Y\",COUNT(#REF!), \"\")","v":""},null,"Black Creek","N",{"v":52.298115,"d":"52.29812"},{"v":-121.093121,"d":"-121.09312"},"http://www.google.com/maps/place/52.298115,-121.093121",8468,"Rural",4,4,"No","Yes","No","No ","Black Creek","FALSE","FALSE"]
[null,8469,"Dugan Lake","No","No","No","Cariboo Regional District","Cariboo",{"$nulls":8},"","","",null,0,0,null,null,{"$f":"IF(AB523=\"Y\",COUNT(#REF!), \"\")","v":""},null,"Dugan Lake","N",{"v":52.1667,"d":"52.16670"},{"v":-121.924998,"d":"-121.92500"},"http://www.google.com/maps/place/52.1667,-121.924998",8469,"Rural",505,200,"No","Yes","No","No ","Dugan Lake","FALSE","FALSE"]
[null,8471,"Riske Creek","No","No","No","Cariboo Regional District","Cariboo",{"$nulls":8},"","","",null,0,0,null,null,{"$f":"IF(AB524=\"Y\",COUNT(#REF!), \"\")","v":""},null,"Riske Creek","N",{"v":51.959617,"d":"51.95962"},{"v":-122.518247,"d":"-122.51825"},"http://www.google.com/maps/place/51.959617,-122.518247",8471,"Rural",23,12,"No","Yes","Yes","No ","Riske Creek","FALSE","FALSE"]
[null,8473,"Springhouse","No","No","Yes","Cariboo Regional District","Cariboo",{"$nulls":8},"","","",null,0,0,null,null,{"$f":"IF(AB525=\"Y\",COUNT(#REF!), \"\")","v":""},null,"Springhouse","N",{"v":51.966701,"d":"51.96670"},{"v":-122.1333,"d":"-122.13330"},"http://www.google.com/maps/place/51.966701,-122.1333",8473,"Rural",117,52,"No","Yes","Yes","No ","Springhouse","FALSE","FALSE"]
[null,8474,"St. Joseph Mission","No","No","Yes","Cariboo Regional District","Cariboo",{"$nulls":8},"","","",null,0,0,null,null,{"$f":"IF(AB526=\"Y\",COUNT(#REF!), \"\")","v":""},null,"St. Joseph Mission","N",{"v":52.0667,"d":"52.06670"},{"v":-121.949999,"d":"-121.95000"},"http://www.google.com/maps/place/52.0667,-121.949999",8474,"Rural",56,23,"No","Yes","No","No ","St. Joseph Mission","FALSE","FALSE"]
[null,8475,"141 Mile House","No","No","Yes","Cariboo Regional District","Cariboo",{"$nulls":8},"","","",null,0,0,null,null,{"$f":"IF(AB527=\"Y\",COUNT(#REF!), \"\")","v":""},null,"141 Mile House","N",{"v":51.994,"d":"51.99400"},{"v":-121.845635,"d":"-121.84564"},"http://www.google.com/maps/place/51.994,-121.845635",8475,"Rural",81,34,"No","Yes","No","No ","141 Mile House","FALSE","FALSE"]
[null,8476,"Lac la Hache","No","Yes","Yes","Cariboo Regional District","Cariboo",{"$nulls":8},"","","",null,0,0,null,null,{"$f":"IF(AB528=\"Y\",COUNT(#REF!), \"\")","v":""},null,"Lac la Hache","N",{"v":51.814529,"d":"51.81453"},{"v":-121.465151,"d":"-121.46515"},"http://www.google.com/maps/place/51.814529,-121.465151",8476,"Rural",280,172,"No","Yes","Yes","No ","Lac la Hache","FALSE","FALSE"]
[null,8477,"122 Mile House","No","Yes","Yes","Cariboo Regional District","Cariboo",{"$nulls":8},"","","",null,0,0,null,null,{"$f":"IF(AB529=\"Y\",COUNT(#REF!), \"\")","v":""},null,"122 Mile House","N",{"v":51.848347,"d":"51.84835"},{"v":-121.598813,"d":"-121.59881"},"http://www.google.com/maps/place/51.848347,-121.598813",8477,"Rural",245,188,"No","Yes","No","No ","122 Mile House","FALSE","FALSE"]
[null,8478,"Tatton","Yes","Yes","Yes","Cariboo Regional District","Cariboo",{"$nulls":8},"","","",null,0,0,null,null,{"$f":"IF(AB530=\"Y\",COUNT(#REF!), \"\")","v":""},null,"Tatton","N",{"v":51.705674,"d":"51.70567"},{"v":-121.385414,"d":"-121.38541"},"http://www.google.com/maps/place/51.705674,-121.385414",8478,"Rural",51,27,"No","Yes","No","No ","Tatton","FALSE","FALSE"]
[null,8479,"108 Mile Ranch","Yes","Yes","Yes","Cariboo Regional District","Cariboo",{"$nulls":8},"","","",null,0,0,null,null,{"$f":"IF(AB531=\"Y\",COUNT(#REF!), \"\")","v":""},null,"108 Mile Ranch","N",{"v":51.728096,"d":"51.72810"},{"v":-121.350512,"d":"-121.35051"},"http://www.google.com/maps/place/51.728096,-121.350512",8479,"Rural",2305,1057,"Yes","No","No","No ","108 Mile Ranch","FALSE","FALSE"]
[null,8480,"105 Mile House","Yes","Yes","Yes","Cariboo Regional District","Cariboo",{"$nulls":8},"","","",null,0,0,null,null,{"$f":"IF(AB532=\"Y\",COUNT(#REF!), \"\")","v":""},null,"105 Mile House","N",{"v":51.706944,"d":"51.70694"},{"v":-121.331114,"d":"-121.33111"},"http://www.google.com/maps/place/51.706944,-121.331114",8480,"Rural",936,422,"Yes","No","No","No ","105 Mile House","FALSE","FALSE"]
[null,8481,"103 Mile","Yes","Yes","Yes","Cariboo Regional District","Cariboo",{"$nulls":8},"","","",null,0,0,null,null,{"$f":"IF(AB533=\"Y\",COUNT(#REF!), \"\")","v":""},null,"103 Mile","N",{"v":51.688988,"d":"51.68899"},{"v":-121.313539,"d":"-121.31354"},"http://www.google.com/maps/place/51.688988,-121.313539",8481,"Rural",936,422,"Yes","No","No","No ","103 Mile","FALSE","FALSE"]
[null,8482,"100 Mile House","Yes","Yes","Yes","Cariboo Regional District","Cariboo",{"$nulls":8},"","","",null,0,0,null,null,{"$f":"IF(AB534=\"Y\",COUNT(#REF!), \"\")","v":""},null,"100 Mile House","N",{"v":51.639147,"d":"51.63915"},{"v":-121.294483,"d":"-121.29448"},"http://www.google.com/maps/place/51.639147,-121.294483",8482,"Rural",1979,937,"Yes","No","No","No ","100 Mile House","FALSE","FALSE"]
[null,8483,"Buffalo Creek","No","No","Yes","Cariboo Regional District","Cariboo",{"$nulls":8},"","","",null,0,0,null,null,{"$f":"IF(AB535=\"Y\",COUNT(#REF!), \"\")","v":""},null,"Buffalo Creek","N",{"v":51.7333,"d":"51.73330"},{"v":-121.150001,"d":"-121.15000"},"http://www.google.com/maps/place/51.7333,-121.150001",8483,"Rural",99,48,"No","Yes","No","No ","Buffalo Creek","FALSE","FALSE"]
[null,8484,"Gateway","No","No","Yes","Cariboo Regional District","Cariboo",{"$nulls":8},"","","",null,0,0,null,null,{"$f":"IF(AB536=\"Y\",COUNT(#REF!), \"\")","v":""},null,"Gateway","N",{"v":51.680759,"d":"51.68076"},{"v":-121.211468,"d":"-121.21147"},"http://www.google.com/maps/place/51.680759,-121.211468",8484,"Rural",314,155,"No","Yes","No","No ","Gateway","FALSE","FALSE"]
[null,8485,"Forest Grove","No","No","Yes","Cariboo Regional District","Cariboo",{"$nulls":8},"","","",null,0,0,null,null,{"$f":"IF(AB537=\"Y\",COUNT(#REF!), \"\")","v":""},null,"Forest Grove","N",{"v":51.766701,"d":"51.76670"},{"v":-121.1,"d":"-121.10000"},"http://www.google.com/maps/place/51.766701,-121.1",8485,"Rural",224,142,"No","Yes","No","No ","Forest Grove","FALSE","FALSE"]
[null,8487,"Eagle Creek","No","No","No","Cariboo Regional District","Cariboo",{"$nulls":8},"","","",null,0,0,null,null,{"$f":"IF(AB538=\"Y\",COUNT(#REF!), \"\")","v":""},null,"Eagle Creek","N",{"v":51.859737,"d":"51.85974"},{"v":-120.865743,"d":"-120.86574"},"http://www.google.com/maps/place/51.859737,-120.865743",8487,"Rural",174,209,"No","Yes","No","No ","Eagle Creek","FALSE","FALSE"]
[null,8488,"Deka Lake","No","Yes","Yes","Cariboo Regional District","Cariboo",{"$nulls":8},"","","",null,0,0,null,null,{"$f":"IF(AB539=\"Y\",COUNT(#REF!), \"\")","v":""},null,"Deka Lake","N",{"v":51.6083,"d":"51.60830"},{"v":-120.849999,"d":"-120.85000"},"http://www.google.com/maps/place/51.6083,-120.849999",8488,"Rural",222,449,"No","Yes","No","No ","Deka Lake","FALSE","FALSE"]
[null,8489,"Mahood Falls","No","No","No","Cariboo Regional District","Cariboo",{"$nulls":8},"","","",null,0,0,null,null,{"$f":"IF(AB540=\"Y\",COUNT(#REF!), \"\")","v":""},null,"Mahood Falls","N",{"v":51.842634,"d":"51.84263"},{"v":-120.639335,"d":"-120.63934"},"http://www.google.com/maps/place/51.842634,-120.639335",8489,"Rural",31,66,"No","Yes","Yes","No ","Mahood Falls","FALSE","FALSE"]
[null,8490,"Canim Lake","No","No","No","Cariboo Regional District","Cariboo",{"$nulls":8},"","","",null,0,0,null,null,{"$f":"IF(AB541=\"Y\",COUNT(#REF!), \"\")","v":""},null,"Canim Lake","N",{"v":51.766918,"d":"51.76692"},{"v":-120.894272,"d":"-120.89427"},"http://www.google.com/maps/place/51.766918,-120.894272",8490,"Rural",121,151,"No","Yes","No","No ","Canim Lake","FALSE","FALSE"]
[null,8491,"Imperial Ranchettes","Yes","Yes","Yes","Cariboo Regional District","Cariboo",{"$nulls":8},"","","",null,0,0,null,null,{"$f":"IF(AB542=\"Y\",COUNT(#REF!), \"\")","v":""},null,"Imperial Ranchettes","N",{"v":51.613026,"d":"51.61303"},{"v":-121.182952,"d":"-121.18295"},"http://www.google.com/maps/place/51.613026,-121.182952",8491,"Rural",890,445,"No","No","Yes","No ","Imperial Ranchettes","FALSE","FALSE"]
[null,8492,"Lone Butte","No","No","Yes","Cariboo Regional District","Cariboo",{"$nulls":8},"","","",null,0,0,null,null,{"$f":"IF(AB543=\"Y\",COUNT(#REF!), \"\")","v":""},null,"Lone Butte","N",51.55789,{"v":-121.216015,"d":"-121.21602"},"http://www.google.com/maps/place/51.55789,-121.216015",8492,"Rural",116,60,"No","Yes","No","No ","Lone Butte","FALSE","FALSE"]
[null,8493,"Anderson Subdivision","Yes","Yes","Yes","Cariboo Regional District","Cariboo",{"$nulls":8},"","","",null,0,0,null,null,{"$f":"IF(AB544=\"Y\",COUNT(#REF!), \"\")","v":""},null,"Anderson Subdivision","N",{"v":51.579537,"d":"51.57954"},{"v":-121.138201,"d":"-121.13820"},"http://www.google.com/maps/place/51.579537,-121.138201",8493,"Rural",577,319,"No","Yes","No","No ","Anderson Subdivision","FALSE","FALSE"]
[null,8494,"93 Mile","No","No","Yes","Cariboo Regional District","Cariboo",{"$nulls":8},"","","",null,0,0,null,null,{"$f":"IF(AB545=\"Y\",COUNT(#REF!), \"\")","v":""},null,"93 Mile","N",{"v":51.574786,"d":"51.57479"},{"v":-121.340812,"d":"-121.34081"},"http://www.google.com/maps/place/51.574786,-121.340812",8494,"Rural",113,61,"No","Yes","No","No ","93 Mile","FALSE","FALSE"]
[null,8495,{"$f":"HYPERLINK(AE546,AN546)","v":"Roe Lake"},"No","No","Yes","Cariboo Regional District","Cariboo",{"$nulls":8},{"$f":"IF(L546=\"\",\"\",\nIF(SUM((J546*L546)/M546)<=N546,\"Sufficient Capacity\",\nIF(SUM((J546*L546)/M546)>N546,\"Not Enough Capacity\",\"Error\")))","v":""},{"$f":"IF(OR(ISBLANK(J546),ISBLANK(L546),ISBLANK(M546)), \"\",(J546*L546/M546))","v":""},{"$f":"IF(AND(COUNT(N546,R546)=2, OR($O$10=\"Last-Mile\", $O$10=\"Transport & Last-Mile\")), N546-R546, \"\")","v":""},null,{"$f":"IF(AND(AB546=\"Y\",I546<>\"\"),1,0)","v":0},{"$f":"IF(AND(AB546=\"Y\",I546=\"Last-Mile & Transport\"),1,0)","v":0},null,null,{"$f":"IF(AB546=\"Y\",COUNT(#REF!), \"\")","v":""},null,"Roe Lake","N",{"v":51.520843,"d":"51.52084"},{"v":-120.831329,"d":"-120.83133"},"http://www.google.com/maps/place/51.520843,-120.831329",8495,"Rural",57,52,"No","Yes","Yes","No ",{"$f":"IF(AB546=\"Y\", CONCATENATE(AA546,\"*\"), AA546)","v":"Roe Lake"},{"$f":"IF(I546=\"Last-Mile\",\"TRUE\",IF(I546=\"Transport & Last-Mile\",\"TRUE\",\"FALSE\"))","v":"FALSE"},{"$f":"IF(I546=\"Transport\",\"TRUE\",IF(I546=\"Transport & Last-Mile\",\"TRUE\",\"FALSE\"))","v":"FALSE"}]
[null,8496,"Bridge Lake","No","No","Yes","Cariboo Regional District","Cariboo",{"$nulls":8},"","","",null,0,0,null,null,{"$f":"IF(AB547=\"Y\",COUNT(#REF!), \"\")","v":""},null,"Bridge Lake","N",{"v":51.478593,"d":"51.47859"},-120.72552,"http://www.google.com/maps/place/51.478593,-120.72552",8496,"Rural",98,127,"No","Yes","No","No ","Bridge Lake","FALSE","FALSE"]
[null,8497,"Loon Lake","No","No","Yes","Thompson-Nicola Regional District","Thompson--Okanagan",{"$nulls":8},"","","",null,0,0,null,null,{"$f":"IF(AB548=\"Y\",COUNT(#REF!), \"\")","v":""},null,"Loon Lake","N",{"v":51.0833,"d":"51.08330"},{"v":-121.3,"d":"-121.30000"},"http://www.google.com/maps/place/51.0833,-121.3",8497,"Rural",17,28,"No","Yes","Yes","No ","Loon Lake","FALSE","FALSE"]
[null,8498,"Vidette","No","No","No","Thompson-Nicola Regional District","Thompson--Okanagan",{"$nulls":8},"","","",null,0,0,null,null,{"$f":"IF(AB549=\"Y\",COUNT(#REF!), \"\")","v":""},null,"Vidette","N",{"v":51.166699,"d":"51.16670"},{"v":-120.900001,"d":"-120.90000"},"http://www.google.com/maps/place/51.166699,-120.900001",8498,"Rural",0,0,"No","Yes","No","No ","Vidette","FALSE","FALSE"]
[null,8499,"Criss Creek","No","No","No","Thompson-Nicola Regional District","Thompson--Okanagan",{"$nulls":8},"","","",null,0,0,null,null,{"$f":"IF(AB550=\"Y\",COUNT(#REF!), \"\")","v":""},null,"Criss Creek","N",{"v":51.05,"d":"51.05000"},{"v":-120.7333,"d":"-120.73330"},"http://www.google.com/maps/place/51.05,-120.7333",8499,"Rural",0,0,"No","Yes","No","No ","Criss Creek","FALSE","FALSE"]
[null,8500,"Dog Creek","Yes","Yes","No","Cariboo Regional District","Cariboo",{"$nulls":8},"","","",null,0,0,null,null,{"$f":"IF(AB551=\"Y\",COUNT(#REF!), \"\")","v":""},null,"Dog Creek","N",{"v":51.583301,"d":"51.58330"},{"v":-122.233299,"d":"-122.23330"},"http://www.google.com/maps/place/51.583301,-122.233299",8500,"Rural",89,38,"Yes","No","Yes","No ","Dog Creek","FALSE","FALSE"]
[null,8502,"Canoe Creek*","Yes","Yes","No","Cariboo Regional District","Cariboo",{"$nulls":8},"","","",null,0,0,null,null,{"$f":"IF(AB552=\"Y\",COUNT(#REF!), \"\")","v":0},null,"Canoe Creek","Y",{"v":51.595617,"d":"51.59562"},{"v":-122.092169,"d":"-122.09217"},"http://www.google.com/maps/place/51.595617,-122.092169",8502,"Rural First Nations Secondary Reserve",18,9,"Yes","No","Yes","No ","Canoe Creek*","FALSE","FALSE"]
[null,8503,"Gang Ranch","No","No","No","Cariboo Regional District","Cariboo",{"$nulls":8},"","","",null,0,0,null,null,{"$f":"IF(AB553=\"Y\",COUNT(#REF!), \"\")","v":""},null,"Gang Ranch","N",51.55376,{"v":-122.350995,"d":"-122.35100"},"http://www.google.com/maps/place/51.55376,-122.350995",8503,"Rural",22,1,"No","Yes","No","No ","Gang Ranch","FALSE","FALSE"]
[null,8504,"Canoe Creek*","Yes","Yes","No","Thompson-Nicola Regional District","Thompson--Okanagan",{"$nulls":8},"","","",null,0,0,null,null,{"$f":"IF(AB554=\"Y\",COUNT(#REF!), \"\")","v":0},null,"Canoe Creek","Y",{"v":51.469131,"d":"51.46913"},{"v":-122.148759,"d":"-122.14876"},"http://www.google.com/maps/place/51.469131,-122.148759",8504,"Rural First Nations Secondary Reserve",62,20,"No","Yes","No","No ","Canoe Creek*","FALSE","FALSE"]
[null,8505,"Big Bar Creek","No","No","No","Thompson-Nicola Regional District","Thompson--Okanagan",{"$nulls":8},"","","",null,0,0,null,null,{"$f":"IF(AB555=\"Y\",COUNT(#REF!), \"\")","v":""},null,"Big Bar Creek","N",{"v":51.182919,"d":"51.18292"},{"v":-122.117024,"d":"-122.11702"},"http://www.google.com/maps/place/51.182919,-122.117024",8505,"Rural",5,6,"No","Yes","No","No ","Big Bar Creek","FALSE","FALSE"]
[null,8506,"Hanceville","No","No","No","Cariboo Regional District","Cariboo",{"$nulls":8},"","","",null,0,0,null,null,{"$f":"IF(AB556=\"Y\",COUNT(#REF!), \"\")","v":""},null,"Hanceville","N",{"v":51.941667,"d":"51.94167"},{"v":-123.098612,"d":"-123.09861"},"http://www.google.com/maps/place/51.941667,-123.098612",8506,"Rural",183,50,"No","Yes","Yes","No ","Hanceville","FALSE","FALSE"]
[null,8509,"Alexis Creek","No","No","No","Cariboo Regional District","Cariboo",{"$nulls":8},"","","",null,0,0,null,null,{"$f":"IF(AB557=\"Y\",COUNT(#REF!), \"\")","v":""},null,"Alexis Creek","N",{"v":52.0833,"d":"52.08330"},{"v":-123.283301,"d":"-123.28330"},"http://www.google.com/maps/place/52.0833,-123.283301",8509,"Rural",68,42,"No","Yes","Yes","No ","Alexis Creek","FALSE","FALSE"]
[null,8510,"Tl'etinqox-t'in Government Office*","Yes","Yes","No","Cariboo Regional District","Cariboo",{"$nulls":8},"","","",null,0,0,null,null,{"$f":"IF(AB558=\"Y\",COUNT(#REF!), \"\")","v":0},null,"Tl'etinqox-t'in Government Office","Y",{"v":52.112626,"d":"52.11263"},{"v":-123.235654,"d":"-123.23565"},"http://www.google.com/maps/place/52.112626,-123.235654",8510,"Rural First Nations Primary Reserve",42,26,"No","Yes","Yes","No ","Tl'etinqox-t'in Government Office*","FALSE","FALSE"]
[null,8511,"Big Creek","No","No","No","Cariboo Regional District","Cariboo",{"$nulls":8},"","","",null,0,0,null,null,{"$f":"IF(AB559=\"Y\",COUNT(#REF!), \"\")","v":""},null,"Big Creek","N",51.71881,{"v":-123.037621,"d":"-123.03762"},"http://www.google.com/maps/place/51.71881,-123.037621",8511,"Rural",25,16,"No","Yes","No","No ","Big Creek","FALSE","FALSE"]
[null,8513,"Chilanko Forks","No","No","No","Cariboo Regional District","Cariboo",{"$nulls":8},"","","",null,0,0,null,null,{"$f":"IF(AB560=\"Y\",COUNT(#REF!), \"\")","v":""},null,"Chilanko Forks","N",{"v":52.119852,"d":"52.11985"},{"v":-124.060644,"d":"-124.06064"},"http://www.google.com/maps/place/52.119852,-124.060644",8513,"Rural",23,12,"No","Yes","No","No ","Chilanko Forks","FALSE","FALSE"]
[null,8514,"Chezacut","No","No","No","Cariboo Regional District","Cariboo",{"$nulls":8},"","","",null,0,0,null,null,{"$f":"IF(AB561=\"Y\",COUNT(#REF!), \"\")","v":""},null,"Chezacut","N",{"v":52.399305,"d":"52.39931"},{"v":-124.027589,"d":"-124.02759"},"http://www.google.com/maps/place/52.399305,-124.027589",8514,"Rural",10,11,"No","Yes","Yes","No ","Chezacut","FALSE","FALSE"]
[null,8515,"Tatla Lake","No","No","No","Cariboo Regional District","Cariboo",{"$nulls":8},"","","",null,0,0,null,null,{"$f":"IF(AB562=\"Y\",COUNT(#REF!), \"\")","v":""},null,"Tatla Lake","N",{"v":51.900001,"d":"51.90000"},{"v":-124.6,"d":"-124.60000"},"http://www.google.com/maps/place/51.900001,-124.6",8515,"Rural",60,31,"No","Yes","No","No ","Tatla Lake","FALSE","FALSE"]
[null,8516,"Kleena Kleene","No","No","No","Cariboo Regional District","Cariboo",{"$nulls":8},"","","",null,0,0,null,null,{"$f":"IF(AB563=\"Y\",COUNT(#REF!), \"\")","v":""},null,"Kleena Kleene","N",{"v":51.950417,"d":"51.95042"},{"v":-124.846747,"d":"-124.84675"},"http://www.google.com/maps/place/51.950417,-124.846747",8516,"Rural",5,3,"No","Yes","Yes","No ","Kleena Kleene","FALSE","FALSE"]
[null,8517,"Towdystan","No","No","No","Cariboo Regional District","Cariboo",{"$nulls":8},"","","",null,0,0,null,null,{"$f":"IF(AB564=\"Y\",COUNT(#REF!), \"\")","v":""},null,"Towdystan","N",{"v":52.263377,"d":"52.26338"},{"v":-125.086839,"d":"-125.08684"},"http://www.google.com/maps/place/52.263377,-125.086839",8517,"Rural",11,5,"No","Yes","No","No ","Towdystan","FALSE","FALSE"]
[null,8518,"Ulkatcho*","Yes","Yes","No","Cariboo Regional District","Cariboo",{"$nulls":8},"","","",null,0,0,null,null,{"$f":"IF(AB565=\"Y\",COUNT(#REF!), \"\")","v":0},null,"Ulkatcho","Y",{"v":52.293673,"d":"52.29367"},{"v":-125.114376,"d":"-125.11438"},"http://www.google.com/maps/place/52.293673,-125.114376",8518,"Rural First Nations Secondary Reserve",11,5,"No","Yes","No","No ","Ulkatcho*","FALSE","FALSE"]
[null,8519,"Ulkatcho*","No","No","No","Cariboo Regional District","Cariboo",{"$nulls":8},"","","",null,0,0,null,null,{"$f":"IF(AB566=\"Y\",COUNT(#REF!), \"\")","v":0},null,"Ulkatcho","Y",{"v":52.359753,"d":"52.35975"},{"v":-125.157296,"d":"-125.15730"},"http://www.google.com/maps/place/52.359753,-125.157296",8519,"Rural First Nations Secondary Reserve",52,53,"No","No","No","No ","Ulkatcho*","FALSE","FALSE"]
[null,8520,"Nimpo Lake","No","No","No","Cariboo Regional District","Cariboo",{"$nulls":8},"","","",null,0,0,null,null,{"$f":"IF(AB567=\"Y\",COUNT(#REF!), \"\")","v":""},null,"Nimpo Lake","N",{"v":52.336387,"d":"52.33639"},{"v":-125.140173,"d":"-125.14017"},"http://www.google.com/maps/place/52.336387,-125.140173",8520,"Rural",52,53,"No","No","Yes","No ","Nimpo Lake","FALSE","FALSE"]
[null,8521,"Anahim Lake","No","No","No","Cariboo Regional District","Cariboo",{"$nulls":8},"","","",null,0,0,null,null,{"$f":"IF(AB568=\"Y\",COUNT(#REF!), \"\")","v":""},null,"Anahim Lake","N",{"v":52.461372,"d":"52.46137"},{"v":-125.302967,"d":"-125.30297"},"http://www.google.com/maps/place/52.461372,-125.302967",8521,"Rural",359,203,"No","Yes","No","No ","Anahim Lake","FALSE","FALSE"]
[null,8522,"Firvale","No","No","No","Central Coast Regional District","Vancouver Island and Coast",{"$nulls":8},"","","",null,0,0,null,null,{"$f":"IF(AB569=\"Y\",COUNT(#REF!), \"\")","v":""},null,"Firvale","N",{"v":52.438496,"d":"52.43850"},{"v":-126.292298,"d":"-126.29230"},"http://www.google.com/maps/place/52.438496,-126.292298",8522,"Rural",101,46,"No","Yes","No","No ","Firvale","FALSE","FALSE"]
[null,8523,"Hagensborg","No","No","Yes","Central Coast Regional District","Vancouver Island and Coast",{"$nulls":8},"","","",null,0,0,null,null,{"$f":"IF(AB570=\"Y\",COUNT(#REF!), \"\")","v":""},null,"Hagensborg","N",{"v":52.386412,"d":"52.38641"},{"v":-126.556937,"d":"-126.55694"},"http://www.google.com/maps/place/52.386412,-126.556937",8523,"Rural",213,111,"No","Yes","Yes","No ","Hagensborg","FALSE","FALSE"]
[null,8524,"Bella Coola*","No","Yes","Yes","Central Coast Regional District","Vancouver Island and Coast",{"$nulls":8},"","","",null,0,0,null,null,{"$f":"IF(AB571=\"Y\",COUNT(#REF!), \"\")","v":0},null,"Bella Coola","Y",{"v":52.370575,"d":"52.37058"},{"v":-126.751771,"d":"-126.75177"},"http://www.google.com/maps/place/52.370575,-126.751771",8524,"Rural First Nations Primary Reserve",945,372,"No","Yes","No","No ","Bella Coola*","FALSE","FALSE"]
[null,8527,"Nazko*","No","No","No","Cariboo Regional District","Cariboo",{"$nulls":8},"","","",null,0,0,null,null,{"$f":"IF(AB572=\"Y\",COUNT(#REF!), \"\")","v":0},null,"Nazko","Y",{"v":53.217921,"d":"53.21792"},{"v":-123.501972,"d":"-123.50197"},"http://www.google.com/maps/place/53.217921,-123.501972",8527,"Rural First Nations Secondary Reserve",1,0,"No","Yes","No","No ","Nazko*","FALSE","FALSE"]
[null,8528,"Nazko","No","No","No","Cariboo Regional District","Cariboo",{"$nulls":8},"","","",null,0,0,null,null,{"$f":"IF(AB573=\"Y\",COUNT(#REF!), \"\")","v":""},null,"Nazko","N",{"v":53,"d":"53.00000"},{"v":-123.616699,"d":"-123.61670"},"http://www.google.com/maps/place/53,-123.616699",8528,"Rural",10,5,"No","Yes","No","No ","Nazko","FALSE","FALSE"]
[null,8529,"Blackwater","No","No","No","Cariboo Regional District","Cariboo",{"$nulls":8},"","","",null,0,0,null,null,{"$f":"IF(AB574=\"Y\",COUNT(#REF!), \"\")","v":""},null,"Blackwater","N",{"v":53.287529,"d":"53.28753"},{"v":-123.151307,"d":"-123.15131"},"http://www.google.com/maps/place/53.287529,-123.151307",8529,"Rural",11,6,"No","Yes","No","No ","Blackwater","FALSE","FALSE"]
[null,8530,"Punchaw","No","No","No","Regional District of Fraser-Fort George","Cariboo",{"$nulls":8},"","","",null,0,0,null,null,{"$f":"IF(AB575=\"Y\",COUNT(#REF!), \"\")","v":""},null,"Punchaw","N",{"v":53.430648,"d":"53.43065"},{"v":-123.182408,"d":"-123.18241"},"http://www.google.com/maps/place/53.430648,-123.182408",8530,"Rural",9,5,"No","Yes","Yes","No ","Punchaw","FALSE","FALSE"]
[null,8531,"Baldy Hughes","No","No","Yes","Regional District of Fraser-Fort George","Cariboo",{"$nulls":8},"","","",null,0,0,null,null,{"$f":"IF(AB576=\"Y\",COUNT(#REF!), \"\")","v":""},null,"Baldy Hughes","N",{"v":53.624596,"d":"53.62460"},-122.93323,"http://www.google.com/maps/place/53.624596,-122.93323",8531,"Rural",17,6,"No","Yes","No","No ","Baldy Hughes","FALSE","FALSE"]
[null,8532,"Ocean Falls","No","No","No","Central Coast Regional District","Vancouver Island and Coast",{"$nulls":8},"","","",null,0,0,null,null,{"$f":"IF(AB577=\"Y\",COUNT(#REF!), \"\")","v":""},null,"Ocean Falls","N",{"v":52.347209,"d":"52.34721"},{"v":-127.6885,"d":"-127.68850"},"http://www.google.com/maps/place/52.347209,-127.6885",8532,"Rural",69,40,"No","Yes","No","No ","Ocean Falls","FALSE","FALSE"]
[null,8534,"Shearwater","No","No","Yes","Central Coast Regional District","Vancouver Island and Coast",{"$nulls":8},"","","",null,0,0,null,null,{"$f":"IF(AB578=\"Y\",COUNT(#REF!), \"\")","v":""},null,"Shearwater","N",{"v":52.146602,"d":"52.14660"},{"v":-128.091995,"d":"-128.09200"},"http://www.google.com/maps/place/52.146602,-128.091995",8534,"Rural",944,436,"No","Yes","Yes","No ","Shearwater","FALSE","FALSE"]
[null,8535,"Rivers Inlet","No","No","No","Central Coast Regional District","Vancouver Island and Coast",{"$nulls":8},"","","",null,0,0,null,null,{"$f":"IF(AB579=\"Y\",COUNT(#REF!), \"\")","v":""},null,"Rivers Inlet","N",{"v":51.684164,"d":"51.68416"},{"v":-127.259337,"d":"-127.25934"},"http://www.google.com/maps/place/51.684164,-127.259337",8535,"Rural",36,21,"No","Yes","Yes","No ","Rivers Inlet","FALSE","FALSE"]
[null,8537,"Goose Bay","No","No","No","Central Coast Regional District","Vancouver Island and Coast",{"$nulls":8},"","","",null,0,0,null,null,{"$f":"IF(AB580=\"Y\",COUNT(#REF!), \"\")","v":""},null,"Goose Bay","N",{"v":51.38,"d":"51.38000"},{"v":-127.657176,"d":"-127.65718"},"http://www.google.com/maps/place/51.38,-127.657176",8537,"Rural",1,1,"No","Yes","Yes","No ","Goose Bay","FALSE","FALSE"]
[null,8538,"Good Hope","No","No","No","Central Coast Regional District","Vancouver Island and Coast",{"$nulls":8},"","","",null,0,0,null,null,{"$f":"IF(AB581=\"Y\",COUNT(#REF!), \"\")","v":""},null,"Good Hope","N",{"v":51.569548,"d":"51.56955"},{"v":-127.514551,"d":"-127.51455"},"http://www.google.com/maps/place/51.569548,-127.514551",8538,"Rural",1,1,"No","Yes","No","No ","Good Hope","FALSE","FALSE"]
[null,8539,"Dawsons Landing","No","No","No","Central Coast Regional District","Vancouver Island and Coast",{"$nulls":8},"","","",null,0,0,null,null,{"$f":"IF(AB582=\"Y\",COUNT(#REF!), \"\")","v":""},null,"Dawsons Landing","N",{"v":51.57655278,"d":"51.57655"},{"v":-127.59223056,"d":"-127.59223"},"http://www.google.com/maps/place/51.57655278,-127.59223056",8539,"Rural",1,1,"No","Yes","Yes","No ","Dawsons Landing","FALSE","FALSE"]
[null,8540,"Wadhams","No","No","No","Central Coast Regional District","Vancouver Island and Coast",{"$nulls":8},"","","",null,0,0,null,null,{"$f":"IF(AB583=\"Y\",COUNT(#REF!), \"\")","v":""},null,"Wadhams","N",51.51713,{"v":-127.519258,"d":"-127.51926"},"http://www.google.com/maps/place/51.51713,-127.519258",8540,"Rural",1,1,"No","Yes","Yes","No ","Wadhams","FALSE","FALSE"]
[null,8541,"Duncanby Landing","No","No","No","Central Coast Regional District","Vancouver Island and Coast",{"$nulls":8},"","","",null,0,0,null,null,{"$f":"IF(AB584=\"Y\",COUNT(#REF!), \"\")","v":""},null,"Duncanby Landing","N",{"v":51.406463,"d":"51.40646"},{"v":-127.644037,"d":"-127.64404"},"http://www.google.com/maps/place/51.406463,-127.644037",8541,"Rural",1,1,"No","Yes","Yes","No ","Duncanby Landing","FALSE","FALSE"]
[null,8542,"Holberg","No","No","No","Regional District of Mount Waddington","Vancouver Island and Coast",{"$nulls":8},"","","",null,0,0,null,null,{"$f":"IF(AB585=\"Y\",COUNT(#REF!), \"\")","v":""},null,"Holberg","N",{"v":50.662326,"d":"50.66233"},{"v":-128.011014,"d":"-128.01101"},"http://www.google.com/maps/place/50.662326,-128.011014",8542,"Rural",35,50,"No","Yes","Yes","No ","Holberg","FALSE","FALSE"]
[null,8543,"Winter Harbour","No","No","No","Regional District of Mount Waddington","Vancouver Island and Coast",{"$nulls":8},"","","",null,0,0,null,null,{"$f":"IF(AB586=\"Y\",COUNT(#REF!), \"\")","v":""},null,"Winter Harbour","N",{"v":50.5167,"d":"50.51670"},{"v":-128.0333,"d":"-128.03330"},"http://www.google.com/maps/place/50.5167,-128.0333",8543,"Rural",15,59,"No","Yes","Yes","No ","Winter Harbour","FALSE","FALSE"]
[null,8544,"Mahatta River","No","No","No","Regional District of Mount Waddington","Vancouver Island and Coast",{"$nulls":8},"","","",null,0,0,null,null,{"$f":"IF(AB587=\"Y\",COUNT(#REF!), \"\")","v":""},null,"Mahatta River","N",{"v":50.457536,"d":"50.45754"},{"v":-127.8016959,"d":"-127.80170"},"http://www.google.com/maps/place/50.457536,-127.8016959",8544,"Rural",3,41,"No","Yes","Yes","No ","Mahatta River","FALSE","FALSE"]
[null,8546,"Quatsino","No","No","Yes","Regional District of Mount Waddington","Vancouver Island and Coast",{"$nulls":8},"","","",null,0,0,null,null,{"$f":"IF(AB588=\"Y\",COUNT(#REF!), \"\")","v":""},null,"Quatsino","N",{"v":50.535722,"d":"50.53572"},-127.65214,"http://www.google.com/maps/place/50.535722,-127.65214",8546,"Rural",40,40,"No","Yes","Yes","No ","Quatsino","FALSE","FALSE"]
[null,8547,"Coal Harbour","No","No","Yes","Regional District of Mount Waddington","Vancouver Island and Coast",{"$nulls":8},"","","",null,0,0,null,null,{"$f":"IF(AB589=\"Y\",COUNT(#REF!), \"\")","v":""},null,"Coal Harbour","N",{"v":50.6,"d":"50.60000"},{"v":-127.5833,"d":"-127.58330"},"http://www.google.com/maps/place/50.6,-127.5833",8547,"Rural",139,98,"No","Yes","Yes","No ","Coal Harbour","FALSE","FALSE"]
[null,8550,"Port Hardy","Yes","Yes","Yes","Regional District of Mount Waddington","Vancouver Island and Coast",{"$nulls":8},"","","",null,0,0,null,null,{"$f":"IF(AB590=\"Y\",COUNT(#REF!), \"\")","v":""},null,"Port Hardy","N",50.71889,{"v":-127.506636,"d":"-127.50664"},"http://www.google.com/maps/place/50.71889,-127.506636",8550,"Rural",3732,1807,"Yes","No","Yes","No ","Port Hardy","FALSE","FALSE"]
[null,8551,"Fort Rupert","Yes","Yes","Yes","Regional District of Mount Waddington","Vancouver Island and Coast",{"$nulls":8},"","","",null,0,0,null,null,{"$f":"IF(AB591=\"Y\",COUNT(#REF!), \"\")","v":""},null,"Fort Rupert","N",{"v":50.688922,"d":"50.68892"},{"v":-127.420037,"d":"-127.42004"},"http://www.google.com/maps/place/50.688922,-127.420037",8551,"Rural",587,287,"Yes","No","Yes","No ","Fort Rupert","FALSE","FALSE"]
[null,8553,"Port McNeill","Yes","Yes","Yes","Regional District of Mount Waddington","Vancouver Island and Coast",{"$nulls":8},"","","",null,0,0,null,null,{"$f":"IF(AB592=\"Y\",COUNT(#REF!), \"\")","v":""},null,"Port McNeill","N",{"v":50.585995,"d":"50.58600"},{"v":-127.079118,"d":"-127.07912"},"http://www.google.com/maps/place/50.585995,-127.079118",8553,"Rural",2328,1105,"Yes","No","Yes","No ","Port McNeill","FALSE","FALSE"]
[null,8554,"Sointula","Yes","Yes","Yes","Regional District of Mount Waddington","Vancouver Island and Coast",{"$nulls":8},"","","",null,0,0,null,null,{"$f":"IF(AB593=\"Y\",COUNT(#REF!), \"\")","v":""},null,"Sointula","N",{"v":50.633299,"d":"50.63330"},{"v":-127.0167,"d":"-127.01670"},"http://www.google.com/maps/place/50.633299,-127.0167",8554,"Rural",478,292,"No","No","Yes","No ","Sointula","FALSE","FALSE"]
[null,8555,"Hyde Creek","Yes","Yes","Yes","Regional District of Mount Waddington","Vancouver Island and Coast",{"$nulls":8},"","","",null,0,0,null,null,{"$f":"IF(AB594=\"Y\",COUNT(#REF!), \"\")","v":""},null,"Hyde Creek","N",{"v":50.580454,"d":"50.58045"},{"v":-127.000329,"d":"-127.00033"},"http://www.google.com/maps/place/50.580454,-127.000329",8555,"Rural",338,143,"No","No","Yes","No ","Hyde Creek","FALSE","FALSE"]
[null,8556,"Alert Bay","No","Yes","Yes","Regional District of Mount Waddington","Vancouver Island and Coast",{"$nulls":8},"","","",null,0,0,null,null,{"$f":"IF(AB595=\"Y\",COUNT(#REF!), \"\")","v":""},null,"Alert Bay","N",{"v":50.578901,"d":"50.57890"},{"v":-126.919832,"d":"-126.91983"},"http://www.google.com/maps/place/50.578901,-126.919832",8556,"Rural",294,167,"No","Yes","No","No ","Alert Bay","FALSE","FALSE"]
[null,8557,"Mitchell Bay","No","No","Yes","Regional District of Mount Waddington","Vancouver Island and Coast",{"$nulls":8},"","","",null,0,0,null,null,{"$f":"IF(AB596=\"Y\",COUNT(#REF!), \"\")","v":""},null,"Mitchell Bay","N",{"v":50.6333,"d":"50.63330"},{"v":-126.85,"d":"-126.85000"},"http://www.google.com/maps/place/50.6333,-126.85",8557,"Rural",53,44,"No","Yes","Yes","No ","Mitchell Bay","FALSE","FALSE"]
[null,8559,"Yreka","No","No","No","Regional District of Mount Waddington","Vancouver Island and Coast",{"$nulls":8},"","","",null,0,0,null,null,{"$f":"IF(AB597=\"Y\",COUNT(#REF!), \"\")","v":""},null,"Yreka","N",{"v":50.463814,"d":"50.46381"},{"v":-127.558049,"d":"-127.55805"},"http://www.google.com/maps/place/50.463814,-127.558049",8559,"Rural",3,41,"No","Yes","Yes","No ","Yreka","FALSE","FALSE"]
[null,8560,"Rumble Beach","No","No","Yes","Regional District of Mount Waddington","Vancouver Island and Coast",{"$nulls":8},"","","",null,0,0,null,null,{"$f":"IF(AB598=\"Y\",COUNT(#REF!), \"\")","v":""},null,"Rumble Beach","N",{"v":50.426493,"d":"50.42649"},-127.48156,"http://www.google.com/maps/place/50.426493,-127.48156",8560,"Rural",598,512,"No","Yes","Yes","No ","Rumble Beach","FALSE","FALSE"]
[null,8561,"Port Alice","No","No","Yes","Regional District of Mount Waddington","Vancouver Island and Coast",{"$nulls":8},"","","",null,0,0,null,null,{"$f":"IF(AB599=\"Y\",COUNT(#REF!), \"\")","v":""},null,"Port Alice","N",{"v":50.3833,"d":"50.38330"},{"v":-127.449998,"d":"-127.45000"},"http://www.google.com/maps/place/50.3833,-127.449998",8561,"Rural",1,0,"No","Yes","No","No ","Port Alice","FALSE","FALSE"]
[null,8563,"Sullivan Bay","No","No","No","Regional District of Mount Waddington","Vancouver Island and Coast",{"$nulls":8},"","","",null,0,0,null,null,{"$f":"IF(AB600=\"Y\",COUNT(#REF!), \"\")","v":""},null,"Sullivan Bay","N",{"v":50.883301,"d":"50.88330"},{"v":-126.816701,"d":"-126.81670"},"http://www.google.com/maps/place/50.883301,-126.816701",8563,"Rural",5,3,"No","Yes","No","No ","Sullivan Bay","FALSE","FALSE"]
[null,8564,"Shawl Bay","No","No","No","Regional District of Mount Waddington","Vancouver Island and Coast",{"$nulls":8},"","","",null,0,0,null,null,{"$f":"IF(AB601=\"Y\",COUNT(#REF!), \"\")","v":""},null,"Shawl Bay","N",{"v":50.843285,"d":"50.84329"},{"v":-126.560418,"d":"-126.56042"},"http://www.google.com/maps/place/50.843285,-126.560418",8564,"Rural",5,4,"No","Yes","Yes","No ","Shawl Bay","FALSE","FALSE"]
[null,8565,"Thompson Sound","No","No","No","Regional District of Mount Waddington","Vancouver Island and Coast",{"$nulls":8},"","","",null,0,0,null,null,{"$f":"IF(AB602=\"Y\",COUNT(#REF!), \"\")","v":""},null,"Thompson Sound","N",{"v":50.803652,"d":"50.80365"},{"v":-126.008239,"d":"-126.00824"},"http://www.google.com/maps/place/50.803652,-126.008239",8565,"Rural",3,9,"No","Yes","Yes","No ","Thompson Sound","FALSE","FALSE"]
[null,8566,"Woss","No","Yes","Yes","Regional District of Mount Waddington","Vancouver Island and Coast",{"$nulls":8},"","","",null,0,0,null,null,{"$f":"IF(AB603=\"Y\",COUNT(#REF!), \"\")","v":""},null,"Woss","N",{"v":50.2167,"d":"50.21670"},{"v":-126.6,"d":"-126.60000"},"http://www.google.com/maps/place/50.2167,-126.6",8566,"Rural",189,144,"No","Yes","Yes","No ","Woss","FALSE","FALSE"]
[null,8567,"Echo Bay","No","No","No","Regional District of Mount Waddington","Vancouver Island and Coast",{"$nulls":8},"","","",null,0,0,null,null,{"$f":"IF(AB604=\"Y\",COUNT(#REF!), \"\")","v":""},null,"Echo Bay","N",{"v":50.748514,"d":"50.74851"},{"v":-126.494018,"d":"-126.49402"},"http://www.google.com/maps/place/50.748514,-126.494018",8567,"Rural",5,4,"No","Yes","Yes","No ","Echo Bay","FALSE","FALSE"]
[null,8568,"Minstrel Island","No","No","No","Regional District of Mount Waddington","Vancouver Island and Coast",{"$nulls":8},"","","",null,0,0,null,null,{"$f":"IF(AB605=\"Y\",COUNT(#REF!), \"\")","v":""},null,"Minstrel Island","N",{"v":50.615391,"d":"50.61539"},{"v":-126.307808,"d":"-126.30781"},"http://www.google.com/maps/place/50.615391,-126.307808",8568,"Rural",3,9,"No","Yes","No","No ","Minstrel Island","FALSE","FALSE"]
[null,8569,"Nimpkish","No","No","No","Regional District of Mount Waddington","Vancouver Island and Coast",{"$nulls":8},"","","",null,0,0,null,null,{"$f":"IF(AB606=\"Y\",COUNT(#REF!), \"\")","v":""},null,"Nimpkish","N",{"v":50.3333,"d":"50.33330"},{"v":-126.916701,"d":"-126.91670"},"http://www.google.com/maps/place/50.3333,-126.916701",8569,"Rural",0,0,"No","Yes","Yes","No ","Nimpkish","FALSE","FALSE"]
[null,8570,"Telegraph Cove","No","Yes","Yes","Regional District of Mount Waddington","Vancouver Island and Coast",{"$nulls":8},"","","",null,0,0,null,null,{"$f":"IF(AB607=\"Y\",COUNT(#REF!), \"\")","v":""},null,"Telegraph Cove","N",{"v":50.545747,"d":"50.54575"},-126.82751,"http://www.google.com/maps/place/50.545747,-126.82751",8570,"Rural",17,21,"No","Yes","No","No ","Telegraph Cove","FALSE","FALSE"]
[null,8572,"Zeballos","No","No","No","Strathcona Regional District","Vancouver Island and Coast",{"$nulls":8},"","","",null,0,0,null,null,{"$f":"IF(AB608=\"Y\",COUNT(#REF!), \"\")","v":""},null,"Zeballos","N",{"v":49.987006,"d":"49.98701"},{"v":-126.847155,"d":"-126.84716"},"http://www.google.com/maps/place/49.987006,-126.847155",8572,"Rural",200,134,"No","Yes","Yes","No ","Zeballos","FALSE","FALSE"]
[null,8574,"Ehatis 11 (Ehattesaht)","No","No","No","Strathcona Regional District","Vancouver Island and Coast",{"$nulls":8},"","","",null,0,0,null,null,{"$f":"IF(AB609=\"Y\",COUNT(#REF!), \"\")","v":""},null,"Ehatis 11 (Ehattesaht)","N",{"v":49.9828,"d":"49.98280"},{"v":-126.859674,"d":"-126.85967"},"http://www.google.com/maps/place/49.9828,-126.859674",8574,"Rural",200,134,"No","Yes","Yes","No ","Ehatis 11 (Ehattesaht)","FALSE","FALSE"]
[null,8575,{"$f":"HYPERLINK(AE610,AN610)","v":"Queens Cove"},"No","No","No","Strathcona Regional District","Vancouver Island and Coast",{"$nulls":8},{"$f":"IF(L610=\"\",\"\",\nIF(SUM((J610*L610)/M610)<=N610,\"Sufficient Capacity\",\nIF(SUM((J610*L610)/M610)>N610,\"Not Enough Capacity\",\"Error\")))","v":""},{"$f":"IF(OR(ISBLANK(J610),ISBLANK(L610),ISBLANK(M610)), \"\",(J610*L610/M610))","v":""},{"$f":"IF(AND(COUNT(N610,R610)=2, OR($O$10=\"Last-Mile\", $O$10=\"Transport & Last-Mile\")), N610-R610, \"\")","v":""},null,{"$f":"IF(AND(AB610=\"Y\",I610<>\"\"),1,0)","v":0},{"$f":"IF(AND(AB610=\"Y\",I610=\"Last-Mile & Transport\"),1,0)","v":0},null,null,{"$f":"IF(AB610=\"Y\",COUNT(#REF!), \"\")","v":""},null,"Queens Cove","N",{"v":49.884993,"d":"49.88499"},{"v":-126.985584,"d":"-126.98558"},"http://www.google.com/maps/place/49.884993,-126.985584",8575,"Rural",4,13,"No","Yes","Yes","No ",{"$f":"IF(AB610=\"Y\", CONCATENATE(AA610,\"*\"), AA610)","v":"Queens Cove"},{"$f":"IF(I610=\"Last-Mile\",\"TRUE\",IF(I610=\"Transport & Last-Mile\",\"TRUE\",\"FALSE\"))","v":"FALSE"},{"$f":"IF(I610=\"Transport\",\"TRUE\",IF(I610=\"Transport & Last-Mile\",\"TRUE\",\"FALSE\"))","v":"FALSE"}]
[null,8577,"Tahsis","No","No","No","Strathcona Regional District","Vancouver Island and Coast",{"$nulls":8},"","","",null,0,0,null,null,{"$f":"IF(AB611=\"Y\",COUNT(#REF!), \"\")","v":""},null,"Tahsis","N",{"v":49.930295,"d":"49.93030"},{"v":-126.654712,"d":"-126.65471"},"http://www.google.com/maps/place/49.930295,-126.654712",8577,"Rural",248,400,"No","Yes","Yes","No ","Tahsis","FALSE","FALSE"]
[null,8578,"Yuquot*","No","No","No","Strathcona Regional District","Vancouver Island and Coast",{"$nulls":8},"","","",null,0,0,null,null,{"$f":"IF(AB612=\"Y\",COUNT(#REF!), \"\")","v":0},null,"Yuquot","Y",{"v":49.591767,"d":"49.59177"},{"v":-126.618654,"d":"-126.61865"},"http://www.google.com/maps/place/49.591767,-126.618654",8578,"Rural First Nations Secondary Reserve",5,2,"No","Yes","Yes","No ","Yuquot*","FALSE","FALSE"]
[null,8579,"Nootka","No","No","No","Strathcona Regional District","Vancouver Island and Coast",{"$nulls":8},"","","",null,0,0,null,null,{"$f":"IF(AB613=\"Y\",COUNT(#REF!), \"\")","v":""},null,"Nootka","N",{"v":49.624775,"d":"49.62478"},{"v":-126.627196,"d":"-126.62720"},"http://www.google.com/maps/place/49.624775,-126.627196",8579,"Rural",4,3,"No","Yes","Yes","No ","Nootka","FALSE","FALSE"]
[null,8580,"Kendrick Camp","No","No","No","Strathcona Regional District","Vancouver Island and Coast",{"$nulls":8},"","","",null,0,0,null,null,{"$f":"IF(AB614=\"Y\",COUNT(#REF!), \"\")","v":""},null,"Kendrick Camp","N",{"v":49.724382,"d":"49.72438"},{"v":-126.650747,"d":"-126.65075"},"http://www.google.com/maps/place/49.724382,-126.650747",8580,"Rural",4,3,"No","Yes","Yes","No ","Kendrick Camp","FALSE","FALSE"]
[null,8581,"Blowhole","No","No","No","Strathcona Regional District","Vancouver Island and Coast",{"$nulls":8},"","","",null,0,0,null,null,{"$f":"IF(AB615=\"Y\",COUNT(#REF!), \"\")","v":""},null,"Blowhole","N",{"v":49.8292,"d":"49.82920"},{"v":-126.6764,"d":"-126.67640"},"http://www.google.com/maps/place/49.8292,-126.6764",8581,"Rural",4,3,"No","Yes","Yes","No ","Blowhole","FALSE","FALSE"]
[null,8582,"Ceepeecee","No","No","No","Strathcona Regional District","Vancouver Island and Coast",{"$nulls":8},"","","",null,0,0,null,null,{"$f":"IF(AB616=\"Y\",COUNT(#REF!), \"\")","v":""},null,"Ceepeecee","N",{"v":49.873235,"d":"49.87324"},{"v":-126.71103600000001,"d":"-126.71104"},"http://www.google.com/maps/place/49.873235,-126.711036",8582,"Rural",8,7,"No","Yes","Yes","No ","Ceepeecee","FALSE","FALSE"]
[null,8583,"Esperanza","No","No","No","Strathcona Regional District","Vancouver Island and Coast",{"$nulls":8},"","","",null,0,0,null,null,{"$f":"IF(AB617=\"Y\",COUNT(#REF!), \"\")","v":""},null,"Esperanza","N",{"v":49.871257,"d":"49.87126"},{"v":-126.738434,"d":"-126.73843"},"http://www.google.com/maps/place/49.871257,-126.738434",8583,"Rural",8,7,"No","Yes","No","No ","Esperanza","FALSE","FALSE"]
[null,8584,"Vernon","Yes","Yes","Yes","Regional District of Mount Waddington","Vancouver Island and Coast",{"$nulls":8},"","","",null,0,0,null,null,{"$f":"IF(AB618=\"Y\",COUNT(#REF!), \"\")","v":""},null,"Vernon","N",{"v":50.033301,"d":"50.03330"},{"v":-126.35,"d":"-126.35000"},"http://www.google.com/maps/place/50.033301,-126.35",8584,"Rural",null,null,"No","No","No","No ","Vernon","FALSE","FALSE"]
[null,8585,"Hesquiat*","No","No","Yes","Regional District of Alberni-Clayoquot","Vancouver Island and Coast",{"$nulls":8},"","","",null,0,0,null,null,{"$f":"IF(AB619=\"Y\",COUNT(#REF!), \"\")","v":0},null,"Hesquiat","Y",49.39585,{"v":-126.470508,"d":"-126.47051"},"http://www.google.com/maps/place/49.39585,-126.470508",8585,"Rural First Nations Secondary Reserve",5,3,"No","Yes","No","No ","Hesquiat*","FALSE","FALSE"]
[null,8586,"Estevan Point","No","No","Yes","Regional District of Alberni-Clayoquot","Vancouver Island and Coast",{"$nulls":8},"","","",null,0,0,null,null,{"$f":"IF(AB620=\"Y\",COUNT(#REF!), \"\")","v":""},null,"Estevan Point","N",{"v":49.378206,"d":"49.37821"},{"v":-126.533748,"d":"-126.53375"},"http://www.google.com/maps/place/49.378206,-126.533748",8586,"Rural",5,2,"No","Yes","Yes","No ","Estevan Point","FALSE","FALSE"]
[null,8587,"Boat Basin","No","No","No","Regional District of Alberni-Clayoquot","Vancouver Island and Coast",{"$nulls":8},"","","",null,0,0,null,null,{"$f":"IF(AB621=\"Y\",COUNT(#REF!), \"\")","v":""},null,"Boat Basin","N",{"v":49.4792,"d":"49.47920"},{"v":-126.425001,"d":"-126.42500"},"http://www.google.com/maps/place/49.4792,-126.425001",8587,"Rural",5,3,"No","Yes","Yes","No ","Boat Basin","FALSE","FALSE"]
[null,8588,"Stewardson Inlet","No","No","No","Regional District of Alberni-Clayoquot","Vancouver Island and Coast",{"$nulls":8},"","","",null,0,0,null,null,{"$f":"IF(AB622=\"Y\",COUNT(#REF!), \"\")","v":""},null,"Stewardson Inlet","N",{"v":49.421714,"d":"49.42171"},-126.31636,"http://www.google.com/maps/place/49.421714,-126.31636",8588,"Rural",5,3,"No","Yes","No","No ","Stewardson Inlet","FALSE","FALSE"]
[null,8590,"Hot Springs Cove*","No","Yes","Yes","Regional District of Alberni-Clayoquot","Vancouver Island and Coast",{"$nulls":8},"","","",null,0,0,null,null,{"$f":"IF(AB623=\"Y\",COUNT(#REF!), \"\")","v":0},null,"Hot Springs Cove","Y",{"v":49.3683298,"d":"49.36833"},{"v":-126.2723705,"d":"-126.27237"},"http://www.google.com/maps/place/49.3683298,-126.2723705",8590,"Rural First Nations Secondary Reserve",44,40,"No","Yes","No","No ","Hot Springs Cove*","FALSE","FALSE"]
[null,8592,"Marktosis*","No","No","No","Regional District of Alberni-Clayoquot","Vancouver Island and Coast",{"$nulls":8},"","","",null,0,0,null,null,{"$f":"IF(AB624=\"Y\",COUNT(#REF!), \"\")","v":0},null,"Marktosis","Y",{"v":49.278611,"d":"49.27861"},-126.05758,"http://www.google.com/maps/place/49.278611,-126.05758",8592,"Rural First Nations Primary Reserve",15,10,"No","Yes","No","No ","Marktosis*","FALSE","FALSE"]
[null,8593,"Tofino","Yes","Yes","Yes","Regional District of Alberni-Clayoquot","Vancouver Island and Coast",{"$nulls":8},"","","",null,0,0,null,null,{"$f":"IF(AB625=\"Y\",COUNT(#REF!), \"\")","v":""},null,"Tofino","N",{"v":49.150507,"d":"49.15051"},-125.90559,"http://www.google.com/maps/place/49.150507,-125.90559",8593,"Rural",472,216,"Yes","No","No","No ","Tofino","FALSE","FALSE"]
[null,8594,"Tla-o-qui-aht","Yes","Yes","Yes","Regional District of Alberni-Clayoquot","Vancouver Island and Coast",{"$nulls":8},"","","",null,0,0,null,null,{"$f":"IF(AB626=\"Y\",COUNT(#REF!), \"\")","v":""},null,"Tla-o-qui-aht","N",{"v":49.141159,"d":"49.14116"},{"v":-125.9099,"d":"-125.90990"},"http://www.google.com/maps/place/49.141159,-125.9099",8594,"Rural",472,216,"Yes","No","Yes","No ","Tla-o-qui-aht","FALSE","FALSE"]
[null,8596,"Tla-o-qui-aht*","Yes","Yes","Yes","Regional District of Alberni-Clayoquot","Vancouver Island and Coast",{"$nulls":8},"","","",null,0,0,null,null,{"$f":"IF(AB627=\"Y\",COUNT(#REF!), \"\")","v":0},null,"Tla-o-qui-aht","Y",{"v":49.071259,"d":"49.07126"},{"v":-125.781959,"d":"-125.78196"},"http://www.google.com/maps/place/49.071259,-125.781959",8596,"Rural First Nations Secondary Reserve",346,151,"Yes","No","Yes","No ","Tla-o-qui-aht*","FALSE","FALSE"]
[null,8597,"Yarksis","No","No","Yes","Regional District of Alberni-Clayoquot","Vancouver Island and Coast",{"$nulls":8},"","","",null,0,0,null,null,{"$f":"IF(AB628=\"Y\",COUNT(#REF!), \"\")","v":""},null,"Yarksis","N",{"v":49.165362,"d":"49.16536"},-125.97055,"http://www.google.com/maps/place/49.165362,-125.97055",8597,"Rural",472,216,"Yes","No","Yes","No ","Yarksis","FALSE","FALSE"]
[null,8598,"Kakawis","No","No","Yes","Regional District of Alberni-Clayoquot","Vancouver Island and Coast",{"$nulls":8},"","","",null,0,0,null,null,{"$f":"IF(AB629=\"Y\",COUNT(#REF!), \"\")","v":""},null,"Kakawis","N",{"v":49.189006,"d":"49.18901"},{"v":-125.910564,"d":"-125.91056"},"http://www.google.com/maps/place/49.189006,-125.910564",8598,"Rural",511,241,"Yes","No","No","No ","Kakawis","FALSE","FALSE"]
[null,8599,"Ucluelet*","Yes","Yes","Yes","Regional District of Alberni-Clayoquot","Vancouver Island and Coast",{"$nulls":8},"","","",null,0,0,null,null,{"$f":"IF(AB630=\"Y\",COUNT(#REF!), \"\")","v":0},null,"Ucluelet","Y",{"v":48.979354,"d":"48.97935"},{"v":-125.575967,"d":"-125.57597"},"http://www.google.com/maps/place/48.979354,-125.575967",8599,"Rural First Nations Secondary Reserve",124,62,"Yes","No","Yes","No ","Ucluelet*","FALSE","FALSE"]
[null,8600,"Ucluelet","Yes","Yes","Yes","Regional District of Alberni-Clayoquot","Vancouver Island and Coast",{"$nulls":8},"","","",null,0,0,null,null,{"$f":"IF(AB631=\"Y\",COUNT(#REF!), \"\")","v":""},null,"Ucluelet","N",{"v":48.939959,"d":"48.93996"},{"v":-125.544843,"d":"-125.54484"},"http://www.google.com/maps/place/48.939959,-125.544843",8600,"Rural",1071,540,"Yes","No","Yes","No ","Ucluelet","FALSE","FALSE"]
[null,8602,"Toquaht*","No","No","Yes","Regional District of Alberni-Clayoquot","Vancouver Island and Coast",{"$nulls":8},"","","",null,0,0,null,null,{"$f":"IF(AB632=\"Y\",COUNT(#REF!), \"\")","v":0},null,"Toquaht","Y",{"v":48.995918,"d":"48.99592"},{"v":-125.379408,"d":"-125.37941"},"http://www.google.com/maps/place/48.995918,-125.379408",8602,"Rural First Nations Primary Reserve",19,11,"No","Yes","No","No ","Toquaht*","FALSE","FALSE"]
[null,8603,"Bamfield","Yes","Yes","Yes","Regional District of Alberni-Clayoquot","Vancouver Island and Coast",{"$nulls":8},"","","",null,0,0,null,null,{"$f":"IF(AB633=\"Y\",COUNT(#REF!), \"\")","v":""},null,"Bamfield","N",{"v":48.831223,"d":"48.83122"},{"v":-125.132582,"d":"-125.13258"},"http://www.google.com/maps/place/48.831223,-125.132582",8603,"Rural",177,218,"No","Yes","No","No ","Bamfield","FALSE","FALSE"]
[null,8606,"Caycuse","No","No","No","Cowichan Valley Regional District","Vancouver Island and Coast",{"$nulls":8},"","","",null,0,0,null,null,{"$f":"IF(AB634=\"Y\",COUNT(#REF!), \"\")","v":""},null,"Caycuse","N",{"v":48.894327,"d":"48.89433"},{"v":-124.366159,"d":"-124.36616"},"http://www.google.com/maps/place/48.894327,-124.366159",8606,"Rural",24,34,"No","Yes","No","No ","Caycuse","FALSE","FALSE"]
[null,8608,"Port Renfrew","No","No","No","Capital Regional District","Vancouver Island and Coast",{"$nulls":8},"","","",null,0,0,null,null,{"$f":"IF(AB635=\"Y\",COUNT(#REF!), \"\")","v":""},null,"Port Renfrew","N",{"v":48.557441,"d":"48.55744"},{"v":-124.404856,"d":"-124.40486"},"http://www.google.com/maps/place/48.557441,-124.404856",8608,"Rural",165,109,"No","Yes","Yes","No ","Port Renfrew","FALSE","FALSE"]
[null,8610,"Youbou","Yes","Yes","Yes","Cowichan Valley Regional District","Vancouver Island and Coast",{"$nulls":8},"","","",null,0,0,null,null,{"$f":"IF(AB636=\"Y\",COUNT(#REF!), \"\")","v":""},null,"Youbou","N",{"v":48.872622,"d":"48.87262"},{"v":-124.199317,"d":"-124.19932"},"http://www.google.com/maps/place/48.872622,-124.199317",8610,"Rural",632,410,"Yes","No","Yes","No ","Youbou","FALSE","FALSE"]
[null,8611,"Honeymoon Bay","Yes","Yes","Yes","Cowichan Valley Regional District","Vancouver Island and Coast",{"$nulls":8},"","","",null,0,0,null,null,{"$f":"IF(AB637=\"Y\",COUNT(#REF!), \"\")","v":""},null,"Honeymoon Bay","N",{"v":48.815008,"d":"48.81501"},{"v":-124.173055,"d":"-124.17306"},"http://www.google.com/maps/place/48.815008,-124.173055",8611,"Rural",442,289,"Yes","No","Yes","No ","Honeymoon Bay","FALSE","FALSE"]
[null,8612,"Mesachie Lake","Yes","Yes","Yes","Cowichan Valley Regional District","Vancouver Island and Coast",{"$nulls":8},"","","",null,0,0,null,null,{"$f":"IF(AB638=\"Y\",COUNT(#REF!), \"\")","v":""},null,"Mesachie Lake","N",{"v":48.812435,"d":"48.81244"},{"v":-124.124745,"d":"-124.12475"},"http://www.google.com/maps/place/48.812435,-124.124745",8612,"Rural",159,89,"Yes","No","No","No ","Mesachie Lake","FALSE","FALSE"]
[null,8613,"Lake Cowichan","Yes","Yes","Yes","Cowichan Valley Regional District","Vancouver Island and Coast",{"$nulls":8},"","","",null,0,0,null,null,{"$f":"IF(AB639=\"Y\",COUNT(#REF!), \"\")","v":""},null,"Lake Cowichan","N",{"v":48.826067,"d":"48.82607"},{"v":-124.051504,"d":"-124.05150"},"http://www.google.com/maps/place/48.826067,-124.051504",8613,"Rural",2864,1388,"Yes","No","Yes","No ","Lake Cowichan","FALSE","FALSE"]
[null,8614,"Cowichan*","Yes","Yes","Yes","Cowichan Valley Regional District","Vancouver Island and Coast",{"$nulls":8},"","","",null,0,0,null,null,{"$f":"IF(AB640=\"Y\",COUNT(#REF!), \"\")","v":0},null,"Cowichan","Y",48.75955,{"v":-123.828869,"d":"-123.82887"},"http://www.google.com/maps/place/48.75955,-123.828869",8614,"Rural First Nations Secondary Reserve",760,315,"Yes","No","No","No ","Cowichan*","FALSE","FALSE"]
[null,8615,"Crofton","Yes","Yes","Yes","Cowichan Valley Regional District","Vancouver Island and Coast",{"$nulls":8},"","","",null,0,0,null,null,{"$f":"IF(AB641=\"Y\",COUNT(#REF!), \"\")","v":""},null,"Crofton","N",{"v":48.863168,"d":"48.86317"},{"v":-123.643433,"d":"-123.64343"},"http://www.google.com/maps/place/48.863168,-123.643433",8615,"Rural",2889,1245,"Yes","No","Yes","No ","Crofton","FALSE","FALSE"]
[null,8616,"Westholme","Yes","Yes","Yes","Cowichan Valley Regional District","Vancouver Island and Coast",{"$nulls":8},"","","",null,0,0,null,null,{"$f":"IF(AB642=\"Y\",COUNT(#REF!), \"\")","v":""},null,"Westholme","N",{"v":48.866701,"d":"48.86670"},{"v":-123.7,"d":"-123.70000"},"http://www.google.com/maps/place/48.866701,-123.7",8616,"Rural",712,273,"Yes","No","Yes","No ","Westholme","FALSE","FALSE"]
[null,8618,"Chemainus*","Yes","Yes","Yes","Cowichan Valley Regional District","Vancouver Island and Coast",{"$nulls":8},"","","",null,0,0,null,null,{"$f":"IF(AB643=\"Y\",COUNT(#REF!), \"\")","v":0},null,"Chemainus","Y",{"v":48.901357,"d":"48.90136"},{"v":-123.696519,"d":"-123.69652"},"http://www.google.com/maps/place/48.901357,-123.696519",8618,"Rural First Nations Secondary Reserve",4359,2260,"Yes","No","No","No ","Chemainus*","FALSE","FALSE"]
[null,8619,"River Jordan","No","No","No","Capital Regional District","Vancouver Island and Coast",{"$nulls":8},"","","",null,0,0,null,null,{"$f":"IF(AB644=\"Y\",COUNT(#REF!), \"\")","v":""},null,"River Jordan","N",48.42207,{"v":-124.050469,"d":"-124.05047"},"http://www.google.com/maps/place/48.42207,-124.050469",8619,"Rural",58,37,"No","Yes","Yes","No ","River Jordan","FALSE","FALSE"]
[null,8620,"Chamiss Bay","No","No","No","Strathcona Regional District","Vancouver Island and Coast",{"$nulls":8},"","","",null,0,0,null,null,{"$f":"IF(AB645=\"Y\",COUNT(#REF!), \"\")","v":""},null,"Chamiss Bay","N",{"v":50.0694,"d":"50.06940"},{"v":-127.2875,"d":"-127.28750"},"http://www.google.com/maps/place/50.0694,-127.2875",8620,"Rural",4,13,"No","Yes","No","No ","Chamiss Bay","FALSE","FALSE"]
[null,8621,"Fair Harbour","No","No","No","Strathcona Regional District","Vancouver Island and Coast",{"$nulls":8},"","","",null,0,0,null,null,{"$f":"IF(AB646=\"Y\",COUNT(#REF!), \"\")","v":""},null,"Fair Harbour","N",{"v":50.056472,"d":"50.05647"},{"v":-127.100679,"d":"-127.10068"},"http://www.google.com/maps/place/50.056472,-127.100679",8621,"Rural",4,13,"No","Yes","No","No ","Fair Harbour","FALSE","FALSE"]
[null,8622,"Kimsquit","No","No","No","Central Coast Regional District","Vancouver Island and Coast",{"$nulls":8},"","","",null,0,0,null,null,{"$f":"IF(AB647=\"Y\",COUNT(#REF!), \"\")","v":""},null,"Kimsquit","N",{"v":52.829634,"d":"52.82963"},-126.96434,"http://www.google.com/maps/place/52.829634,-126.96434",8622,"Rural",3,2,"No","Yes","Yes","No ","Kimsquit","FALSE","FALSE"]
[null,8624,"Namu","No","No","No","Central Coast Regional District","Vancouver Island and Coast",{"$nulls":8},"","","",null,0,0,null,null,{"$f":"IF(AB648=\"Y\",COUNT(#REF!), \"\")","v":""},null,"Namu","N",{"v":51.861341,"d":"51.86134"},{"v":-127.860426,"d":"-127.86043"},"http://www.google.com/maps/place/51.861341,-127.860426",8624,"Rural",1,1,"No","Yes","No","No ","Namu","FALSE","FALSE"]
[null,8625,"South Bentinck","No","No","No","Central Coast Regional District","Vancouver Island and Coast",{"$nulls":8},"","","",null,0,0,null,null,{"$f":"IF(AB649=\"Y\",COUNT(#REF!), \"\")","v":""},null,"South Bentinck","N",{"v":52.044399,"d":"52.04440"},{"v":-126.6667,"d":"-126.66670"},"http://www.google.com/maps/place/52.044399,-126.6667",8625,"Rural",3,2,"No","Yes","Yes","No ","South Bentinck","FALSE","FALSE"]
[null,8626,"Gold River","No","No","No","Strathcona Regional District","Vancouver Island and Coast",{"$nulls":8},"","","",null,0,0,null,null,{"$f":"IF(AB650=\"Y\",COUNT(#REF!), \"\")","v":""},null,"Gold River","N",{"v":49.780695,"d":"49.78070"},{"v":-126.051864,"d":"-126.05186"},"http://www.google.com/maps/place/49.780695,-126.051864",8626,"Rural",1212,789,"No","Yes","Yes","No ","Gold River","FALSE","FALSE"]
[null,8628,"Ehatisaht","No","No","No","Strathcona Regional District","Vancouver Island and Coast",{"$nulls":8},"","","",null,0,0,null,null,{"$f":"IF(AB651=\"Y\",COUNT(#REF!), \"\")","v":""},null,"Ehatisaht","N",{"v":49.8833,"d":"49.88330"},{"v":-126.849999,"d":"-126.85000"},"http://www.google.com/maps/place/49.8833,-126.849999",8628,"Rural",4,13,"No","Yes","No","No ","Ehatisaht","FALSE","FALSE"]
[null,8629,"Mooyah Bay","No","No","No","Strathcona Regional District","Vancouver Island and Coast",{"$nulls":8},"","","",null,0,0,null,null,{"$f":"IF(AB652=\"Y\",COUNT(#REF!), \"\")","v":""},null,"Mooyah Bay","N",{"v":49.629531,"d":"49.62953"},{"v":-126.458386,"d":"-126.45839"},"http://www.google.com/maps/place/49.629531,-126.458386",8629,"Rural",null,null,"No","No","No","No ","Mooyah Bay","FALSE","FALSE"]
[null,8630,"Franklin Camp","No","No","No","Regional District of Alberni-Clayoquot","Vancouver Island and Coast",{"$nulls":8},"","","",null,0,0,null,null,{"$f":"IF(AB653=\"Y\",COUNT(#REF!), \"\")","v":""},null,"Franklin Camp","N",{"v":48.972199,"d":"48.97220"},{"v":-124.7417,"d":"-124.74170"},"http://www.google.com/maps/place/48.972199,-124.7417",8630,"Rural",2,5,"No","Yes","No","No ","Franklin Camp","FALSE","FALSE"]
[null,8631,"Huu-ay-aht*","No","No","Yes","Regional District of Alberni-Clayoquot","Vancouver Island and Coast",{"$nulls":8},"","","",null,0,0,null,null,{"$f":"IF(AB654=\"Y\",COUNT(#REF!), \"\")","v":0},null,"Huu-ay-aht","Y",{"v":48.9,"d":"48.90000"},{"v":-125.000001,"d":"-125.00000"},"http://www.google.com/maps/place/48.9,-125.000001",8631,"Rural First Nations Secondary Reserve",5,3,"No","Yes","No","No ","Huu-ay-aht*","FALSE","FALSE"]
[null,8632,"Sarita","No","No","No","Regional District of Alberni-Clayoquot","Vancouver Island and Coast",{"$nulls":8},"","","",null,0,0,null,null,{"$f":"IF(AB655=\"Y\",COUNT(#REF!), \"\")","v":""},null,"Sarita","N",{"v":48.8833,"d":"48.88330"},{"v":-125.0333,"d":"-125.03330"},"http://www.google.com/maps/place/48.8833,-125.0333",8632,"Rural",4,10,"No","Yes","Yes","No ","Sarita","FALSE","FALSE"]
[null,8633,"Whyac*","No","No","No","Cowichan Valley Regional District","Vancouver Island and Coast",{"$nulls":8},"","","",null,0,0,null,null,{"$f":"IF(AB656=\"Y\",COUNT(#REF!), \"\")","v":0},null,"Whyac","Y",{"v":48.669091,"d":"48.66909"},{"v":-124.846433,"d":"-124.84643"},"http://www.google.com/maps/place/48.669091,-124.846433",8633,"Rural First Nations Secondary Reserve",null,null,"No","No","Yes","No ","Whyac*","FALSE","FALSE"]
[null,8634,"Clo-oose*","No","No","No","Cowichan Valley Regional District","Vancouver Island and Coast",{"$nulls":8},"","","",null,0,0,null,null,{"$f":"IF(AB657=\"Y\",COUNT(#REF!), \"\")","v":0},null,"Clo-oose","Y",{"v":48.662949,"d":"48.66295"},{"v":-124.821563,"d":"-124.82156"},"http://www.google.com/maps/place/48.662949,-124.821563",8634,"Rural First Nations Secondary Reserve",null,null,"No","No","No","No ","Clo-oose*","FALSE","FALSE"]
[null,8635,"Shirley","Yes","Yes","No","Capital Regional District","Vancouver Island and Coast",{"$nulls":8},"","","",null,0,0,null,null,{"$f":"IF(AB658=\"Y\",COUNT(#REF!), \"\")","v":""},null,"Shirley","N",{"v":48.389793,"d":"48.38979"},{"v":-123.904422,"d":"-123.90442"},"http://www.google.com/maps/place/48.389793,-123.904422",8635,"Rural",153,87,"Yes","No","Yes","No ","Shirley","FALSE","FALSE"]
[null,8636,"Sooke","Yes","Yes","Yes","Capital Regional District","Vancouver Island and Coast",{"$nulls":8},"","","",null,0,0,null,null,{"$f":"IF(AB659=\"Y\",COUNT(#REF!), \"\")","v":""},null,"Sooke","N",{"v":48.382279,"d":"48.38228"},{"v":-123.727914,"d":"-123.72791"},"http://www.google.com/maps/place/48.382279,-123.727914",8636,"Rural",6136,2793,"Yes","No","Yes","No ","Sooke","FALSE","FALSE"]
[null,8637,"T'Sou-ke*","Yes","Yes","Yes","Capital Regional District","Vancouver Island and Coast",{"$nulls":8},"","","",null,0,0,null,null,{"$f":"IF(AB660=\"Y\",COUNT(#REF!), \"\")","v":0},null,"T'Sou-ke","Y",{"v":48.363364,"d":"48.36336"},-123.74757,"http://www.google.com/maps/place/48.363364,-123.74757",8637,"Rural First Nations Secondary Reserve",6136,2793,"Yes","No","No","No ","T'Sou-ke*","FALSE","FALSE"]
[null,8639,"East Sooke","Yes","Yes","Yes","Capital Regional District","Vancouver Island and Coast",{"$nulls":8},"","","",null,0,0,null,null,{"$f":"IF(AB661=\"Y\",COUNT(#REF!), \"\")","v":""},null,"East Sooke","N",{"v":48.364541,"d":"48.36454"},{"v":-123.686484,"d":"-123.68648"},"http://www.google.com/maps/place/48.364541,-123.686484",8639,"Rural",6136,2793,"Yes","No","No","No ","East Sooke","FALSE","FALSE"]
[null,8641,"Metchosin","Yes","Yes","Yes","Capital Regional District","Vancouver Island and Coast",{"$nulls":8},"","","",null,0,0,null,null,{"$f":"IF(AB662=\"Y\",COUNT(#REF!), \"\")","v":""},null,"Metchosin","N",{"v":48.375649,"d":"48.37565"},{"v":-123.529048,"d":"-123.52905"},"http://www.google.com/maps/place/48.375649,-123.529048",8641,"Urban",3484,1427,"Yes","No","No","No ","Metchosin","FALSE","FALSE"]
[null,8642,"Albert Head","Yes","Yes","Yes","Capital Regional District","Vancouver Island and Coast",{"$nulls":8},"","","",null,0,0,null,null,{"$f":"IF(AB663=\"Y\",COUNT(#REF!), \"\")","v":""},null,"Albert Head","N",48.39109,{"v":-123.503312,"d":"-123.50331"},"http://www.google.com/maps/place/48.39109,-123.503312",8642,"Urban",3484,1427,"Yes","No","No","No ","Albert Head","FALSE","FALSE"]
[null,8643,"Colwood","Yes","Yes","Yes","Capital Regional District","Vancouver Island and Coast",{"$nulls":8},"","","",null,0,0,null,null,{"$f":"IF(AB664=\"Y\",COUNT(#REF!), \"\")","v":""},null,"Colwood","N",{"v":48.432077,"d":"48.43208"},{"v":-123.496518,"d":"-123.49652"},"http://www.google.com/maps/place/48.432077,-123.496518",8643,"Urban",20173,8475,"Yes","No","No","No ","Colwood","FALSE","FALSE"]
[null,8644,"Langford","Yes","Yes","Yes","Capital Regional District","Vancouver Island and Coast",{"$nulls":8},"","","",null,0,0,null,null,{"$f":"IF(AB665=\"Y\",COUNT(#REF!), \"\")","v":""},null,"Langford","N",{"v":48.456603,"d":"48.45660"},{"v":-123.497419,"d":"-123.49742"},"http://www.google.com/maps/place/48.456603,-123.497419",8644,"Urban",25303,10309,"Yes","No","Yes","No ","Langford","FALSE","FALSE"]
[null,8645,"Oak Bay","Yes","Yes","Yes","Capital Regional District","Vancouver Island and Coast",{"$nulls":8},"","","",null,0,0,null,null,{"$f":"IF(AB666=\"Y\",COUNT(#REF!), \"\")","v":""},null,"Oak Bay","N",{"v":48.430129,"d":"48.43013"},{"v":-123.308908,"d":"-123.30891"},"http://www.google.com/maps/place/48.430129,-123.308908",8645,"Urban",20055,9167,"Yes","No","Yes","No ","Oak Bay","FALSE","FALSE"]
[null,8646,"Saanich","Yes","Yes","Yes","Capital Regional District","Vancouver Island and Coast",{"$nulls":8},"","","",null,0,0,null,null,{"$f":"IF(AB667=\"Y\",COUNT(#REF!), \"\")","v":""},null,"Saanich","N",{"v":48.487848,"d":"48.48785"},{"v":-123.387968,"d":"-123.38797"},"http://www.google.com/maps/place/48.487848,-123.387968",8646,"Urban",26203,10352,"Yes","No","Yes","No ","Saanich","FALSE","FALSE"]
[null,8647,"Victoria","Yes","Yes","Yes","Capital Regional District","Vancouver Island and Coast",{"$nulls":8},"","","",null,0,0,null,null,{"$f":"IF(AB668=\"Y\",COUNT(#REF!), \"\")","v":""},null,"Victoria","N",{"v":48.433439,"d":"48.43344"},{"v":-123.361707,"d":"-123.36171"},"http://www.google.com/maps/place/48.433439,-123.361707",8647,"Urban",56294,33846,"Yes","No","No","No ","Victoria","FALSE","FALSE"]
[null,8648,"View Royal","Yes","Yes","Yes","Capital Regional District","Vancouver Island and Coast",{"$nulls":8},"","","",null,0,0,null,null,{"$f":"IF(AB669=\"Y\",COUNT(#REF!), \"\")","v":""},null,"View Royal","N",{"v":48.458299,"d":"48.45830"},{"v":-123.45,"d":"-123.45000"},"http://www.google.com/maps/place/48.458299,-123.45",8648,"Urban",25303,10309,"Yes","No","Yes","No ","View Royal","FALSE","FALSE"]
[null,8650,"Esquimalt","Yes","Yes","Yes","Capital Regional District","Vancouver Island and Coast",{"$nulls":8},"","","",null,0,0,null,null,{"$f":"IF(AB670=\"Y\",COUNT(#REF!), \"\")","v":""},null,"Esquimalt","N",{"v":48.428928,"d":"48.42893"},{"v":-123.407989,"d":"-123.40799"},"http://www.google.com/maps/place/48.428928,-123.407989",8650,"Urban",42282,21677,"Yes","No","No","No ","Esquimalt","FALSE","FALSE"]
[null,8651,"Highlands","Yes","Yes","Yes","Capital Regional District","Vancouver Island and Coast",{"$nulls":8},"","","",null,0,0,null,null,{"$f":"IF(AB671=\"Y\",COUNT(#REF!), \"\")","v":""},null,"Highlands","N",{"v":48.514355,"d":"48.51436"},{"v":-123.516292,"d":"-123.51629"},"http://www.google.com/maps/place/48.514355,-123.516292",8651,"Rural",645,253,"Yes","No","No","No ","Highlands","FALSE","FALSE"]
[null,8653,"Brentwood Bay","Yes","Yes","Yes","Capital Regional District","Vancouver Island and Coast",{"$nulls":8},"","","",null,0,0,null,null,{"$f":"IF(AB672=\"Y\",COUNT(#REF!), \"\")","v":""},null,"Brentwood Bay","N",{"v":48.568282,"d":"48.56828"},{"v":-123.456224,"d":"-123.45622"},"http://www.google.com/maps/place/48.568282,-123.456224",8653,"Urban",7409,3123,"Yes","No","No","No ","Brentwood Bay","FALSE","FALSE"]
[null,8655,"Central Saanich","Yes","Yes","Yes","Capital Regional District","Vancouver Island and Coast",{"$nulls":8},"","","",null,0,0,null,null,{"$f":"IF(AB673=\"Y\",COUNT(#REF!), \"\")","v":""},null,"Central Saanich","N",{"v":48.566904,"d":"48.56690"},{"v":-123.397055,"d":"-123.39706"},"http://www.google.com/maps/place/48.566904,-123.397055",8655,"Rural",9159,3979,"Yes","No","No","No ","Central Saanich","FALSE","FALSE"]
[null,8656,{"$f":"HYPERLINK(AE674,AN674)","v":"Sidney"},"Yes","Yes","Yes","Capital Regional District","Vancouver Island and Coast",{"$nulls":8},{"$f":"IF(L674=\"\",\"\",\nIF(SUM((J674*L674)/M674)<=N674,\"Sufficient Capacity\",\nIF(SUM((J674*L674)/M674)>N674,\"Not Enough Capacity\",\"Error\")))","v":""},{"$f":"IF(OR(ISBLANK(J674),ISBLANK(L674),ISBLANK(M674)), \"\",(J674*L674/M674))","v":""},{"$f":"IF(AND(COUNT(N674,R674)=2, OR($O$10=\"Last-Mile\", $O$10=\"Transport & Last-Mile\")), N674-R674, \"\")","v":""},null,{"$f":"IF(AND(AB674=\"Y\",I674<>\"\"),1,0)","v":0},{"$f":"IF(AND(AB674=\"Y\",I674=\"Last-Mile & Transport\"),1,0)","v":0},null,null,{"$f":"IF(AB674=\"Y\",COUNT(#REF!), \"\")","v":""},null,"Sidney","N",{"v":48.65,"d":"48.65000"},{"v":-123.399999,"d":"-123.40000"},"http://www.google.com/maps/place/48.65,-123.399999",8656,"Urban",14313,6822,"Yes","No","Yes","No ",{"$f":"IF(AB674=\"Y\", CONCATENATE(AA674,\"*\"), AA674)","v":"Sidney"},{"$f":"IF(I674=\"Last-Mile\",\"TRUE\",IF(I674=\"Transport & Last-Mile\",\"TRUE\",\"FALSE\"))","v":"FALSE"},{"$f":"IF(I674=\"Transport\",\"TRUE\",IF(I674=\"Transport & Last-Mile\",\"TRUE\",\"FALSE\"))","v":"FALSE"}]
[null,8657,"Saanichton","Yes","Yes","Yes","Capital Regional District","Vancouver Island and Coast",{"$nulls":8},"","","",null,0,0,null,null,{"$f":"IF(AB675=\"Y\",COUNT(#REF!), \"\")","v":""},null,"Saanichton","N",{"v":48.6,"d":"48.60000"},{"v":-123.416699,"d":"-123.41670"},"http://www.google.com/maps/place/48.6,-123.416699",8657,"Urban",9159,3979,"Yes","No","Yes","No ","Saanichton","FALSE","FALSE"]
[null,8658,"Ardmore","Yes","Yes","Yes","Capital Regional District","Vancouver Island and Coast",{"$nulls":8},"","","",null,0,0,null,null,{"$f":"IF(AB676=\"Y\",COUNT(#REF!), \"\")","v":""},null,"Ardmore","N",{"v":48.6389,"d":"48.63890"},{"v":-123.466701,"d":"-123.46670"},"http://www.google.com/maps/place/48.6389,-123.466701",8658,"Urban",2946,1364,"Yes","No","No","No ","Ardmore","FALSE","FALSE"]
[null,8659,"Deep Cove","Yes","Yes","Yes","Capital Regional District","Vancouver Island and Coast",{"$nulls":8},"","","",null,0,0,null,null,{"$f":"IF(AB677=\"Y\",COUNT(#REF!), \"\")","v":""},null,"Deep Cove","N",{"v":48.679567,"d":"48.67957"},{"v":-123.472518,"d":"-123.47252"},"http://www.google.com/maps/place/48.679567,-123.472518",8659,"Rural",2946,1364,"Yes","No","No","No ","Deep Cove","FALSE","FALSE"]
[null,8662,"North Saanich","Yes","Yes","Yes","Capital Regional District","Vancouver Island and Coast",{"$nulls":8},"","","",null,0,0,null,null,{"$f":"IF(AB678=\"Y\",COUNT(#REF!), \"\")","v":""},null,"North Saanich","N",{"v":48.621723,"d":"48.62172"},{"v":-123.421463,"d":"-123.42146"},"http://www.google.com/maps/place/48.621723,-123.421463",8662,"Urban",14313,6822,"Yes","No","Yes","No ","North Saanich","FALSE","FALSE"]
[null,8663,"Swartz Bay","Yes","Yes","Yes","Capital Regional District","Vancouver Island and Coast",{"$nulls":8},"","","",null,0,0,null,null,{"$f":"IF(AB679=\"Y\",COUNT(#REF!), \"\")","v":""},null,"Swartz Bay","N",{"v":48.682666,"d":"48.68267"},-123.41313,"http://www.google.com/maps/place/48.682666,-123.41313",8663,"Urban",4178,2111,"Yes","No","Yes","No ","Swartz Bay","FALSE","FALSE"]
[null,8664,"Cherry Point","Yes","Yes","Yes","Cowichan Valley Regional District","Vancouver Island and Coast",{"$nulls":8},"","","",null,0,0,null,null,{"$f":"IF(AB680=\"Y\",COUNT(#REF!), \"\")","v":""},null,"Cherry Point","N",{"v":48.727722,"d":"48.72772"},{"v":-123.583611,"d":"-123.58361"},"http://www.google.com/maps/place/48.727722,-123.583611",8664,"Rural",4012,1694,"Yes","No","No","No ","Cherry Point","FALSE","FALSE"]
[null,8665,"Cobble Hill","Yes","Yes","Yes","Cowichan Valley Regional District","Vancouver Island and Coast",{"$nulls":8},"","","",null,0,0,null,null,{"$f":"IF(AB681=\"Y\",COUNT(#REF!), \"\")","v":""},null,"Cobble Hill","N",{"v":48.691498,"d":"48.69150"},{"v":-123.584571,"d":"-123.58457"},"http://www.google.com/maps/place/48.691498,-123.584571",8665,"Rural",4012,1694,"Yes","No","No","No ","Cobble Hill","FALSE","FALSE"]
[null,8666,"Arbutus Ridge","Yes","Yes","Yes","Cowichan Valley Regional District","Vancouver Island and Coast",{"$nulls":8},"","","",null,0,0,null,null,{"$f":"IF(AB682=\"Y\",COUNT(#REF!), \"\")","v":""},null,"Arbutus Ridge","N",{"v":48.693312,"d":"48.69331"},-123.54009,"http://www.google.com/maps/place/48.693312,-123.54009",8666,"Rural",2161,1091,"Yes","No","No","No ","Arbutus Ridge","FALSE","FALSE"]
[null,8667,"Shawnigan Lake","Yes","Yes","Yes","Cowichan Valley Regional District","Vancouver Island and Coast",{"$nulls":8},"","","",null,0,0,null,null,{"$f":"IF(AB683=\"Y\",COUNT(#REF!), \"\")","v":""},null,"Shawnigan Lake","N",{"v":48.653523,"d":"48.65352"},{"v":-123.621993,"d":"-123.62199"},"http://www.google.com/maps/place/48.653523,-123.621993",8667,"Rural",4827,2013,"Yes","No","Yes","No ","Shawnigan Lake","FALSE","FALSE"]
[null,8668,"Mill Bay","Yes","Yes","Yes","Cowichan Valley Regional District","Vancouver Island and Coast",{"$nulls":8},"","","",null,0,0,null,null,{"$f":"IF(AB684=\"Y\",COUNT(#REF!), \"\")","v":""},null,"Mill Bay","N",{"v":48.644906,"d":"48.64491"},{"v":-123.556162,"d":"-123.55616"},"http://www.google.com/maps/place/48.644906,-123.556162",8668,"Rural",2278,895,"Yes","No","No","No ","Mill Bay","FALSE","FALSE"]
[null,8670,"Malahat","Yes","Yes","Yes","Cowichan Valley Regional District","Vancouver Island and Coast",{"$nulls":8},"","","",null,0,0,null,null,{"$f":"IF(AB685=\"Y\",COUNT(#REF!), \"\")","v":""},null,"Malahat","N",{"v":48.548055,"d":"48.54806"},{"v":-123.565278,"d":"-123.56528"},"http://www.google.com/maps/place/48.548055,-123.565278",8670,"Rural",870,359,"Yes","No","Yes","No ","Malahat","FALSE","FALSE"]
[null,8671,"Saseenos","Yes","Yes","Yes","Capital Regional District","Vancouver Island and Coast",{"$nulls":8},"","","",null,0,0,null,null,{"$f":"IF(AB686=\"Y\",COUNT(#REF!), \"\")","v":""},null,"Saseenos","N",{"v":48.390762,"d":"48.39076"},{"v":-123.668557,"d":"-123.66856"},"http://www.google.com/maps/place/48.390762,-123.668557",8671,"Rural",2050,1004,"Yes","No","Yes","No ","Saseenos","FALSE","FALSE"]
[null,8672,"Cowichan Bay","Yes","Yes","Yes","Cowichan Valley Regional District","Vancouver Island and Coast",{"$nulls":8},"","","",null,0,0,null,null,{"$f":"IF(AB687=\"Y\",COUNT(#REF!), \"\")","v":""},null,"Cowichan Bay","N",{"v":48.737086,"d":"48.73709"},{"v":-123.619919,"d":"-123.61992"},"http://www.google.com/maps/place/48.737086,-123.619919",8672,"Rural",2545,1108,"Yes","No","Yes","No ","Cowichan Bay","FALSE","FALSE"]
[null,8673,"Cowichan Station","Yes","Yes","Yes","Cowichan Valley Regional District","Vancouver Island and Coast",{"$nulls":8},"","","",null,0,0,null,null,{"$f":"IF(AB688=\"Y\",COUNT(#REF!), \"\")","v":""},null,"Cowichan Station","N",{"v":48.729414,"d":"48.72941"},{"v":-123.665676,"d":"-123.66568"},"http://www.google.com/maps/place/48.729414,-123.665676",8673,"Rural",2545,1108,"Yes","No","Yes","No ","Cowichan Station","FALSE","FALSE"]
[null,8674,"Musgrave Landing","No","No","Yes","Capital Regional District","Vancouver Island and Coast",{"$nulls":8},"","","",null,0,0,null,null,{"$f":"IF(AB689=\"Y\",COUNT(#REF!), \"\")","v":""},null,"Musgrave Landing","N",{"v":48.751133,"d":"48.75113"},{"v":-123.546438,"d":"-123.54644"},"http://www.google.com/maps/place/48.751133,-123.546438",8674,"Rural",46,26,"No","Yes","No","No ","Musgrave Landing","FALSE","FALSE"]
[null,8675,"Deerholme","Yes","Yes","Yes","Cowichan Valley Regional District","Vancouver Island and Coast",{"$nulls":8},"","","",null,0,0,null,null,{"$f":"IF(AB690=\"Y\",COUNT(#REF!), \"\")","v":""},null,"Deerholme","N",{"v":48.7528,"d":"48.75280"},{"v":-123.758301,"d":"-123.75830"},"http://www.google.com/maps/place/48.7528,-123.758301",8675,"Rural",717,295,"Yes","No","No","No ","Deerholme","FALSE","FALSE"]
[null,8676,"Duncan","Yes","Yes","Yes","Cowichan Valley Regional District","Vancouver Island and Coast",{"$nulls":8},"","","",null,0,0,null,null,{"$f":"IF(AB691=\"Y\",COUNT(#REF!), \"\")","v":""},null,"Duncan","N",{"v":48.778934,"d":"48.77893"},{"v":-123.701502,"d":"-123.70150"},"http://www.google.com/maps/place/48.778934,-123.701502",8676,"Rural",13267,6189,"Yes","No","Yes","No ","Duncan","FALSE","FALSE"]
[null,8677,"Eagle Heights","Yes","Yes","Yes","Cowichan Valley Regional District","Vancouver Island and Coast",{"$nulls":8},"","","",null,0,0,null,null,{"$f":"IF(AB692=\"Y\",COUNT(#REF!), \"\")","v":""},null,"Eagle Heights","N",{"v":48.756265,"d":"48.75627"},{"v":-123.702584,"d":"-123.70258"},"http://www.google.com/maps/place/48.756265,-123.702584",8677,"Rural",13267,6189,"Yes","No","Yes","No ","Eagle Heights","FALSE","FALSE"]
[null,8678,"Cowichan*","Yes","Yes","Yes","Cowichan Valley Regional District","Vancouver Island and Coast",{"$nulls":8},"","","",null,0,0,null,null,{"$f":"IF(AB693=\"Y\",COUNT(#REF!), \"\")","v":0},null,"Cowichan","Y",{"v":48.768781,"d":"48.76878"},-123.67978,"http://www.google.com/maps/place/48.768781,-123.67978",8678,"Rural First Nations Primary Reserve",13267,6189,"Yes","No","Yes","No ","Cowichan*","FALSE","FALSE"]
[null,8679,"Maple Bay","Yes","Yes","Yes","Cowichan Valley Regional District","Vancouver Island and Coast",{"$nulls":8},"","","",null,0,0,null,null,{"$f":"IF(AB694=\"Y\",COUNT(#REF!), \"\")","v":""},null,"Maple Bay","N",{"v":48.815829,"d":"48.81583"},{"v":-123.612915,"d":"-123.61292"},"http://www.google.com/maps/place/48.815829,-123.612915",8679,"Rural",1598,742,"Yes","No","No","No ","Maple Bay","FALSE","FALSE"]
[null,8680,"Chemainus","Yes","Yes","Yes","Cowichan Valley Regional District","Vancouver Island and Coast",{"$nulls":8},"","","",null,0,0,null,null,{"$f":"IF(AB695=\"Y\",COUNT(#REF!), \"\")","v":""},null,"Chemainus","N",{"v":48.926565,"d":"48.92657"},{"v":-123.720588,"d":"-123.72059"},"http://www.google.com/maps/place/48.926565,-123.720588",8680,"Rural",4359,2260,"Yes","No","No","No ","Chemainus","FALSE","FALSE"]
[null,8681,"Ganges","Yes","Yes","Yes","Capital Regional District","Vancouver Island and Coast",{"$nulls":8},"","","",null,0,0,null,null,{"$f":"IF(AB696=\"Y\",COUNT(#REF!), \"\")","v":""},null,"Ganges","N",{"v":48.859899,"d":"48.85990"},-123.50654,"http://www.google.com/maps/place/48.859899,-123.50654",8681,"Rural",2107,1141,"Yes","No","No","No ","Ganges","FALSE","FALSE"]
[null,8682,"Lighthouse Point","No","No","Yes","Capital Regional District","Vancouver Island and Coast",{"$nulls":8},"","","",null,0,0,null,null,{"$f":"IF(AB697=\"Y\",COUNT(#REF!), \"\")","v":""},null,"Lighthouse Point","N",{"v":48.868675,"d":"48.86868"},{"v":-123.284056,"d":"-123.28406"},"http://www.google.com/maps/place/48.868675,-123.284056",8682,"Rural",192,311,"No","Yes","Yes","No ","Lighthouse Point","FALSE","FALSE"]
[null,8683,"Sturdies Bay","No","No","Yes","Capital Regional District","Vancouver Island and Coast",{"$nulls":8},"","","",null,0,0,null,null,{"$f":"IF(AB698=\"Y\",COUNT(#REF!), \"\")","v":""},null,"Sturdies Bay","N",{"v":48.879166,"d":"48.87917"},{"v":-123.319444,"d":"-123.31944"},"http://www.google.com/maps/place/48.879166,-123.319444",8683,"Rural",192,311,"No","Yes","No","No ","Sturdies Bay","FALSE","FALSE"]
[null,8684,"Mayne","No","No","Yes","Capital Regional District","Vancouver Island and Coast",{"$nulls":8},"","","",null,0,0,null,null,{"$f":"IF(AB699=\"Y\",COUNT(#REF!), \"\")","v":""},null,"Mayne","N",{"v":48.850108,"d":"48.85011"},{"v":-123.296975,"d":"-123.29698"},"http://www.google.com/maps/place/48.850108,-123.296975",8684,"Rural",730,854,"No","Yes","No","No ","Mayne","FALSE","FALSE"]
[null,8685,"Port Washington","No","No","Yes","Capital Regional District","Vancouver Island and Coast",{"$nulls":8},"","","",null,0,0,null,null,{"$f":"IF(AB700=\"Y\",COUNT(#REF!), \"\")","v":""},null,"Port Washington","N",{"v":48.816603,"d":"48.81660"},{"v":-123.321192,"d":"-123.32119"},"http://www.google.com/maps/place/48.816603,-123.321192",8685,"Rural",184,176,"Yes","No","Yes","No ","Port Washington","FALSE","FALSE"]
[null,8686,"Saturna","No","No","Yes","Capital Regional District","Vancouver Island and Coast",{"$nulls":8},"","","",null,0,0,null,null,{"$f":"IF(AB701=\"Y\",COUNT(#REF!), \"\")","v":""},null,"Saturna","N",{"v":48.794533,"d":"48.79453"},{"v":-123.194647,"d":"-123.19465"},"http://www.google.com/maps/place/48.794533,-123.194647",8686,"Rural",244,283,"No","Yes","Yes","No ","Saturna","FALSE","FALSE"]
[null,8687,"Fulford Harbour","Yes","Yes","Yes","Capital Regional District","Vancouver Island and Coast",{"$nulls":8},"","","",null,0,0,null,null,{"$f":"IF(AB702=\"Y\",COUNT(#REF!), \"\")","v":""},null,"Fulford Harbour","N",{"v":48.770644,"d":"48.77064"},{"v":-123.450253,"d":"-123.45025"},"http://www.google.com/maps/place/48.770644,-123.450253",8687,"Rural",695,398,"Yes","No","No","No ","Fulford Harbour","FALSE","FALSE"]
[null,8688,"Fernwood","Yes","Yes","Yes","Capital Regional District","Vancouver Island and Coast",{"$nulls":8},"","","",null,0,0,null,null,{"$f":"IF(AB703=\"Y\",COUNT(#REF!), \"\")","v":""},null,"Fernwood","N",{"v":48.908949,"d":"48.90895"},{"v":-123.528074,"d":"-123.52807"},"http://www.google.com/maps/place/48.908949,-123.528074",8688,"Rural",2733,1408,"Yes","No","No","No ","Fernwood","FALSE","FALSE"]
[null,8691,"Ladysmith","Yes","Yes","Yes","Cowichan Valley Regional District","Vancouver Island and Coast",{"$nulls":8},"","","",null,0,0,null,null,{"$f":"IF(AB704=\"Y\",COUNT(#REF!), \"\")","v":""},null,"Ladysmith","N",{"v":48.992646,"d":"48.99265"},{"v":-123.820178,"d":"-123.82018"},"http://www.google.com/maps/place/48.992646,-123.820178",8691,"Rural",6283,2785,"Yes","No","No","No ","Ladysmith","FALSE","FALSE"]
[null,8692,"Saltair","Yes","Yes","Yes","Cowichan Valley Regional District","Vancouver Island and Coast",{"$nulls":8},"","","",null,0,0,null,null,{"$f":"IF(AB705=\"Y\",COUNT(#REF!), \"\")","v":""},null,"Saltair","N",{"v":48.957099,"d":"48.95710"},{"v":-123.773655,"d":"-123.77366"},"http://www.google.com/maps/place/48.957099,-123.773655",8692,"Rural",2796,1300,"Yes","No","Yes","No ","Saltair","FALSE","FALSE"]
[null,8693,"Diamond","Yes","Yes","Yes","Cowichan Valley Regional District","Vancouver Island and Coast",{"$nulls":8},"","","",null,0,0,null,null,{"$f":"IF(AB706=\"Y\",COUNT(#REF!), \"\")","v":""},null,"Diamond","N",49.00603,{"v":-123.845622,"d":"-123.84562"},"http://www.google.com/maps/place/49.00603,-123.845622",8693,"Rural",2534,1080,"Yes","No","Yes","No ","Diamond","FALSE","FALSE"]
[null,8694,"Chemainus*","Yes","Yes","Yes","Cowichan Valley Regional District","Vancouver Island and Coast",{"$nulls":8},"","","",null,0,0,null,null,{"$f":"IF(AB707=\"Y\",COUNT(#REF!), \"\")","v":0},null,"Chemainus","Y",{"v":49.016099,"d":"49.01610"},-123.85959,"http://www.google.com/maps/place/49.016099,-123.85959",8694,"Rural First Nations Secondary Reserve",2534,1080,"Yes","No","Yes","No ","Chemainus*","FALSE","FALSE"]
[null,8695,"South Wellington","Yes","Yes","Yes","Regional District of Nanaimo","Vancouver Island and Coast",{"$nulls":8},"","","",null,0,0,null,null,{"$f":"IF(AB708=\"Y\",COUNT(#REF!), \"\")","v":""},null,"South Wellington","N",{"v":49.0941,"d":"49.09410"},{"v":-123.886796,"d":"-123.88680"},"http://www.google.com/maps/place/49.0941,-123.886796",8695,"Rural",2773,1146,"Yes","No","No","No ","South Wellington","FALSE","FALSE"]
[null,8696,"Cassidy","Yes","Yes","Yes","Regional District of Nanaimo","Vancouver Island and Coast",{"$nulls":8},"","","",null,0,0,null,null,{"$f":"IF(AB709=\"Y\",COUNT(#REF!), \"\")","v":""},null,"Cassidy","N",{"v":49.049999,"d":"49.05000"},{"v":-123.8833,"d":"-123.88330"},"http://www.google.com/maps/place/49.049999,-123.8833",8696,"Rural",1398,663,"Yes","No","No","No ","Cassidy","FALSE","FALSE"]
[null,8697,"Cedar","Yes","Yes","Yes","Regional District of Nanaimo","Vancouver Island and Coast",{"$nulls":8},"","","",null,0,0,null,null,{"$f":"IF(AB710=\"Y\",COUNT(#REF!), \"\")","v":""},null,"Cedar","N",{"v":49.104326,"d":"49.10433"},{"v":-123.854455,"d":"-123.85446"},"http://www.google.com/maps/place/49.104326,-123.854455",8697,"Urban",2870,1213,"Yes","No","No","No ","Cedar","FALSE","FALSE"]
[null,8698,"Snuneymuxw*","Yes","Yes","Yes","Regional District of Nanaimo","Vancouver Island and Coast",{"$nulls":8},"","","",null,0,0,null,null,{"$f":"IF(AB711=\"Y\",COUNT(#REF!), \"\")","v":0},null,"Snuneymuxw","Y",{"v":49.122957,"d":"49.12296"},{"v":-123.869598,"d":"-123.86960"},"http://www.google.com/maps/place/49.122957,-123.869598",8698,"Rural First Nations Secondary Reserve",2870,1213,"Yes","No","Yes","No ","Snuneymuxw*","FALSE","FALSE"]
[null,8699,"Extension","Yes","Yes","Yes","Regional District of Nanaimo","Vancouver Island and Coast",{"$nulls":8},"","","",null,0,0,null,null,{"$f":"IF(AB712=\"Y\",COUNT(#REF!), \"\")","v":""},null,"Extension","N",{"v":49.100488,"d":"49.10049"},{"v":-123.958191,"d":"-123.95819"},"http://www.google.com/maps/place/49.100488,-123.958191",8699,"Rural",8627,3489,"Yes","No","Yes","No ","Extension","FALSE","FALSE"]
[null,8700,"Cinnabar Valley","Yes","Yes","Yes","Regional District of Nanaimo","Vancouver Island and Coast",{"$nulls":8},"","","",null,0,0,null,null,{"$f":"IF(AB713=\"Y\",COUNT(#REF!), \"\")","v":""},null,"Cinnabar Valley","N",{"v":49.103295,"d":"49.10330"},{"v":-123.926406,"d":"-123.92641"},"http://www.google.com/maps/place/49.103295,-123.926406",8700,"Urban",2773,1146,"Yes","No","No","No ","Cinnabar Valley","FALSE","FALSE"]
[null,8702,"Nanaimo","Yes","Yes","Yes","Regional District of Nanaimo","Vancouver Island and Coast",{"$nulls":8},"","","",null,0,0,null,null,{"$f":"IF(AB714=\"Y\",COUNT(#REF!), \"\")","v":""},null,"Nanaimo","N",{"v":49.165924,"d":"49.16592"},{"v":-123.939147,"d":"-123.93915"},"http://www.google.com/maps/place/49.165924,-123.939147",8702,"Urban",30915,15722,"Yes","No","No","No ","Nanaimo","FALSE","FALSE"]
[null,8703,"Departure Bay","Yes","Yes","Yes","Regional District of Nanaimo","Vancouver Island and Coast",{"$nulls":8},"","","",null,0,0,null,null,{"$f":"IF(AB715=\"Y\",COUNT(#REF!), \"\")","v":""},null,"Departure Bay","N",{"v":49.205369,"d":"49.20537"},{"v":-123.974761,"d":"-123.97476"},"http://www.google.com/maps/place/49.205369,-123.974761",8703,"Urban",8436,3710,"Yes","No","No","No ","Departure Bay","FALSE","FALSE"]
[null,8704,"East Wellington","Yes","Yes","Yes","Regional District of Nanaimo","Vancouver Island and Coast",{"$nulls":8},"","","",null,0,0,null,null,{"$f":"IF(AB716=\"Y\",COUNT(#REF!), \"\")","v":""},null,"East Wellington","N",{"v":49.183819,"d":"49.18382"},{"v":-124.017738,"d":"-124.01774"},"http://www.google.com/maps/place/49.183819,-124.017738",8704,"Rural",20727,8850,"Yes","No","No","No ","East Wellington","FALSE","FALSE"]
[null,8705,"Lantzville","Yes","Yes","Yes","Regional District of Nanaimo","Vancouver Island and Coast",{"$nulls":8},"","","",null,0,0,null,null,{"$f":"IF(AB717=\"Y\",COUNT(#REF!), \"\")","v":""},null,"Lantzville","N",{"v":49.253205,"d":"49.25321"},{"v":-124.081748,"d":"-124.08175"},"http://www.google.com/maps/place/49.253205,-124.081748",8705,"Urban",363,158,"Yes","No","Yes","No ","Lantzville","FALSE","FALSE"]
[null,8707,"Nanoose Bay","Yes","Yes","Yes","Regional District of Nanaimo","Vancouver Island and Coast",{"$nulls":8},"","","",null,0,0,null,null,{"$f":"IF(AB718=\"Y\",COUNT(#REF!), \"\")","v":""},null,"Nanoose Bay","N",{"v":49.266699,"d":"49.26670"},{"v":-124.199999,"d":"-124.20000"},"http://www.google.com/maps/place/49.266699,-124.199999",8707,"Rural",2091,963,"Yes","No","No","No ","Nanoose Bay","FALSE","FALSE"]
[null,8708,"Dolphin Beach","Yes","Yes","Yes","Regional District of Nanaimo","Vancouver Island and Coast",{"$nulls":8},"","","",null,0,0,null,null,{"$f":"IF(AB719=\"Y\",COUNT(#REF!), \"\")","v":""},null,"Dolphin Beach","N",{"v":49.289088,"d":"49.28909"},{"v":-124.141773,"d":"-124.14177"},"http://www.google.com/maps/place/49.289088,-124.141773",8708,"Rural",1337,738,"Yes","No","Yes","No ","Dolphin Beach","FALSE","FALSE"]
[null,8709,"Parksville","Yes","Yes","Yes","Regional District of Nanaimo","Vancouver Island and Coast",{"$nulls":8},"","","",null,0,0,null,null,{"$f":"IF(AB720=\"Y\",COUNT(#REF!), \"\")","v":""},null,"Parksville","N",{"v":49.322695,"d":"49.32270"},-124.32666,"http://www.google.com/maps/place/49.322695,-124.32666",8709,"Rural",12372,6119,"Yes","No","Yes","No ","Parksville","FALSE","FALSE"]
[null,8710,"Englishman River North","Yes","Yes","Yes","Regional District of Nanaimo","Vancouver Island and Coast",{"$nulls":8},"","","",null,0,0,null,null,{"$f":"IF(AB721=\"Y\",COUNT(#REF!), \"\")","v":""},null,"Englishman River North","N",{"v":49.323312,"d":"49.32331"},{"v":-124.280625,"d":"-124.28063"},"http://www.google.com/maps/place/49.323312,-124.280625",8710,"Rural",12372,6119,"Yes","No","No","No ","Englishman River North","FALSE","FALSE"]
[null,8711,"Qualicum Beach","Yes","Yes","Yes","Regional District of Nanaimo","Vancouver Island and Coast",{"$nulls":8},"","","",null,0,0,null,null,{"$f":"IF(AB722=\"Y\",COUNT(#REF!), \"\")","v":""},null,"Qualicum Beach","N",{"v":49.347534,"d":"49.34753"},{"v":-124.442359,"d":"-124.44236"},"http://www.google.com/maps/place/49.347534,-124.442359",8711,"Rural",5301,2598,"Yes","No","No","No ","Qualicum Beach","FALSE","FALSE"]
[null,8712,"French Creek","Yes","Yes","Yes","Regional District of Nanaimo","Vancouver Island and Coast",{"$nulls":8},"","","",null,0,0,null,null,{"$f":"IF(AB723=\"Y\",COUNT(#REF!), \"\")","v":""},null,"French Creek","N",{"v":49.347125,"d":"49.34713"},{"v":-124.360495,"d":"-124.36050"},"http://www.google.com/maps/place/49.347125,-124.360495",8712,"Rural",7114,3556,"Yes","No","No","No ","French Creek","FALSE","FALSE"]
[null,8713,"Dashwood","Yes","Yes","Yes","Regional District of Nanaimo","Vancouver Island and Coast",{"$nulls":8},"","","",null,0,0,null,null,{"$f":"IF(AB724=\"Y\",COUNT(#REF!), \"\")","v":""},null,"Dashwood","N",{"v":49.362061,"d":"49.36206"},{"v":-124.505929,"d":"-124.50593"},"http://www.google.com/maps/place/49.362061,-124.505929",8713,"Rural",2298,1229,"Yes","No","Yes","No ","Dashwood","FALSE","FALSE"]
[null,8714,"Hilliers","Yes","Yes","Yes","Regional District of Nanaimo","Vancouver Island and Coast",{"$nulls":8},"","","",null,0,0,null,null,{"$f":"IF(AB725=\"Y\",COUNT(#REF!), \"\")","v":""},null,"Hilliers","N",{"v":49.306811,"d":"49.30681"},{"v":-124.483006,"d":"-124.48301"},"http://www.google.com/maps/place/49.306811,-124.483006",8714,"Rural",1485,666,"Yes","No","No","No ","Hilliers","FALSE","FALSE"]
[null,8715,"Coombs","Yes","Yes","Yes","Regional District of Nanaimo","Vancouver Island and Coast",{"$nulls":8},"","","",null,0,0,null,null,{"$f":"IF(AB726=\"Y\",COUNT(#REF!), \"\")","v":""},null,"Coombs","N",{"v":49.304371,"d":"49.30437"},-124.41797,"http://www.google.com/maps/place/49.304371,-124.41797",8715,"Rural",5301,2598,"Yes","No","No","No ","Coombs","FALSE","FALSE"]
[null,8716,"Errington","Yes","Yes","Yes","Regional District of Nanaimo","Vancouver Island and Coast",{"$nulls":8},"","","",null,0,0,null,null,{"$f":"IF(AB727=\"Y\",COUNT(#REF!), \"\")","v":""},null,"Errington","N",{"v":49.288904,"d":"49.28890"},{"v":-124.370084,"d":"-124.37008"},"http://www.google.com/maps/place/49.288904,-124.370084",8716,"Rural",2325,1112,"Yes","No","No","No ","Errington","FALSE","FALSE"]
[null,8717,"Whisky Creek","Yes","Yes","Yes","Regional District of Nanaimo","Vancouver Island and Coast",{"$nulls":8},"","","",null,0,0,null,null,{"$f":"IF(AB728=\"Y\",COUNT(#REF!), \"\")","v":""},null,"Whisky Creek","N",{"v":49.308183,"d":"49.30818"},{"v":-124.508306,"d":"-124.50831"},"http://www.google.com/maps/place/49.308183,-124.508306",8717,"Rural",1485,666,"Yes","No","Yes","No ","Whisky Creek","FALSE","FALSE"]
[null,8718,"Englishman River South","Yes","Yes","Yes","Regional District of Nanaimo","Vancouver Island and Coast",{"$nulls":8},"","","",null,0,0,null,null,{"$f":"IF(AB729=\"Y\",COUNT(#REF!), \"\")","v":""},null,"Englishman River South","N",{"v":49.277851,"d":"49.27785"},{"v":-124.275048,"d":"-124.27505"},"http://www.google.com/maps/place/49.277851,-124.275048",8718,"Rural",2434,1397,"Yes","No","No","No ","Englishman River South","FALSE","FALSE"]
[null,8720,"Dunsmuir","Yes","Yes","Yes","Regional District of Nanaimo","Vancouver Island and Coast",{"$nulls":8},"","","",null,0,0,null,null,{"$f":"IF(AB730=\"Y\",COUNT(#REF!), \"\")","v":""},null,"Dunsmuir","N",{"v":49.388085,"d":"49.38809"},{"v":-124.609426,"d":"-124.60943"},"http://www.google.com/maps/place/49.388085,-124.609426",8720,"Rural",1027,593,"Yes","No","Yes","No ","Dunsmuir","FALSE","FALSE"]
[null,8721,"Qualicum Bay","Yes","Yes","Yes","Regional District of Nanaimo","Vancouver Island and Coast",{"$nulls":8},"","","",null,0,0,null,null,{"$f":"IF(AB731=\"Y\",COUNT(#REF!), \"\")","v":""},null,"Qualicum Bay","N",{"v":49.404524,"d":"49.40452"},{"v":-124.632782,"d":"-124.63278"},"http://www.google.com/maps/place/49.404524,-124.632782",8721,"Rural",1027,593,"Yes","No","Yes","No ","Qualicum Bay","FALSE","FALSE"]
[null,8722,"Bowser","Yes","Yes","Yes","Regional District of Nanaimo","Vancouver Island and Coast",{"$nulls":8},"","","",null,0,0,null,null,{"$f":"IF(AB732=\"Y\",COUNT(#REF!), \"\")","v":""},null,"Bowser","N",{"v":49.438693,"d":"49.43869"},{"v":-124.684757,"d":"-124.68476"},"http://www.google.com/maps/place/49.438693,-124.684757",8722,"Rural",1193,639,"Yes","No","No","No ","Bowser","FALSE","FALSE"]
[null,8723,"Deep Bay","Yes","Yes","Yes","Regional District of Nanaimo","Vancouver Island and Coast",{"$nulls":8},"","","",null,0,0,null,null,{"$f":"IF(AB733=\"Y\",COUNT(#REF!), \"\")","v":""},null,"Deep Bay","N",{"v":49.464234,"d":"49.46423"},{"v":-124.724611,"d":"-124.72461"},"http://www.google.com/maps/place/49.464234,-124.724611",8723,"Rural",504,326,"Yes","No","Yes","No ","Deep Bay","FALSE","FALSE"]
[null,8724,"Hornby Island","No","No","Yes","Comox Valley Regional District","Vancouver Island and Coast",{"$nulls":8},"","","",null,0,0,null,null,{"$f":"IF(AB734=\"Y\",COUNT(#REF!), \"\")","v":""},null,"Hornby Island","N",49.52266,{"v":-124.642498,"d":"-124.64250"},"http://www.google.com/maps/place/49.52266,-124.642498",8724,"Rural",414,503,"No","Yes","Yes","No ","Hornby Island","FALSE","FALSE"]
[null,8725,"Mud Bay","Yes","Yes","Yes","Comox Valley Regional District","Vancouver Island and Coast",{"$nulls":8},"","","",null,0,0,null,null,{"$f":"IF(AB735=\"Y\",COUNT(#REF!), \"\")","v":""},null,"Mud Bay","N",{"v":49.4667,"d":"49.46670"},{"v":-124.799999,"d":"-124.80000"},"http://www.google.com/maps/place/49.4667,-124.799999",8725,"Rural",927,486,"Yes","No","No","No ","Mud Bay","FALSE","FALSE"]
[null,8726,"Fanny Bay","Yes","Yes","Yes","Comox Valley Regional District","Vancouver Island and Coast",{"$nulls":8},"","","",null,0,0,null,null,{"$f":"IF(AB736=\"Y\",COUNT(#REF!), \"\")","v":""},null,"Fanny Bay","N",{"v":49.490105,"d":"49.49011"},{"v":-124.812789,"d":"-124.81279"},"http://www.google.com/maps/place/49.490105,-124.812789",8726,"Rural",927,486,"Yes","No","No","No ","Fanny Bay","FALSE","FALSE"]
[null,8727,"Union Bay","Yes","Yes","Yes","Comox Valley Regional District","Vancouver Island and Coast",{"$nulls":8},"","","",null,0,0,null,null,{"$f":"IF(AB737=\"Y\",COUNT(#REF!), \"\")","v":""},null,"Union Bay","N",{"v":49.580206,"d":"49.58021"},{"v":-124.885176,"d":"-124.88518"},"http://www.google.com/maps/place/49.580206,-124.885176",8727,"Rural",612,326,"Yes","No","No","No ","Union Bay","FALSE","FALSE"]
[null,8728,{"$f":"HYPERLINK(AE738,AN738)","v":"Buckley Bay"},"Yes","Yes","Yes","Comox Valley Regional District","Vancouver Island and Coast",{"$nulls":8},{"$f":"IF(L738=\"\",\"\",\nIF(SUM((J738*L738)/M738)<=N738,\"Sufficient Capacity\",\nIF(SUM((J738*L738)/M738)>N738,\"Not Enough Capacity\",\"Error\")))","v":""},{"$f":"IF(OR(ISBLANK(J738),ISBLANK(L738),ISBLANK(M738)), \"\",(J738*L738/M738))","v":""},{"$f":"IF(AND(COUNT(N738,R738)=2, OR($O$10=\"Last-Mile\", $O$10=\"Transport & Last-Mile\")), N738-R738, \"\")","v":""},null,{"$f":"IF(AND(AB738=\"Y\",I738<>\"\"),1,0)","v":0},{"$f":"IF(AND(AB738=\"Y\",I738=\"Last-Mile & Transport\"),1,0)","v":0},null,null,{"$f":"IF(AB738=\"Y\",COUNT(#REF!), \"\")","v":""},null,"Buckley Bay","N",{"v":49.533334,"d":"49.53333"},{"v":-124.856944,"d":"-124.85694"},"http://www.google.com/maps/place/49.533334,-124.856944",8728,"Rural",324,181,"Yes","No","No","No ",{"$f":"IF(AB738=\"Y\", CONCATENATE(AA738,\"*\"), AA738)","v":"Buckley Bay"},{"$f":"IF(I738=\"Last-Mile\",\"TRUE\",IF(I738=\"Transport & Last-Mile\",\"TRUE\",\"FALSE\"))","v":"FALSE"},{"$f":"IF(I738=\"Transport\",\"TRUE\",IF(I738=\"Transport & Last-Mile\",\"TRUE\",\"FALSE\"))","v":"FALSE"}]
[null,8729,"Royston","Yes","Yes","Yes","Comox Valley Regional District","Vancouver Island and Coast",{"$nulls":8},"","","",null,0,0,null,null,{"$f":"IF(AB739=\"Y\",COUNT(#REF!), \"\")","v":""},null,"Royston","N",{"v":49.645411,"d":"49.64541"},{"v":-124.945195,"d":"-124.94520"},"http://www.google.com/maps/place/49.645411,-124.945195",8729,"Rural",1914,868,"Yes","No","Yes","No ","Royston","FALSE","FALSE"]
[null,8730,"Cumberland","Yes","Yes","Yes","Comox Valley Regional District","Vancouver Island and Coast",{"$nulls":8},"","","",null,0,0,null,null,{"$f":"IF(AB740=\"Y\",COUNT(#REF!), \"\")","v":""},null,"Cumberland","N",{"v":49.621955,"d":"49.62196"},{"v":-125.026486,"d":"-125.02649"},"http://www.google.com/maps/place/49.621955,-125.026486",8730,"Rural",3984,1716,"Yes","No","No","No ","Cumberland","FALSE","FALSE"]
[null,8732,"Courtenay","Yes","Yes","Yes","Comox Valley Regional District","Vancouver Island and Coast",{"$nulls":8},"","","",null,0,0,null,null,{"$f":"IF(AB741=\"Y\",COUNT(#REF!), \"\")","v":""},null,"Courtenay","N",{"v":49.688915,"d":"49.68892"},{"v":-124.998974,"d":"-124.99897"},"http://www.google.com/maps/place/49.688915,-124.998974",8732,"Urban",9659,4816,"Yes","No","No","No ","Courtenay","FALSE","FALSE"]
[null,8733,"Comox","Yes","Yes","Yes","Comox Valley Regional District","Vancouver Island and Coast",{"$nulls":8},"","","",null,0,0,null,null,{"$f":"IF(AB742=\"Y\",COUNT(#REF!), \"\")","v":""},null,"Comox","N",{"v":49.673858,"d":"49.67386"},{"v":-124.927795,"d":"-124.92780"},"http://www.google.com/maps/place/49.673858,-124.927795",8733,"Rural",16722,7466,"Yes","No","No","No ","Comox","FALSE","FALSE"]
[null,8734,"Little River","Yes","Yes","Yes","Comox Valley Regional District","Vancouver Island and Coast",{"$nulls":8},"","","",null,0,0,null,null,{"$f":"IF(AB743=\"Y\",COUNT(#REF!), \"\")","v":""},null,"Little River","N",{"v":49.7377,"d":"49.73770"},{"v":-124.914063,"d":"-124.91406"},"http://www.google.com/maps/place/49.7377,-124.914063",8734,"Urban",1294,666,"Yes","No","Yes","No ","Little River","FALSE","FALSE"]
[null,8735,"Lazo","Yes","Yes","Yes","Comox Valley Regional District","Vancouver Island and Coast",{"$nulls":8},"","","",null,0,0,null,null,{"$f":"IF(AB744=\"Y\",COUNT(#REF!), \"\")","v":""},null,"Lazo","N",{"v":49.713894,"d":"49.71389"},{"v":-124.909117,"d":"-124.90912"},"http://www.google.com/maps/place/49.713894,-124.909117",8735,"Urban",16722,7466,"Yes","No","Yes","No ","Lazo","FALSE","FALSE"]
[null,8736,"Denman Island","No","No","Yes","Comox Valley Regional District","Vancouver Island and Coast",{"$nulls":8},"","","",null,0,0,null,null,{"$f":"IF(AB745=\"Y\",COUNT(#REF!), \"\")","v":""},null,"Denman Island","N",{"v":49.535791,"d":"49.53579"},{"v":-124.813115,"d":"-124.81312"},"http://www.google.com/maps/place/49.535791,-124.813115",8736,"Rural",422,272,"No","Yes","No","No ","Denman Island","FALSE","FALSE"]
[null,8737,"Port Alberni","Yes","Yes","Yes","Regional District of Alberni-Clayoquot","Vancouver Island and Coast",{"$nulls":8},"","","",null,0,0,null,null,{"$f":"IF(AB746=\"Y\",COUNT(#REF!), \"\")","v":""},null,"Port Alberni","N",{"v":49.2417,"d":"49.24170"},{"v":-124.800001,"d":"-124.80000"},"http://www.google.com/maps/place/49.2417,-124.800001",8737,"Rural",10966,5274,"Yes","No","Yes","No ","Port Alberni","FALSE","FALSE"]
[null,8739,"Cherry Creek","Yes","Yes","Yes","Regional District of Alberni-Clayoquot","Vancouver Island and Coast",{"$nulls":8},"","","",null,0,0,null,null,{"$f":"IF(AB747=\"Y\",COUNT(#REF!), \"\")","v":""},null,"Cherry Creek","N",{"v":49.282722,"d":"49.28272"},{"v":-124.787497,"d":"-124.78750"},"http://www.google.com/maps/place/49.282722,-124.787497",8739,"Rural",8294,3960,"Yes","No","Yes","No ","Cherry Creek","FALSE","FALSE"]
[null,8741,"Sproat Lake","Yes","Yes","Yes","Regional District of Alberni-Clayoquot","Vancouver Island and Coast",{"$nulls":8},"","","",null,0,0,null,null,{"$f":"IF(AB748=\"Y\",COUNT(#REF!), \"\")","v":""},null,"Sproat Lake","N",{"v":49.276622,"d":"49.27662"},{"v":-124.923621,"d":"-124.92362"},"http://www.google.com/maps/place/49.276622,-124.923621",8741,"Rural",848,497,"Yes","No","Yes","No ","Sproat Lake","FALSE","FALSE"]
[null,8742,"Grantham","Yes","Yes","Yes","Comox Valley Regional District","Vancouver Island and Coast",{"$nulls":8},"","","",null,0,0,null,null,{"$f":"IF(AB749=\"Y\",COUNT(#REF!), \"\")","v":""},null,"Grantham","N",{"v":49.762775,"d":"49.76278"},-125.02132,"http://www.google.com/maps/place/49.762775,-125.02132",8742,"Rural",758,325,"No","No","Yes","No ","Grantham","FALSE","FALSE"]
[null,8743,"Headquarters","No","No","Yes","Comox Valley Regional District","Vancouver Island and Coast",{"$nulls":8},"","","",null,0,0,null,null,{"$f":"IF(AB750=\"Y\",COUNT(#REF!), \"\")","v":""},null,"Headquarters","N",{"v":49.764649,"d":"49.76465"},{"v":-125.114606,"d":"-125.11461"},"http://www.google.com/maps/place/49.764649,-125.114606",8743,"Rural",651,269,"No","No","No","No ","Headquarters","FALSE","FALSE"]
[null,8744,"Merville","Yes","Yes","Yes","Comox Valley Regional District","Vancouver Island and Coast",{"$nulls":8},"","","",null,0,0,null,null,{"$f":"IF(AB751=\"Y\",COUNT(#REF!), \"\")","v":""},null,"Merville","N",{"v":49.784837,"d":"49.78484"},{"v":-125.057337,"d":"-125.05734"},"http://www.google.com/maps/place/49.784837,-125.057337",8744,"Rural",1205,530,"Yes","No","No","No ","Merville","FALSE","FALSE"]
[null,8745,"Williams Beach","Yes","Yes","Yes","Comox Valley Regional District","Vancouver Island and Coast",{"$nulls":8},"","","",null,0,0,null,null,{"$f":"IF(AB752=\"Y\",COUNT(#REF!), \"\")","v":""},null,"Williams Beach","N",{"v":49.833966,"d":"49.83397"},{"v":-125.060902,"d":"-125.06090"},"http://www.google.com/maps/place/49.833966,-125.060902",8745,"Rural",161,75,"No","No","Yes","No ","Williams Beach","FALSE","FALSE"]
[null,8746,"Oyster River","Yes","Yes","Yes","Strathcona Regional District","Vancouver Island and Coast",{"$nulls":8},"","","",null,0,0,null,null,{"$f":"IF(AB753=\"Y\",COUNT(#REF!), \"\")","v":""},null,"Oyster River","N",49.87375,{"v":-125.129065,"d":"-125.12907"},"http://www.google.com/maps/place/49.87375,-125.129065",8746,"Rural",1501,701,"Yes","No","Yes","No ","Oyster River","FALSE","FALSE"]
[null,8747,"Saratoga Beach","Yes","Yes","Yes","Comox Valley Regional District","Vancouver Island and Coast",{"$nulls":8},"","","",null,0,0,null,null,{"$f":"IF(AB754=\"Y\",COUNT(#REF!), \"\")","v":""},null,"Saratoga Beach","N",{"v":49.859496,"d":"49.85950"},-125.11572,"http://www.google.com/maps/place/49.859496,-125.11572",8747,"Rural",1501,701,"Yes","No","Yes","No ","Saratoga Beach","FALSE","FALSE"]
[null,8748,"Black Creek","Yes","Yes","Yes","Comox Valley Regional District","Vancouver Island and Coast",{"$nulls":8},"","","",null,0,0,null,null,{"$f":"IF(AB755=\"Y\",COUNT(#REF!), \"\")","v":""},null,"Black Creek","N",{"v":49.836867,"d":"49.83687"},{"v":-125.132113,"d":"-125.13211"},"http://www.google.com/maps/place/49.836867,-125.132113",8748,"Rural",944,409,"No","No","Yes","No ","Black Creek","FALSE","FALSE"]
[null,8750,"Shelter Point","Yes","Yes","Yes","Strathcona Regional District","Vancouver Island and Coast",{"$nulls":8},"","","",null,0,0,null,null,{"$f":"IF(AB756=\"Y\",COUNT(#REF!), \"\")","v":""},null,"Shelter Point","N",{"v":49.940279,"d":"49.94028"},{"v":-125.190691,"d":"-125.19069"},"http://www.google.com/maps/place/49.940279,-125.190691",8750,"Urban",253,126,"Yes","No","Yes","No ","Shelter Point","FALSE","FALSE"]
[null,8751,"Ocean Grove","Yes","Yes","Yes","Strathcona Regional District","Vancouver Island and Coast",{"$nulls":8},"","","",null,0,0,null,null,{"$f":"IF(AB757=\"Y\",COUNT(#REF!), \"\")","v":""},null,"Ocean Grove","N",{"v":49.952389,"d":"49.95239"},{"v":-125.201527,"d":"-125.20153"},"http://www.google.com/maps/place/49.952389,-125.201527",8751,"Urban",17608,7587,"Yes","No","Yes","No ","Ocean Grove","FALSE","FALSE"]
[null,8752,"Campbell River","Yes","Yes","Yes","Strathcona Regional District","Vancouver Island and Coast",{"$nulls":8},"","","",null,0,0,null,null,{"$f":"IF(AB758=\"Y\",COUNT(#REF!), \"\")","v":""},null,"Campbell River","N",{"v":50.016667,"d":"50.01667"},{"v":-125.241668,"d":"-125.24167"},"http://www.google.com/maps/place/50.016667,-125.241668",8752,"Urban",null,null,"No","No","Yes","No ","Campbell River","FALSE","FALSE"]
[null,8754,"Quathiaski Cove","No","No","Yes","Strathcona Regional District","Vancouver Island and Coast",{"$nulls":8},"","","",null,0,0,null,null,{"$f":"IF(AB759=\"Y\",COUNT(#REF!), \"\")","v":""},null,"Quathiaski Cove","N",{"v":50.045421,"d":"50.04542"},{"v":-125.210343,"d":"-125.21034"},"http://www.google.com/maps/place/50.045421,-125.210343",8754,"Rural",6241,3178,"Yes","No","Yes","No ","Quathiaski Cove","FALSE","FALSE"]
[null,8755,"Heriot Bay","No","No","Yes","Strathcona Regional District","Vancouver Island and Coast",{"$nulls":8},"","","",null,0,0,null,null,{"$f":"IF(AB760=\"Y\",COUNT(#REF!), \"\")","v":""},null,"Heriot Bay","N",{"v":50.100242,"d":"50.10024"},{"v":-125.212731,"d":"-125.21273"},"http://www.google.com/maps/place/50.100242,-125.212731",8755,"Rural",812,427,"No","Yes","No","No ","Heriot Bay","FALSE","FALSE"]
[null,8756,"Yaculta*","No","No","Yes","Strathcona Regional District","Vancouver Island and Coast",{"$nulls":8},"","","",null,0,0,null,null,{"$f":"IF(AB761=\"Y\",COUNT(#REF!), \"\")","v":0},null,"Yaculta","Y",{"v":50.021696,"d":"50.02170"},{"v":-125.194987,"d":"-125.19499"},"http://www.google.com/maps/place/50.021696,-125.194987",8756,"Rural First Nations Secondary Reserve",6241,3178,"Yes","No","Yes","No ","Yaculta*","FALSE","FALSE"]
[null,8757,"Sayward","No","Yes","Yes","Strathcona Regional District","Vancouver Island and Coast",{"$nulls":8},"","","",null,0,0,null,null,{"$f":"IF(AB762=\"Y\",COUNT(#REF!), \"\")","v":""},null,"Sayward","N",{"v":50.377036,"d":"50.37704"},{"v":-125.951954,"d":"-125.95195"},"http://www.google.com/maps/place/50.377036,-125.951954",8757,"Rural",286,164,"No","Yes","Yes","No ","Sayward","FALSE","FALSE"]
[null,8758,"Bliss Landing","No","No","No","qathet Regional District","Vancouver Island and Coast",{"$nulls":8},"","","",null,0,0,null,null,{"$f":"IF(AB763=\"Y\",COUNT(#REF!), \"\")","v":""},null,"Bliss Landing","N",{"v":50.036566,"d":"50.03657"},{"v":-124.816336,"d":"-124.81634"},"http://www.google.com/maps/place/50.036566,-124.816336",8758,"Rural",76,201,"No","Yes","Yes","No ","Bliss Landing","FALSE","FALSE"]
[null,8759,"Refuge Cove","No","No","No","Strathcona Regional District","Vancouver Island and Coast",{"$nulls":8},"","","",null,0,0,null,null,{"$f":"IF(AB764=\"Y\",COUNT(#REF!), \"\")","v":""},null,"Refuge Cove","N",{"v":50.1237487,"d":"50.12375"},{"v":-124.8390156,"d":"-124.83902"},"http://www.google.com/maps/place/50.1237487,-124.8390156",8759,"Rural",6,20,"No","Yes","Yes","No ","Refuge Cove","FALSE","FALSE"]
[null,8760,"Brem River*","No","No","No","Strathcona Regional District","Vancouver Island and Coast",{"$nulls":8},"","","",null,0,0,null,null,{"$f":"IF(AB765=\"Y\",COUNT(#REF!), \"\")","v":0},null,"Brem River","Y",{"v":50.439183,"d":"50.43918"},{"v":-124.671339,"d":"-124.67134"},"http://www.google.com/maps/place/50.439183,-124.671339",8760,"Rural First Nations Secondary Reserve",6,20,"No","Yes","No","No ","Brem River*","FALSE","FALSE"]
[null,8761,"Big Bay","No","No","Yes","Strathcona Regional District","Vancouver Island and Coast",{"$nulls":8},"","","",null,0,0,null,null,{"$f":"IF(AB766=\"Y\",COUNT(#REF!), \"\")","v":""},null,"Big Bay","N",{"v":50.397215,"d":"50.39722"},{"v":-125.135258,"d":"-125.13526"},"http://www.google.com/maps/place/50.397215,-125.135258",8761,"Rural",6,20,"No","Yes","Yes","No ","Big Bay","FALSE","FALSE"]
[null,8762,"Granite Bay","No","No","No","Strathcona Regional District","Vancouver Island and Coast",{"$nulls":8},"","","",null,0,0,null,null,{"$f":"IF(AB767=\"Y\",COUNT(#REF!), \"\")","v":""},null,"Granite Bay","N",{"v":50.233299,"d":"50.23330"},{"v":-125.3,"d":"-125.30000"},"http://www.google.com/maps/place/50.233299,-125.3",8762,"Rural",26,15,"No","Yes","Yes","No ","Granite Bay","FALSE","FALSE"]
[null,8763,"Bold Point","No","No","Yes","Strathcona Regional District","Vancouver Island and Coast",{"$nulls":8},"","","",null,0,0,null,null,{"$f":"IF(AB768=\"Y\",COUNT(#REF!), \"\")","v":""},null,"Bold Point","N",{"v":50.172061,"d":"50.17206"},{"v":-125.160964,"d":"-125.16096"},"http://www.google.com/maps/place/50.172061,-125.160964",8763,"Rural",43,24,"No","Yes","No","No ","Bold Point","FALSE","FALSE"]
[null,8764,"Elk Bay","No","No","No","Strathcona Regional District","Vancouver Island and Coast",{"$nulls":8},"","","",null,0,0,null,null,{"$f":"IF(AB769=\"Y\",COUNT(#REF!), \"\")","v":""},null,"Elk Bay","N",{"v":50.285602,"d":"50.28560"},{"v":-125.436472,"d":"-125.43647"},"http://www.google.com/maps/place/50.285602,-125.436472",8764,"Rural",1,0,"No","Yes","No","No ","Elk Bay","FALSE","FALSE"]
[null,8765,"Rock Bay","No","No","No","Strathcona Regional District","Vancouver Island and Coast",{"$nulls":8},"","","",null,0,0,null,null,{"$f":"IF(AB770=\"Y\",COUNT(#REF!), \"\")","v":""},null,"Rock Bay","N",{"v":50.332308,"d":"50.33231"},{"v":-125.486283,"d":"-125.48628"},"http://www.google.com/maps/place/50.332308,-125.486283",8765,"Rural",1,0,"No","Yes","Yes","No ","Rock Bay","FALSE","FALSE"]
[null,8766,"Bloedel","No","No","Yes","Strathcona Regional District","Vancouver Island and Coast",{"$nulls":8},"","","",null,0,0,null,null,{"$f":"IF(AB771=\"Y\",COUNT(#REF!), \"\")","v":""},null,"Bloedel","N",{"v":50.116699,"d":"50.11670"},{"v":-125.383299,"d":"-125.38330"},"http://www.google.com/maps/place/50.116699,-125.383299",8766,"Rural",10,5,"No","Yes","Yes","No ","Bloedel","FALSE","FALSE"]
[null,8767,"Matilpi","No","No","No","Strathcona Regional District","Vancouver Island and Coast",{"$nulls":8},"","","",null,0,0,null,null,{"$f":"IF(AB772=\"Y\",COUNT(#REF!), \"\")","v":""},null,"Matilpi","N",{"v":50.549401,"d":"50.54940"},{"v":-126.184326,"d":"-126.18433"},"http://www.google.com/maps/place/50.549401,-126.184326",8767,"Rural",2,4,"No","Yes","No","No ","Matilpi","FALSE","FALSE"]
[null,8768,"Port Neville","No","No","Yes","Strathcona Regional District","Vancouver Island and Coast",{"$nulls":8},"","","",null,0,0,null,null,{"$f":"IF(AB773=\"Y\",COUNT(#REF!), \"\")","v":""},null,"Port Neville","N",{"v":50.4929341,"d":"50.49293"},{"v":-126.0858154,"d":"-126.08582"},"http://www.google.com/maps/place/50.4929341,-126.0858154",8768,"Rural",2,4,"No","Yes","Yes","No ","Port Neville","FALSE","FALSE"]
[null,8769,"Blind Channel","No","No","No","Strathcona Regional District","Vancouver Island and Coast",{"$nulls":8},"","","",null,0,0,null,null,{"$f":"IF(AB774=\"Y\",COUNT(#REF!), \"\")","v":""},null,"Blind Channel","N",{"v":50.4167,"d":"50.41670"},{"v":-125.499999,"d":"-125.50000"},"http://www.google.com/maps/place/50.4167,-125.499999",8769,"Rural",12,23,"No","Yes","Yes","No ","Blind Channel","FALSE","FALSE"]
[null,8770,"Surge Narrows","No","No","No","Strathcona Regional District","Vancouver Island and Coast",{"$nulls":8},"","","",null,0,0,null,null,{"$f":"IF(AB775=\"Y\",COUNT(#REF!), \"\")","v":""},null,"Surge Narrows","N",{"v":50.230599,"d":"50.23060"},{"v":-125.108938,"d":"-125.10894"},"http://www.google.com/maps/place/50.230599,-125.108938",8770,"Rural",33,28,"No","Yes","No","No ","Surge Narrows","FALSE","FALSE"]
[null,8771,"Seaford","No","No","Yes","Strathcona Regional District","Vancouver Island and Coast",{"$nulls":8},"","","",null,0,0,null,null,{"$f":"IF(AB776=\"Y\",COUNT(#REF!), \"\")","v":""},null,"Seaford","N",{"v":50.0833,"d":"50.08330"},{"v":-124.899999,"d":"-124.90000"},"http://www.google.com/maps/place/50.0833,-124.899999",8771,"Rural",177,117,"No","Yes","Yes","No ","Seaford","FALSE","FALSE"]
[null,8772,"Tatlayoko Lake","No","No","No","Cariboo Regional District","Cariboo",{"$nulls":8},"","","",null,0,0,null,null,{"$f":"IF(AB777=\"Y\",COUNT(#REF!), \"\")","v":""},null,"Tatlayoko Lake","N",{"v":51.7167,"d":"51.71670"},{"v":-124.433299,"d":"-124.43330"},"http://www.google.com/maps/place/51.7167,-124.433299",8772,"Rural",46,21,"No","Yes","Yes","No ","Tatlayoko Lake","FALSE","FALSE"]
[null,8773,"Nemaiah Valley","No","No","No","Cariboo Regional District","Cariboo",{"$nulls":8},"","","",null,0,0,null,null,{"$f":"IF(AB778=\"Y\",COUNT(#REF!), \"\")","v":""},null,"Nemaiah Valley","N",{"v":51.477637,"d":"51.47764"},{"v":-123.886932,"d":"-123.88693"},"http://www.google.com/maps/place/51.477637,-123.886932",8773,"Rural",30,12,"No","Yes","No","No ","Nemaiah Valley","FALSE","FALSE"]
[null,8774,"Xeni Gwet'in*","No","No","No","Cariboo Regional District","Cariboo",{"$nulls":8},"","","",null,0,0,null,null,{"$f":"IF(AB779=\"Y\",COUNT(#REF!), \"\")","v":0},null,"Xeni Gwet'in","Y",{"v":51.468738,"d":"51.46874"},{"v":-123.936047,"d":"-123.93605"},"http://www.google.com/maps/place/51.468738,-123.936047",8774,"Rural First Nations Secondary Reserve",67,30,"No","Yes","Yes","No ","Xeni Gwet'in*","FALSE","FALSE"]
[null,8775,"Vanderhoof","Yes","Yes","Yes","Bulkley Nechako Regional District","Nechako",{"$nulls":8},"","","",null,0,0,null,null,{"$f":"IF(AB780=\"Y\",COUNT(#REF!), \"\")","v":""},null,"Vanderhoof","N",54.01747,-124.00228,"http://www.google.com/maps/place/54.01747,-124.00228",8775,"Rural",3928,1627,"No","Yes","Yes","No ","Vanderhoof","FALSE","FALSE"]
[null,8776,"Nukko Lake","Yes","Yes","Yes","Regional District of Fraser-Fort George","Cariboo",{"$nulls":8},"","","",null,0,0,null,null,{"$f":"IF(AB781=\"Y\",COUNT(#REF!), \"\")","v":""},null,"Nukko Lake","N",{"v":54.083301,"d":"54.08330"},{"v":-122.983299,"d":"-122.98330"},"http://www.google.com/maps/place/54.083301,-122.983299",8776,"Rural",322,139,"No","Yes","No","No ","Nukko Lake","FALSE","FALSE"]
[null,8778,"Fort Fraser","Yes","Yes","Yes","Bulkley Nechako Regional District","Nechako",{"$nulls":8},"","","",null,0,0,null,null,{"$f":"IF(AB782=\"Y\",COUNT(#REF!), \"\")","v":""},null,"Fort Fraser","N",{"v":54.059967,"d":"54.05997"},{"v":-124.550268,"d":"-124.55027"},"http://www.google.com/maps/place/54.059967,-124.550268",8778,"Rural",346,192,"No","Yes","No","No ","Fort Fraser","FALSE","FALSE"]
[null,8780,"Fraser Lake","Yes","Yes","Yes","Bulkley Nechako Regional District","Nechako",{"$nulls":8},"","","",null,0,0,null,null,{"$f":"IF(AB783=\"Y\",COUNT(#REF!), \"\")","v":""},null,"Fraser Lake","N",{"v":54.0583,"d":"54.05830"},{"v":-124.847201,"d":"-124.84720"},"http://www.google.com/maps/place/54.0583,-124.847201",8780,"Rural",1103,618,"No","Yes","No","No ","Fraser Lake","FALSE","FALSE"]
[null,8782,"Tintagel","Yes","Yes","Yes","Bulkley Nechako Regional District","Nechako",{"$nulls":8},"","","",null,0,0,null,null,{"$f":"IF(AB784=\"Y\",COUNT(#REF!), \"\")","v":""},null,"Tintagel","N",54.20285,{"v":-125.593009,"d":"-125.59301"},"http://www.google.com/maps/place/54.20285,-125.593009",8782,"Rural",142,67,"No","Yes","No","No ","Tintagel","FALSE","FALSE"]
[null,8783,"Burns Lake","No","Yes","Yes","Bulkley Nechako Regional District","Nechako",{"$nulls":8},"","","",null,0,0,null,null,{"$f":"IF(AB785=\"Y\",COUNT(#REF!), \"\")","v":""},null,"Burns Lake","N",{"v":54.231422,"d":"54.23142"},{"v":-125.759652,"d":"-125.75965"},"http://www.google.com/maps/place/54.231422,-125.759652",8783,"Rural",2478,1013,"No","Yes","No","No ","Burns Lake","FALSE","FALSE"]
[null,8784,"Endako","Yes","Yes","Yes","Bulkley Nechako Regional District","Nechako",{"$nulls":8},"","","",null,0,0,null,null,{"$f":"IF(AB786=\"Y\",COUNT(#REF!), \"\")","v":""},null,"Endako","N",{"v":54.087502,"d":"54.08750"},{"v":-125.017023,"d":"-125.01702"},"http://www.google.com/maps/place/54.087502,-125.017023",8784,"Rural",58,30,"No","Yes","Yes","No ","Endako","FALSE","FALSE"]
[null,8787,"Decker Lake","No","No","Yes","Bulkley Nechako Regional District","Nechako",{"$nulls":8},"","","",null,0,0,null,null,{"$f":"IF(AB787=\"Y\",COUNT(#REF!), \"\")","v":""},null,"Decker Lake","N",{"v":54.300001,"d":"54.30000"},{"v":-125.833301,"d":"-125.83330"},"http://www.google.com/maps/place/54.300001,-125.833301",8787,"Rural",304,139,"No","Yes","Yes","No ","Decker Lake","FALSE","FALSE"]
[null,8789,"Broman Lake*","Yes","Yes","Yes","Bulkley Nechako Regional District","Nechako",{"$nulls":8},"","","",null,0,0,null,null,{"$f":"IF(AB788=\"Y\",COUNT(#REF!), \"\")","v":0},null,"Broman Lake","Y",54.42032,{"v":-126.134615,"d":"-126.13462"},"http://www.google.com/maps/place/54.42032,-126.134615",8789,"Rural First Nations Primary Reserve",10,10,"No","Yes","No","No ","Broman Lake*","FALSE","FALSE"]
[null,8790,"Topley","No","No","Yes","Bulkley Nechako Regional District","Nechako",{"$nulls":8},"","","",null,0,0,null,null,{"$f":"IF(AB789=\"Y\",COUNT(#REF!), \"\")","v":""},null,"Topley","N",{"v":54.506831,"d":"54.50683"},{"v":-126.301006,"d":"-126.30101"},"http://www.google.com/maps/place/54.506831,-126.301006",8790,"Rural",59,33,"No","Yes","Yes","No ","Topley","FALSE","FALSE"]
[null,8791,"Wiley","Yes","Yes","Yes","Bulkley Nechako Regional District","Nechako",{"$nulls":8},"","","",null,0,0,null,null,{"$f":"IF(AB790=\"Y\",COUNT(#REF!), \"\")","v":""},null,"Wiley","N",{"v":54.515038,"d":"54.51504"},{"v":-126.333734,"d":"-126.33373"},"http://www.google.com/maps/place/54.515038,-126.333734",8791,"Rural",90,40,"No","Yes","Yes","No ","Wiley","FALSE","FALSE"]
[null,8792,"Perow","Yes","Yes","No","Bulkley Nechako Regional District","Nechako",{"$nulls":8},"","","",null,0,0,null,null,{"$f":"IF(AB791=\"Y\",COUNT(#REF!), \"\")","v":""},null,"Perow","N",54.52018,{"v":-126.440459,"d":"-126.44046"},"http://www.google.com/maps/place/54.52018,-126.440459",8792,"Rural",68,28,"No","Yes","Yes","No ","Perow","FALSE","FALSE"]
[null,8793,"Houston","Yes","Yes","Yes","Bulkley Nechako Regional District","Nechako",{"$nulls":8},"","","",null,0,0,null,null,{"$f":"IF(AB792=\"Y\",COUNT(#REF!), \"\")","v":""},null,"Houston","N",{"v":54.396987,"d":"54.39699"},{"v":-126.651832,"d":"-126.65183"},"http://www.google.com/maps/place/54.396987,-126.651832",8793,"Rural",2046,1005,"Yes","No","No","No ","Houston","FALSE","FALSE"]
[null,8794,"Granisle","No","Yes","Yes","Bulkley Nechako Regional District","Nechako",{"$nulls":8},"","","",null,0,0,null,null,{"$f":"IF(AB793=\"Y\",COUNT(#REF!), \"\")","v":""},null,"Granisle","N",{"v":54.884416,"d":"54.88442"},{"v":-126.213078,"d":"-126.21308"},"http://www.google.com/maps/place/54.884416,-126.213078",8794,"Rural",303,285,"No","No","No","No ","Granisle","FALSE","FALSE"]
[null,8795,"Lake Babine*","Yes","Yes","Yes","Bulkley Nechako Regional District","Nechako",{"$nulls":8},"","","",null,0,0,null,null,{"$f":"IF(AB794=\"Y\",COUNT(#REF!), \"\")","v":0},null,"Lake Babine","Y",{"v":54.817021,"d":"54.81702"},{"v":-126.146656,"d":"-126.14666"},"http://www.google.com/maps/place/54.817021,-126.146656",8795,"Rural First Nations Primary Reserve",122,82,"No","Yes","No","No ","Lake Babine*","FALSE","FALSE"]
[null,8796,"Topley Landing","Yes","Yes","Yes","Bulkley Nechako Regional District","Nechako",{"$nulls":8},"","","",null,0,0,null,null,{"$f":"IF(AB795=\"Y\",COUNT(#REF!), \"\")","v":""},null,"Topley Landing","N",{"v":54.80722778,"d":"54.80723"},{"v":-126.14263333,"d":"-126.14263"},"http://www.google.com/maps/place/54.80722778,-126.14263333",8796,"Rural",122,82,"No","Yes","No","No ","Topley Landing","FALSE","FALSE"]
[null,8797,"Smithers Landing","No","No","No","Bulkley Nechako Regional District","Nechako",{"$nulls":8},"","","",null,0,0,null,null,{"$f":"IF(AB796=\"Y\",COUNT(#REF!), \"\")","v":""},null,"Smithers Landing","N",55.05402,{"v":-126.526014,"d":"-126.52601"},"http://www.google.com/maps/place/55.05402,-126.526014",8797,"Rural",24,20,"Yes","No","No","No ","Smithers Landing","FALSE","FALSE"]
[null,8798,"Old Fort*","Yes","Yes","Yes","Bulkley Nechako Regional District","Nechako",{"$nulls":8},"","","",null,0,0,null,null,{"$f":"IF(AB797=\"Y\",COUNT(#REF!), \"\")","v":0},null,"Old Fort","Y",{"v":55.037629,"d":"55.03763"},{"v":-126.317515,"d":"-126.31752"},"http://www.google.com/maps/place/55.037629,-126.317515",8798,"Rural First Nations Primary Reserve",null,null,"No","No","Yes","No ","Old Fort*","FALSE","FALSE"]
[null,8799,"Fort Babine*","No","No","No","Bulkley Nechako Regional District","Nechako",{"$nulls":8},"","","",null,0,0,null,null,{"$f":"IF(AB798=\"Y\",COUNT(#REF!), \"\")","v":0},null,"Fort Babine","Y",{"v":55.322294,"d":"55.32229"},{"v":-126.626221,"d":"-126.62622"},"http://www.google.com/maps/place/55.322294,-126.626221",8799,"Rural First Nations Primary Reserve",86,47,"No","Yes","No","No ","Fort Babine*","FALSE","FALSE"]
[null,8801,"Mackenzie","Yes","Yes","Yes","Regional District of Fraser-Fort George","Cariboo",{"$nulls":8},"","","",null,0,0,null,null,{"$f":"IF(AB799=\"Y\",COUNT(#REF!), \"\")","v":""},null,"Mackenzie","N",{"v":55.335437,"d":"55.33544"},{"v":-123.095472,"d":"-123.09547"},"http://www.google.com/maps/place/55.335437,-123.095472",8801,"Rural",3505,1760,"No","Yes","Yes","No ","Mackenzie","FALSE","FALSE"]
[null,8802,"Fort St. James","Yes","Yes","Yes","Bulkley Nechako Regional District","Nechako",{"$nulls":8},"","","",null,0,0,null,null,{"$f":"IF(AB800=\"Y\",COUNT(#REF!), \"\")","v":""},null,"Fort St. James","N",{"v":54.448709,"d":"54.44871"},{"v":-124.256369,"d":"-124.25637"},"http://www.google.com/maps/place/54.448709,-124.256369",8802,"Rural",1092,482,"No","Yes","Yes","No ","Fort St. James","FALSE","FALSE"]
[null,8804,"Pinchi Lake","No","No","Yes","Bulkley Nechako Regional District","Nechako",{"$nulls":8},"","","",null,0,0,null,null,{"$f":"IF(AB801=\"Y\",COUNT(#REF!), \"\")","v":""},null,"Pinchi Lake","N",54.62715,{"v":-124.404205,"d":"-124.40421"},"http://www.google.com/maps/place/54.62715,-124.404205",8804,"Rural",13,7,"No","Yes","No","No ","Pinchi Lake","FALSE","FALSE"]
[null,8805,{"$f":"HYPERLINK(AE802,AN802)","v":"Pinchi*"},"No","No","No","Bulkley Nechako Regional District","Nechako",{"$nulls":8},{"$f":"IF(L802=\"\",\"\",\nIF(SUM((J802*L802)/M802)<=N802,\"Sufficient Capacity\",\nIF(SUM((J802*L802)/M802)>N802,\"Not Enough Capacity\",\"Error\")))","v":""},{"$f":"IF(OR(ISBLANK(J802),ISBLANK(L802),ISBLANK(M802)), \"\",(J802*L802/M802))","v":""},{"$f":"IF(AND(COUNT(N802,R802)=2, OR($O$10=\"Last-Mile\", $O$10=\"Transport & Last-Mile\")), N802-R802, \"\")","v":""},null,{"$f":"IF(AND(AB802=\"Y\",I802<>\"\"),1,0)","v":0},{"$f":"IF(AND(AB802=\"Y\",I802=\"Last-Mile & Transport\"),1,0)","v":0},null,null,{"$f":"IF(AB802=\"Y\",COUNT(#REF!), \"\")","v":0},null,"Pinchi","Y",{"v":54.570593,"d":"54.57059"},{"v":-124.493298,"d":"-124.49330"},"http://www.google.com/maps/place/54.570593,-124.493298",8805,"Rural First Nations Secondary Reserve",178,79,"No","Yes","No","No ",{"$f":"IF(AB802=\"Y\", CONCATENATE(AA802,\"*\"), AA802)","v":"Pinchi*"},{"$f":"IF(I802=\"Last-Mile\",\"TRUE\",IF(I802=\"Transport & Last-Mile\",\"TRUE\",\"FALSE\"))","v":"FALSE"},{"$f":"IF(I802=\"Transport\",\"TRUE\",IF(I802=\"Transport & Last-Mile\",\"TRUE\",\"FALSE\"))","v":"FALSE"}]
[null,8807,"Mapes","Yes","Yes","Yes","Bulkley Nechako Regional District","Nechako",{"$nulls":8},"","","",null,0,0,null,null,{"$f":"IF(AB803=\"Y\",COUNT(#REF!), \"\")","v":""},null,"Mapes","N",{"v":53.8833,"d":"53.88330"},{"v":-123.866701,"d":"-123.86670"},"http://www.google.com/maps/place/53.8833,-123.866701",8807,"Rural",89,33,"No","Yes","No","No ","Mapes","FALSE","FALSE"]
[null,8808,"Tachie*","No","No","Yes","Bulkley Nechako Regional District","Nechako",{"$nulls":8},"","","",null,0,0,null,null,{"$f":"IF(AB804=\"Y\",COUNT(#REF!), \"\")","v":0},null,"Tachie","Y",{"v":54.654818,"d":"54.65482"},{"v":-124.757885,"d":"-124.75789"},"http://www.google.com/maps/place/54.654818,-124.757885",8808,"Rural First Nations Secondary Reserve",401,114,"No","Yes","No","No ","Tachie*","FALSE","FALSE"]
[null,8810,"Southbank","No","No","Yes","Bulkley Nechako Regional District","Nechako",{"$nulls":8},"","","",null,0,0,null,null,{"$f":"IF(AB805=\"Y\",COUNT(#REF!), \"\")","v":""},null,"Southbank","N",{"v":54.021239,"d":"54.02124"},-125.77075,"http://www.google.com/maps/place/54.021239,-125.77075",8810,"Rural",201,98,"No","Yes","No","No ","Southbank","FALSE","FALSE"]
[null,8811,"Danskin","No","No","Yes","Bulkley Nechako Regional District","Nechako",{"$nulls":8},"","","",null,0,0,null,null,{"$f":"IF(AB806=\"Y\",COUNT(#REF!), \"\")","v":""},null,"Danskin","N",{"v":53.9889,"d":"53.98890"},{"v":-125.7917,"d":"-125.79170"},"http://www.google.com/maps/place/53.9889,-125.7917",8811,"Rural",84,54,"No","Yes","No","No ","Danskin","FALSE","FALSE"]
[null,8812,"Grassy Plains*","No","No","No","Bulkley Nechako Regional District","Nechako",{"$nulls":8},"","","",null,0,0,null,null,{"$f":"IF(AB807=\"Y\",COUNT(#REF!), \"\")","v":0},null,"Grassy Plains","Y",{"v":53.966992,"d":"53.96699"},{"v":-125.888129,"d":"-125.88813"},"http://www.google.com/maps/place/53.966992,-125.888129",8812,"Rural First Nations Secondary Reserve",99,48,"No","Yes","Yes","No ","Grassy Plains*","FALSE","FALSE"]
[null,8813,"François Lake","Yes","Yes","Yes","Bulkley Nechako Regional District","Nechako",{"$nulls":8},"","","",null,0,0,null,null,{"$f":"IF(AB808=\"Y\",COUNT(#REF!), \"\")","v":""},null,"François Lake","N",{"v":54.05,"d":"54.05000"},{"v":-125.75,"d":"-125.75000"},"http://www.google.com/maps/place/54.05,-125.75",8813,"Rural",201,98,"No","Yes","Yes","No ","François Lake","FALSE","FALSE"]
[null,8814,"Tchesinkut Lake","Yes","Yes","Yes","Bulkley Nechako Regional District","Nechako",{"$nulls":8},"","","",null,0,0,null,null,{"$f":"IF(AB809=\"Y\",COUNT(#REF!), \"\")","v":""},null,"Tchesinkut Lake","N",{"v":54.082274,"d":"54.08227"},{"v":-125.737955,"d":"-125.73796"},"http://www.google.com/maps/place/54.082274,-125.737955",8814,"Rural",109,45,"No","Yes","No","No ","Tchesinkut Lake","FALSE","FALSE"]
[null,8815,"Nee-Tahi-Buhn*","Yes","Yes","Yes","Bulkley Nechako Regional District","Nechako",{"$nulls":8},"","","",null,0,0,null,null,{"$f":"IF(AB810=\"Y\",COUNT(#REF!), \"\")","v":0},null,"Nee-Tahi-Buhn","Y",{"v":54.007445,"d":"54.00745"},{"v":-125.956161,"d":"-125.95616"},"http://www.google.com/maps/place/54.007445,-125.956161",8815,"Rural First Nations Secondary Reserve",11,7,"No","Yes","No","No ","Nee-Tahi-Buhn*","FALSE","FALSE"]
[null,8817,"Skin Tyee*","No","No","No","Bulkley Nechako Regional District","Nechako",{"$nulls":8},"","","",null,0,0,null,null,{"$f":"IF(AB811=\"Y\",COUNT(#REF!), \"\")","v":0},null,"Skin Tyee","Y",{"v":53.948561,"d":"53.94856"},{"v":-125.651762,"d":"-125.65176"},"http://www.google.com/maps/place/53.948561,-125.651762",8817,"Rural First Nations Secondary Reserve",47,27,"No","Yes","Yes","No ","Skin Tyee*","FALSE","FALSE"]
[null,8818,"Takysie Lake","No","No","No","Bulkley Nechako Regional District","Nechako",{"$nulls":8},"","","",null,0,0,null,null,{"$f":"IF(AB812=\"Y\",COUNT(#REF!), \"\")","v":""},null,"Takysie Lake","N",{"v":53.883301,"d":"53.88330"},{"v":-125.8667,"d":"-125.86670"},"http://www.google.com/maps/place/53.883301,-125.8667",8818,"Rural",57,27,"No","Yes","Yes","No ","Takysie Lake","FALSE","FALSE"]
[null,8819,"Cheslatta","No","No","No","Bulkley Nechako Regional District","Nechako",{"$nulls":8},"","","",null,0,0,null,null,{"$f":"IF(AB813=\"Y\",COUNT(#REF!), \"\")","v":""},null,"Cheslatta","N",{"v":53.8167,"d":"53.81670"},{"v":-125.8,"d":"-125.80000"},"http://www.google.com/maps/place/53.8167,-125.8",8819,"Rural",6,3,"No","Yes","No","No ","Cheslatta","FALSE","FALSE"]
[null,8820,"Marilla","No","No","No","Bulkley Nechako Regional District","Nechako",{"$nulls":8},"","","",null,0,0,null,null,{"$f":"IF(AB814=\"Y\",COUNT(#REF!), \"\")","v":""},null,"Marilla","N",{"v":53.701279,"d":"53.70128"},{"v":-125.847423,"d":"-125.84742"},"http://www.google.com/maps/place/53.701279,-125.847423",8820,"Rural",4,3,"No","Yes","No","No ","Marilla","FALSE","FALSE"]
[null,8821,"McDonalds Landing","No","No","No","Bulkley Nechako Regional District","Nechako",{"$nulls":8},"","","",null,0,0,null,null,{"$f":"IF(AB815=\"Y\",COUNT(#REF!), \"\")","v":""},null,"McDonalds Landing","N",{"v":54,"d":"54.00000"},{"v":-126.033302,"d":"-126.03330"},"http://www.google.com/maps/place/54,-126.033302",8821,"Rural",14,7,"No","Yes","No","No ","McDonalds Landing","FALSE","FALSE"]
[null,8822,"Noralee","No","No","No","Bulkley Nechako Regional District","Nechako",{"$nulls":8},"","","",null,0,0,null,null,{"$f":"IF(AB816=\"Y\",COUNT(#REF!), \"\")","v":""},null,"Noralee","N",{"v":53.983301,"d":"53.98330"},{"v":-126.4333,"d":"-126.43330"},"http://www.google.com/maps/place/53.983301,-126.4333",8822,"Rural",24,14,"No","Yes","Yes","No ","Noralee","FALSE","FALSE"]
[null,8823,"Tatalrose","No","No","No","Bulkley Nechako Regional District","Nechako",{"$nulls":8},"","","",null,0,0,null,null,{"$f":"IF(AB817=\"Y\",COUNT(#REF!), \"\")","v":""},null,"Tatalrose","N",{"v":53.983299,"d":"53.98330"},{"v":-125.983299,"d":"-125.98330"},"http://www.google.com/maps/place/53.983299,-125.983299",8823,"Rural",14,7,"No","Yes","Yes","No ","Tatalrose","FALSE","FALSE"]
[null,8824,"Ootsa Lake","No","No","No","Bulkley Nechako Regional District","Nechako",{"$nulls":8},"","","",null,0,0,null,null,{"$f":"IF(AB818=\"Y\",COUNT(#REF!), \"\")","v":""},null,"Ootsa Lake","N",53.80677,{"v":-126.041852,"d":"-126.04185"},"http://www.google.com/maps/place/53.80677,-126.041852",8824,"Rural",12,10,"No","Yes","Yes","No ","Ootsa Lake","FALSE","FALSE"]
[null,8825,"Clemretta","No","No","No","Bulkley Nechako Regional District","Nechako",{"$nulls":8},"","","",null,0,0,null,null,{"$f":"IF(AB819=\"Y\",COUNT(#REF!), \"\")","v":""},null,"Clemretta","N",{"v":54.003806,"d":"54.00381"},{"v":-126.284612,"d":"-126.28461"},"http://www.google.com/maps/place/54.003806,-126.284612",8825,"Rural",38,39,"No","Yes","Yes","No ","Clemretta","FALSE","FALSE"]
[null,8826,"Colleymount","No","No","No","Bulkley Nechako Regional District","Nechako",{"$nulls":8},"","","",null,0,0,null,null,{"$f":"IF(AB820=\"Y\",COUNT(#REF!), \"\")","v":""},null,"Colleymount","N",{"v":54.033301,"d":"54.03330"},{"v":-126.149999,"d":"-126.15000"},"http://www.google.com/maps/place/54.033301,-126.149999",8826,"Rural",11,9,"No","Yes","No","No ","Colleymount","FALSE","FALSE"]
[null,8827,"Wistaria","No","No","No","Bulkley Nechako Regional District","Nechako",{"$nulls":8},"","","",null,0,0,null,null,{"$f":"IF(AB821=\"Y\",COUNT(#REF!), \"\")","v":""},null,"Wistaria","N",53.84745,{"v":-126.280082,"d":"-126.28008"},"http://www.google.com/maps/place/53.84745,-126.280082",8827,"Rural",4,4,"No","Yes","Yes","No ","Wistaria","FALSE","FALSE"]
[null,8828,"Skin Tyee*","No","No","No","Bulkley Nechako Regional District","Nechako",{"$nulls":8},"","","",null,0,0,null,null,{"$f":"IF(AB822=\"Y\",COUNT(#REF!), \"\")","v":0},null,"Skin Tyee","Y",{"v":53.987501,"d":"53.98750"},{"v":-126.4875,"d":"-126.48750"},"http://www.google.com/maps/place/53.987501,-126.4875",8828,"Rural First Nations Secondary Reserve",10,6,"No","Yes","Yes","No ","Skin Tyee*","FALSE","FALSE"]
[null,8829,"Nulki*","Yes","Yes","Yes","Bulkley Nechako Regional District","Nechako",{"$nulls":8},"","","",null,0,0,null,null,{"$f":"IF(AB823=\"Y\",COUNT(#REF!), \"\")","v":0},null,"Nulki","Y",{"v":53.918487,"d":"53.91849"},{"v":-124.196575,"d":"-124.19658"},"http://www.google.com/maps/place/53.918487,-124.196575",8829,"Rural First Nations Secondary Reserve",28,13,"No","Yes","Yes","No ","Nulki*","FALSE","FALSE"]
[null,8830,"Weneez","Yes","Yes","Yes","Bulkley Nechako Regional District","Nechako",{"$nulls":8},"","","",null,0,0,null,null,{"$f":"IF(AB824=\"Y\",COUNT(#REF!), \"\")","v":""},null,"Weneez","N",{"v":53.967698,"d":"53.96770"},{"v":-123.980428,"d":"-123.98043"},"http://www.google.com/maps/place/53.967698,-123.980428",8830,"Rural",328,138,"No","Yes","Yes","No ","Weneez","FALSE","FALSE"]
[null,8831,"Sinkut River","Yes","Yes","Yes","Bulkley Nechako Regional District","Nechako",{"$nulls":8},"","","",null,0,0,null,null,{"$f":"IF(AB825=\"Y\",COUNT(#REF!), \"\")","v":""},null,"Sinkut River","N",{"v":53.953797,"d":"53.95380"},{"v":-123.857299,"d":"-123.85730"},"http://www.google.com/maps/place/53.953797,-123.857299",8831,"Rural",168,61,"No","Yes","Yes","No ","Sinkut River","FALSE","FALSE"]
[null,8832,"Isle Pierre","No","No","Yes","Regional District of Fraser-Fort George","Cariboo",{"$nulls":8},"","","",null,0,0,null,null,{"$f":"IF(AB826=\"Y\",COUNT(#REF!), \"\")","v":""},null,"Isle Pierre","N",{"v":53.950001,"d":"53.95000"},{"v":-123.249999,"d":"-123.25000"},"http://www.google.com/maps/place/53.950001,-123.249999",8832,"Rural",54,21,"No","Yes","Yes","No ","Isle Pierre","FALSE","FALSE"]
[null,8833,"Telachick","No","No","Yes","Regional District of Fraser-Fort George","Cariboo",{"$nulls":8},"","","",null,0,0,null,null,{"$f":"IF(AB827=\"Y\",COUNT(#REF!), \"\")","v":""},null,"Telachick","N",{"v":53.862116,"d":"53.86212"},{"v":-123.182321,"d":"-123.18232"},"http://www.google.com/maps/place/53.862116,-123.182321",8833,"Rural",26,9,"No","Yes","Yes","No ","Telachick","FALSE","FALSE"]
[null,8834,"Mud River","No","No","Yes","Regional District of Fraser-Fort George","Cariboo",{"$nulls":8},"","","",null,0,0,null,null,{"$f":"IF(AB828=\"Y\",COUNT(#REF!), \"\")","v":""},null,"Mud River","N",{"v":53.761239,"d":"53.76124"},{"v":-123.011877,"d":"-123.01188"},"http://www.google.com/maps/place/53.761239,-123.011877",8834,"Rural",24,10,"No","Yes","No","No ","Mud River","FALSE","FALSE"]
[null,8835,"Beaverley","Yes","Yes","Yes","Regional District of Fraser-Fort George","Cariboo",{"$nulls":8},"","","",null,0,0,null,null,{"$f":"IF(AB829=\"Y\",COUNT(#REF!), \"\")","v":""},null,"Beaverley","N",{"v":53.817244,"d":"53.81724"},{"v":-122.881338,"d":"-122.88134"},"http://www.google.com/maps/place/53.817244,-122.881338",8835,"Urban",837,309,"Yes","No","No","No ","Beaverley","FALSE","FALSE"]
[null,8836,"Reid Lake","Yes","Yes","Yes","Regional District of Fraser-Fort George","Cariboo",{"$nulls":8},"","","",null,0,0,null,null,{"$f":"IF(AB830=\"Y\",COUNT(#REF!), \"\")","v":""},null,"Reid Lake","N",{"v":53.9667,"d":"53.96670"},{"v":-123.099998,"d":"-123.10000"},"http://www.google.com/maps/place/53.9667,-123.099998",8836,"Rural",95,39,"No","Yes","No","No ","Reid Lake","FALSE","FALSE"]
[null,8837,"Shady Valley","Yes","Yes","Yes","Regional District of Fraser-Fort George","Cariboo",{"$nulls":8},"","","",null,0,0,null,null,{"$f":"IF(AB831=\"Y\",COUNT(#REF!), \"\")","v":""},null,"Shady Valley","N",{"v":53.979329,"d":"53.97933"},{"v":-122.726887,"d":"-122.72689"},"http://www.google.com/maps/place/53.979329,-122.726887",8837,"Rural",3651,1497,"Yes","No","Yes","No ","Shady Valley","FALSE","FALSE"]
[null,8838,"Nak'azdli*","Yes","Yes","No","Bulkley Nechako Regional District","Nechako",{"$nulls":8},"","","",null,0,0,null,null,{"$f":"IF(AB832=\"Y\",COUNT(#REF!), \"\")","v":0},null,"Nak'azdli","Y",{"v":54.420834,"d":"54.42083"},{"v":-124.394444,"d":"-124.39444"},"http://www.google.com/maps/place/54.420834,-124.394444",8838,"Rural First Nations Secondary Reserve",139,63,"No","Yes","No","No ","Nak'azdli*","FALSE","FALSE"]
[null,8839,"Dog Creek","No","No","Yes","Bulkley Nechako Regional District","Nechako",{"$nulls":8},"","","",null,0,0,null,null,{"$f":"IF(AB833=\"Y\",COUNT(#REF!), \"\")","v":""},null,"Dog Creek","N",{"v":54.2833,"d":"54.28330"},{"v":-124.266701,"d":"-124.26670"},"http://www.google.com/maps/place/54.2833,-124.266701",8839,"Rural",53,25,"No","Yes","Yes","No ","Dog Creek","FALSE","FALSE"]
[null,8840,"Middle River*","No","No","No","Bulkley Nechako Regional District","Nechako",{"$nulls":8},"","","",null,0,0,null,null,{"$f":"IF(AB834=\"Y\",COUNT(#REF!), \"\")","v":0},null,"Middle River","Y",{"v":54.876138,"d":"54.87614"},{"v":-125.129788,"d":"-125.12979"},"http://www.google.com/maps/place/54.876138,-125.129788",8840,"Rural First Nations Primary Reserve",10,11,"No","Yes","No","No ","Middle River*","FALSE","FALSE"]
[null,8841,"Donald Landing","No","No","No","Bulkley Nechako Regional District","Nechako",{"$nulls":8},"","","",null,0,0,null,null,{"$f":"IF(AB835=\"Y\",COUNT(#REF!), \"\")","v":""},null,"Donald Landing","N",{"v":54.4833,"d":"54.48330"},{"v":-125.65,"d":"-125.65000"},"http://www.google.com/maps/place/54.4833,-125.65",8841,"Rural",0,1,"No","Yes","Yes","No ","Donald Landing","FALSE","FALSE"]
[null,8842,"Pendleton Bay","No","No","No","Bulkley Nechako Regional District","Nechako",{"$nulls":8},"","","",null,0,0,null,null,{"$f":"IF(AB836=\"Y\",COUNT(#REF!), \"\")","v":""},null,"Pendleton Bay","N",{"v":54.516701,"d":"54.51670"},{"v":-125.716699,"d":"-125.71670"},"http://www.google.com/maps/place/54.516701,-125.716699",8842,"Rural",28,60,"No","Yes","Yes","No ","Pendleton Bay","FALSE","FALSE"]
[null,8843,"Barrett Lake","No","No","Yes","Bulkley Nechako Regional District","Nechako",{"$nulls":8},"","","",null,0,0,null,null,{"$f":"IF(AB837=\"Y\",COUNT(#REF!), \"\")","v":""},null,"Barrett Lake","N",{"v":54.45,"d":"54.45000"},{"v":-126.750001,"d":"-126.75000"},"http://www.google.com/maps/place/54.45,-126.750001",8843,"Rural",47,17,"No","Yes","No","No ","Barrett Lake","FALSE","FALSE"]
[null,8844,"Telkwa","Yes","Yes","Yes","Bulkley Nechako Regional District","Nechako",{"$nulls":8},"","","",null,0,0,null,null,{"$f":"IF(AB838=\"Y\",COUNT(#REF!), \"\")","v":""},null,"Telkwa","N",{"v":54.697199,"d":"54.69720"},{"v":-127.049999,"d":"-127.05000"},"http://www.google.com/maps/place/54.697199,-127.049999",8844,"Rural",906,417,"No","No","No","No ","Telkwa","FALSE","FALSE"]
[null,8845,"Round Lake","No","No","Yes","Bulkley Nechako Regional District","Nechako",{"$nulls":8},"","","",null,0,0,null,null,{"$f":"IF(AB839=\"Y\",COUNT(#REF!), \"\")","v":""},null,"Round Lake","N",{"v":54.664828,"d":"54.66483"},{"v":-126.922589,"d":"-126.92259"},"http://www.google.com/maps/place/54.664828,-126.922589",8845,"Rural",103,45,"No","Yes","No","No ","Round Lake","FALSE","FALSE"]
[null,8846,"Smithers","Yes","Yes","Yes","Bulkley Nechako Regional District","Nechako",{"$nulls":8},"","","",null,0,0,null,null,{"$f":"IF(AB840=\"Y\",COUNT(#REF!), \"\")","v":""},null,"Smithers","N",{"v":54.782456,"d":"54.78246"},-127.16616,"http://www.google.com/maps/place/54.782456,-127.16616",8846,"Rural",4162,1892,"Yes","No","No","No ","Smithers","FALSE","FALSE"]
[null,8849,"New Hazelton","No","Yes","Yes","Regional District of Kitimat-Stikine","North Coast",{"$nulls":8},"","","",null,0,0,null,null,{"$f":"IF(AB841=\"Y\",COUNT(#REF!), \"\")","v":""},null,"New Hazelton","N",{"v":55.246598,"d":"55.24660"},{"v":-127.585767,"d":"-127.58577"},"http://www.google.com/maps/place/55.246598,-127.585767",8849,"Rural",755,383,"No","No","No","No ","New Hazelton","FALSE","FALSE"]
[null,8850,"Two Mile","Yes","Yes","Yes","Regional District of Kitimat-Stikine","North Coast",{"$nulls":8},"","","",null,0,0,null,null,{"$f":"IF(AB842=\"Y\",COUNT(#REF!), \"\")","v":""},null,"Two Mile","N",{"v":55.268663,"d":"55.26866"},{"v":-127.626636,"d":"-127.62664"},"http://www.google.com/maps/place/55.268663,-127.626636",8850,"Rural",345,171,"Yes","No","Yes","No ","Two Mile","FALSE","FALSE"]
[null,8851,"South Hazelton","Yes","Yes","Yes","Regional District of Kitimat-Stikine","North Coast",{"$nulls":8},"","","",null,0,0,null,null,{"$f":"IF(AB843=\"Y\",COUNT(#REF!), \"\")","v":""},null,"South Hazelton","N",{"v":55.237518,"d":"55.23752"},{"v":-127.658701,"d":"-127.65870"},"http://www.google.com/maps/place/55.237518,-127.658701",8851,"Rural",508,258,"No","No","No","No ","South Hazelton","FALSE","FALSE"]
[null,8853,"'Ksan*","Yes","Yes","Yes","Regional District of Kitimat-Stikine","North Coast",{"$nulls":8},"","","",null,0,0,null,null,{"$f":"IF(AB844=\"Y\",COUNT(#REF!), \"\")","v":0},null,"'Ksan","Y",{"v":55.249714,"d":"55.24971"},{"v":-127.678414,"d":"-127.67841"},"http://www.google.com/maps/place/55.249714,-127.678414",8853,"Rural First Nations Primary Reserve",818,317,"Yes","No","Yes","No ","'Ksan*","FALSE","FALSE"]
[null,8859,"Woodcock","No","No","Yes","Regional District of Kitimat-Stikine","North Coast",{"$nulls":8},"","","",null,0,0,null,null,{"$f":"IF(AB845=\"Y\",COUNT(#REF!), \"\")","v":""},null,"Woodcock","N",{"v":55.0667,"d":"55.06670"},{"v":-128.233301,"d":"-128.23330"},"http://www.google.com/maps/place/55.0667,-128.233301",8859,"Rural",5,3,"No","Yes","Yes","No ","Woodcock","FALSE","FALSE"]
[null,8860,"Cedarvale","No","No","No","Regional District of Kitimat-Stikine","North Coast",{"$nulls":8},"","","",null,0,0,null,null,{"$f":"IF(AB846=\"Y\",COUNT(#REF!), \"\")","v":""},null,"Cedarvale","N",{"v":55.0194,"d":"55.01940"},{"v":-128.3292,"d":"-128.32920"},"http://www.google.com/maps/place/55.0194,-128.3292",8860,"Rural",0,0,"No","Yes","Yes","No ","Cedarvale","FALSE","FALSE"]
[null,8861,"Dorreen","No","No","No","Regional District of Kitimat-Stikine","North Coast",{"$nulls":8},"","","",null,0,0,null,null,{"$f":"IF(AB847=\"Y\",COUNT(#REF!), \"\")","v":""},null,"Dorreen","N",{"v":54.838899,"d":"54.83890"},{"v":-128.3458,"d":"-128.34580"},"http://www.google.com/maps/place/54.838899,-128.3458",8861,"Rural",0,0,"No","Yes","No","No ","Dorreen","FALSE","FALSE"]
[null,8862,"Usk","Yes","Yes","Yes","Regional District of Kitimat-Stikine","North Coast",{"$nulls":8},"","","",null,0,0,null,null,{"$f":"IF(AB848=\"Y\",COUNT(#REF!), \"\")","v":""},null,"Usk","N",{"v":54.6333,"d":"54.63330"},{"v":-128.4167,"d":"-128.41670"},"http://www.google.com/maps/place/54.6333,-128.4167",8862,"Rural",433,156,"No","Yes","Yes","No ","Usk","FALSE","FALSE"]
[null,8863,"Kitselas*","No","Yes","Yes","Regional District of Kitimat-Stikine","North Coast",{"$nulls":8},"","","",null,0,0,null,null,{"$f":"IF(AB849=\"Y\",COUNT(#REF!), \"\")","v":0},null,"Kitselas","Y",{"v":54.616699,"d":"54.61670"},{"v":-128.4167,"d":"-128.41670"},"http://www.google.com/maps/place/54.616699,-128.4167",8863,"Rural First Nations Secondary Reserve",433,156,"No","Yes","Yes","No ","Kitselas*","FALSE","FALSE"]
[null,8864,"Terrace","Yes","Yes","Yes","Regional District of Kitimat-Stikine","North Coast",{"$nulls":8},"","","",null,0,0,null,null,{"$f":"IF(AB850=\"Y\",COUNT(#REF!), \"\")","v":""},null,"Terrace","N",{"v":54.523404,"d":"54.52340"},{"v":-128.598449,"d":"-128.59845"},"http://www.google.com/maps/place/54.523404,-128.598449",8864,"Rural",11100,4661,"Yes","No","Yes","No ","Terrace","FALSE","FALSE"]
[null,8866,"Thornhill","Yes","Yes","Yes","Regional District of Kitimat-Stikine","North Coast",{"$nulls":8},"","","",null,0,0,null,null,{"$f":"IF(AB851=\"Y\",COUNT(#REF!), \"\")","v":""},null,"Thornhill","N",{"v":54.512493,"d":"54.51249"},{"v":-128.540495,"d":"-128.54050"},"http://www.google.com/maps/place/54.512493,-128.540495",8866,"Rural",3469,1575,"Yes","No","Yes","No ","Thornhill","FALSE","FALSE"]
[null,8868,"Prince Rupert","Yes","Yes","Yes","North Coast Regional District","North Coast",{"$nulls":8},"","","",null,0,0,null,null,{"$f":"IF(AB852=\"Y\",COUNT(#REF!), \"\")","v":""},null,"Prince Rupert","N",{"v":54.315031,"d":"54.31503"},{"v":-130.315415,"d":"-130.31542"},"http://www.google.com/maps/place/54.315031,-130.315415",8868,"Rural",4046,2001,"Yes","No","Yes","No ","Prince Rupert","FALSE","FALSE"]
[null,8869,"Dodge Cove","Yes","Yes","Yes","North Coast Regional District","North Coast",{"$nulls":8},"","","",null,0,0,null,null,{"$f":"IF(AB853=\"Y\",COUNT(#REF!), \"\")","v":""},null,"Dodge Cove","N",{"v":54.287777,"d":"54.28778"},{"v":-130.387498,"d":"-130.38750"},"http://www.google.com/maps/place/54.287777,-130.387498",8869,"Rural",36,34,"No","Yes","No","No ","Dodge Cove","FALSE","FALSE"]
[null,8870,"Port Edward","Yes","Yes","Yes","North Coast Regional District","North Coast",{"$nulls":8},"","","",null,0,0,null,null,{"$f":"IF(AB854=\"Y\",COUNT(#REF!), \"\")","v":""},null,"Port Edward","N",{"v":54.222428,"d":"54.22243"},{"v":-130.288055,"d":"-130.28806"},"http://www.google.com/maps/place/54.222428,-130.288055",8870,"Rural",463,217,"Yes","No","Yes","No ","Port Edward","FALSE","FALSE"]
[null,8872,"Kemano","No","No","No","Regional District of Kitimat-Stikine","North Coast",{"$nulls":8},"","","",null,0,0,null,null,{"$f":"IF(AB855=\"Y\",COUNT(#REF!), \"\")","v":""},null,"Kemano","N",{"v":53.557253,"d":"53.55725"},{"v":-127.932969,"d":"-127.93297"},"http://www.google.com/maps/place/53.557253,-127.932969",8872,"Rural",null,null,"No","No","Yes","No ","Kemano","FALSE","FALSE"]
[null,8874,"Kitimat","Yes","Yes","Yes","Regional District of Kitimat-Stikine","North Coast",{"$nulls":8},"","","",null,0,0,null,null,{"$f":"IF(AB856=\"Y\",COUNT(#REF!), \"\")","v":""},null,"Kitimat","N",{"v":54.050975,"d":"54.05098"},{"v":-128.650837,"d":"-128.65084"},"http://www.google.com/maps/place/54.050975,-128.650837",8874,"Rural",6436,3393,"Yes","No","Yes","No ","Kitimat","FALSE","FALSE"]
[null,8876,"Lakelse Lake","No","Yes","Yes","Regional District of Kitimat-Stikine","North Coast",{"$nulls":8},"","","",null,0,0,null,null,{"$f":"IF(AB857=\"Y\",COUNT(#REF!), \"\")","v":""},null,"Lakelse Lake","N",{"v":54.380398,"d":"54.38040"},{"v":-128.545743,"d":"-128.54574"},"http://www.google.com/maps/place/54.380398,-128.545743",8876,"Rural",241,240,"No","Yes","Yes","No ","Lakelse Lake","FALSE","FALSE"]
[null,8877,"Remo","Yes","Yes","Yes","Regional District of Kitimat-Stikine","North Coast",{"$nulls":8},"","","",null,0,0,null,null,{"$f":"IF(AB858=\"Y\",COUNT(#REF!), \"\")","v":""},null,"Remo","N",{"v":54.500695,"d":"54.50070"},{"v":-128.718544,"d":"-128.71854"},"http://www.google.com/maps/place/54.500695,-128.718544",8877,"Rural",160,78,"No","No","No","No ","Remo","FALSE","FALSE"]
[null,8878,"Osland","No","No","No","North Coast Regional District","North Coast",{"$nulls":8},"","","",null,0,0,null,null,{"$f":"IF(AB859=\"Y\",COUNT(#REF!), \"\")","v":""},null,"Osland","N",{"v":54.137204,"d":"54.13720"},{"v":-130.160619,"d":"-130.16062"},"http://www.google.com/maps/place/54.137204,-130.160619",8878,"Rural",10,18,"No","Yes","Yes","No ","Osland","FALSE","FALSE"]
[null,8880,"Oona River","No","No","Yes","North Coast Regional District","North Coast",{"$nulls":8},"","","",null,0,0,null,null,{"$f":"IF(AB860=\"Y\",COUNT(#REF!), \"\")","v":""},null,"Oona River","N",{"v":53.946875,"d":"53.94688"},{"v":-130.255822,"d":"-130.25582"},"http://www.google.com/maps/place/53.946875,-130.255822",8880,"Rural",10,18,"No","Yes","Yes","No ","Oona River","FALSE","FALSE"]
[null,8881,"Hunts Inlet","No","No","Yes","North Coast Regional District","North Coast",{"$nulls":8},"","","",null,0,0,null,null,{"$f":"IF(AB861=\"Y\",COUNT(#REF!), \"\")","v":""},null,"Hunts Inlet","N",{"v":54.066837,"d":"54.06684"},{"v":-130.443473,"d":"-130.44347"},"http://www.google.com/maps/place/54.066837,-130.443473",8881,"Rural",10,18,"No","Yes","No","No ","Hunts Inlet","FALSE","FALSE"]
[null,8882,"Porcher Island","No","No","Yes","North Coast Regional District","North Coast",{"$nulls":8},"","","",null,0,0,null,null,{"$f":"IF(AB862=\"Y\",COUNT(#REF!), \"\")","v":""},null,"Porcher Island","N",{"v":54.086718,"d":"54.08672"},{"v":-130.392354,"d":"-130.39235"},"http://www.google.com/maps/place/54.086718,-130.392354",8882,"Rural",10,18,"No","Yes","No","No ","Porcher Island","FALSE","FALSE"]
[null,8883,"Butedale","No","No","No","Regional District of Kitimat-Stikine","North Coast",{"$nulls":8},"","","",null,0,0,null,null,{"$f":"IF(AB863=\"Y\",COUNT(#REF!), \"\")","v":""},null,"Butedale","N",{"v":53.15,"d":"53.15000"},{"v":-128.699999,"d":"-128.70000"},"http://www.google.com/maps/place/53.15,-128.699999",8883,"Rural",5,2,"No","Yes","Yes","No ","Butedale","FALSE","FALSE"]
[null,8884,"Weewanie","No","No","No","Regional District of Kitimat-Stikine","North Coast",{"$nulls":8},"","","",null,0,0,null,null,{"$f":"IF(AB864=\"Y\",COUNT(#REF!), \"\")","v":""},null,"Weewanie","N",{"v":53.691666,"d":"53.69167"},{"v":-128.790277,"d":"-128.79028"},"http://www.google.com/maps/place/53.691666,-128.790277",8884,"Rural",null,null,"No","No","Yes","No ","Weewanie","FALSE","FALSE"]
[null,8885,"Kildala Arm","No","No","No","Regional District of Kitimat-Stikine","North Coast",{"$nulls":8},"","","",null,0,0,null,null,{"$f":"IF(AB865=\"Y\",COUNT(#REF!), \"\")","v":""},null,"Kildala Arm","N",{"v":53.8333,"d":"53.83330"},{"v":-128.483301,"d":"-128.48330"},"http://www.google.com/maps/place/53.8333,-128.483301",8885,"Rural",null,null,"No","No","Yes","No ","Kildala Arm","FALSE","FALSE"]
[null,8886,{"$f":"HYPERLINK(AE866,AN866)","v":"Rosswood"},"No","No","No","Regional District of Kitimat-Stikine","North Coast",{"$nulls":8},{"$f":"IF(L866=\"\",\"\",\nIF(SUM((J866*L866)/M866)<=N866,\"Sufficient Capacity\",\nIF(SUM((J866*L866)/M866)>N866,\"Not Enough Capacity\",\"Error\")))","v":""},{"$f":"IF(OR(ISBLANK(J866),ISBLANK(L866),ISBLANK(M866)), \"\",(J866*L866/M866))","v":""},{"$f":"IF(AND(COUNT(N866,R866)=2, OR($O$10=\"Last-Mile\", $O$10=\"Transport & Last-Mile\")), N866-R866, \"\")","v":""},null,{"$f":"IF(AND(AB866=\"Y\",I866<>\"\"),1,0)","v":0},{"$f":"IF(AND(AB866=\"Y\",I866=\"Last-Mile & Transport\"),1,0)","v":0},null,null,{"$f":"IF(AB866=\"Y\",COUNT(#REF!), \"\")","v":""},null,"Rosswood","N",{"v":54.8,"d":"54.80000"},{"v":-128.7667,"d":"-128.76670"},"http://www.google.com/maps/place/54.8,-128.7667",8886,"Rural",6,3,"No","Yes","Yes","No ",{"$f":"IF(AB866=\"Y\", CONCATENATE(AA866,\"*\"), AA866)","v":"Rosswood"},{"$f":"IF(I866=\"Last-Mile\",\"TRUE\",IF(I866=\"Transport & Last-Mile\",\"TRUE\",\"FALSE\"))","v":"FALSE"},{"$f":"IF(I866=\"Transport\",\"TRUE\",IF(I866=\"Transport & Last-Mile\",\"TRUE\",\"FALSE\"))","v":"FALSE"}]
[null,8891,"Nass Camp","No","No","No","Regional District of Kitimat-Stikine","North Coast",{"$nulls":8},"","","",null,0,0,null,null,{"$f":"IF(AB867=\"Y\",COUNT(#REF!), \"\")","v":""},null,"Nass Camp","N",{"v":55.288422,"d":"55.28842"},{"v":-129.005623,"d":"-129.00562"},"http://www.google.com/maps/place/55.288422,-129.005623",8891,"Rural",13,10,"No","Yes","No","No ","Nass Camp","FALSE","FALSE"]
[null,8892,"Cranberry Junction","No","No","No","Regional District of Kitimat-Stikine","North Coast",{"$nulls":8},"","","",null,0,0,null,null,{"$f":"IF(AB868=\"Y\",COUNT(#REF!), \"\")","v":""},null,"Cranberry Junction","N",{"v":55.5667,"d":"55.56670"},{"v":-128.599999,"d":"-128.60000"},"http://www.google.com/maps/place/55.5667,-128.599999",8892,"Rural",null,null,"No","No","No","No ","Cranberry Junction","FALSE","FALSE"]
[null,8893,"Kitsault","No","No","No","Regional District of Kitimat-Stikine","North Coast",{"$nulls":8},"","","",null,0,0,null,null,{"$f":"IF(AB869=\"Y\",COUNT(#REF!), \"\")","v":""},null,"Kitsault","N",{"v":55.455756,"d":"55.45576"},{"v":-129.470551,"d":"-129.47055"},"http://www.google.com/maps/place/55.455756,-129.470551",8893,"Rural",0,0,"No","Yes","Yes","No ","Kitsault","FALSE","FALSE"]
[null,8894,"Alice Arm","No","No","No","Regional District of Kitimat-Stikine","North Coast",{"$nulls":8},"","","",null,0,0,null,null,{"$f":"IF(AB870=\"Y\",COUNT(#REF!), \"\")","v":""},null,"Alice Arm","N",{"v":55.482822,"d":"55.48282"},{"v":-129.4899691,"d":"-129.48997"},"http://www.google.com/maps/place/55.482822,-129.4899691",8894,"Rural",0,0,"No","Yes","No","No ","Alice Arm","FALSE","FALSE"]
[null,8895,"Stewart","No","No","Yes","Regional District of Kitimat-Stikine","North Coast",{"$nulls":8},"","","",null,0,0,null,null,{"$f":"IF(AB871=\"Y\",COUNT(#REF!), \"\")","v":""},null,"Stewart","N",{"v":55.941823,"d":"55.94182"},{"v":-129.983772,"d":"-129.98377"},"http://www.google.com/maps/place/55.941823,-129.983772",8895,"Rural",376,275,"No","Yes","No","No ","Stewart","FALSE","FALSE"]
[null,8896,"Meziadin Junction","No","No","No","Regional District of Kitimat-Stikine","North Coast",{"$nulls":8},"","","",null,0,0,null,null,{"$f":"IF(AB872=\"Y\",COUNT(#REF!), \"\")","v":""},null,"Meziadin Junction","N",{"v":56.099674,"d":"56.09967"},{"v":-129.304736,"d":"-129.30474"},"http://www.google.com/maps/place/56.099674,-129.304736",8896,"Rural",null,null,"No","No","No","No ","Meziadin Junction","FALSE","FALSE"]
[null,8897,"Bob Quinn Lake","No","No","No","Regional District of Kitimat-Stikine","North Coast",{"$nulls":8},"","","",null,0,0,null,null,{"$f":"IF(AB873=\"Y\",COUNT(#REF!), \"\")","v":""},null,"Bob Quinn Lake","N",{"v":56.9722,"d":"56.97220"},{"v":-130.2472,"d":"-130.24720"},"http://www.google.com/maps/place/56.9722,-130.2472",8897,"Remote Community",2,1,"No","Yes","Yes","No ","Bob Quinn Lake","FALSE","FALSE"]
[null,8898,"Bell II","No","No","No","Regional District of Kitimat-Stikine","North Coast",{"$nulls":8},"","","",null,0,0,null,null,{"$f":"IF(AB874=\"Y\",COUNT(#REF!), \"\")","v":""},null,"Bell II","N",{"v":56.744444,"d":"56.74444"},{"v":-129.794443,"d":"-129.79444"},"http://www.google.com/maps/place/56.744444,-129.794443",8898,"Rural",null,null,"No","No","No","No ","Bell II","FALSE","FALSE"]
[null,8901,"Germansen Landing","No","No","No","Bulkley Nechako Regional District","Nechako",{"$nulls":8},"","","",null,0,0,null,null,{"$f":"IF(AB875=\"Y\",COUNT(#REF!), \"\")","v":""},null,"Germansen Landing","N",{"v":55.7833,"d":"55.78330"},{"v":-124.699999,"d":"-124.70000"},"http://www.google.com/maps/place/55.7833,-124.699999",8901,"Rural",29,24,"No","Yes","No","No ","Germansen Landing","FALSE","FALSE"]
[null,8902,"Manson Creek","No","No","No","Bulkley Nechako Regional District","Nechako",{"$nulls":8},"","","",null,0,0,null,null,{"$f":"IF(AB876=\"Y\",COUNT(#REF!), \"\")","v":""},null,"Manson Creek","N",{"v":55.6667,"d":"55.66670"},{"v":-124.4833,"d":"-124.48330"},"http://www.google.com/maps/place/55.6667,-124.4833",8902,"Rural",29,24,"No","Yes","No","No ","Manson Creek","FALSE","FALSE"]
[null,8903,"Bulkley House","No","No","No","Bulkley Nechako Regional District","Nechako",{"$nulls":8},"","","",null,0,0,null,null,{"$f":"IF(AB877=\"Y\",COUNT(#REF!), \"\")","v":""},null,"Bulkley House","N",{"v":55.70908611,"d":"55.70909"},{"v":-126.2301222,"d":"-126.23012"},"http://www.google.com/maps/place/55.70908611,-126.2301222",8903,"Rural",null,null,"No","No","No","No ","Bulkley House","FALSE","FALSE"]
[null,8904,"Bear Lake","No","Yes","Yes","Stikine Regional District (Unincorporated)","Nechako",{"$nulls":8},"","","",null,0,0,null,null,{"$f":"IF(AB878=\"Y\",COUNT(#REF!), \"\")","v":""},null,"Bear Lake","N",{"v":56.2,"d":"56.20000"},{"v":-126.85,"d":"-126.85000"},"http://www.google.com/maps/place/56.2,-126.85",8904,"Rural",157,98,"No","Yes","No","No ","Bear Lake","FALSE","FALSE"]
[null,8905,"Anzac","No","No","No","Regional District of Fraser-Fort George","Cariboo",{"$nulls":8},"","","",null,0,0,null,null,{"$f":"IF(AB879=\"Y\",COUNT(#REF!), \"\")","v":""},null,"Anzac","N",{"v":54.7667,"d":"54.76670"},{"v":-122.499999,"d":"-122.50000"},"http://www.google.com/maps/place/54.7667,-122.499999",8905,"Rural",0,0,"No","Yes","No","No ","Anzac","FALSE","FALSE"]
[null,8907,"Chetwynd","No","Yes","Yes","Peace River Regional District","Northeast",{"$nulls":8},"","","",null,0,0,null,null,{"$f":"IF(AB880=\"Y\",COUNT(#REF!), \"\")","v":""},null,"Chetwynd","N",{"v":55.694899,"d":"55.69490"},{"v":-121.619167,"d":"-121.61917"},"http://www.google.com/maps/place/55.694899,-121.619167",8907,"Rural",2394,1188,"No","Yes","Yes","No ","Chetwynd","FALSE","FALSE"]
[null,8908,"Pine Valley","No","No","Yes","Peace River Regional District","Northeast",{"$nulls":8},"","","",null,0,0,null,null,{"$f":"IF(AB881=\"Y\",COUNT(#REF!), \"\")","v":""},null,"Pine Valley","N",{"v":55.636062,"d":"55.63606"},{"v":-122.114868,"d":"-122.11487"},"http://www.google.com/maps/place/55.636062,-122.114868",8908,"Rural",2,1,"No","Yes","No","No ","Pine Valley","FALSE","FALSE"]
[null,8909,"Powder King","No","No","No","Regional District of Fraser-Fort George","Cariboo",{"$nulls":8},"","","",null,0,0,null,null,{"$f":"IF(AB882=\"Y\",COUNT(#REF!), \"\")","v":""},null,"Powder King","N",{"v":55.350502,"d":"55.35050"},{"v":-122.614545,"d":"-122.61455"},"http://www.google.com/maps/place/55.350502,-122.614545",8909,"Rural",0,0,"No","Yes","Yes","No ","Powder King","FALSE","FALSE"]
[null,8910,"Hasler Flat","No","No","Yes","Peace River Regional District","Northeast",{"$nulls":8},"","","",null,0,0,null,null,{"$f":"IF(AB883=\"Y\",COUNT(#REF!), \"\")","v":""},null,"Hasler Flat","N",{"v":55.611099,"d":"55.61110"},{"v":-121.966949,"d":"-121.96695"},"http://www.google.com/maps/place/55.611099,-121.966949",8910,"Rural",80,37,"No","Yes","No","No ","Hasler Flat","FALSE","FALSE"]
[null,8911,"Lemoray","No","No","Yes","Peace River Regional District","Northeast",{"$nulls":8},"","","",null,0,0,null,null,{"$f":"IF(AB884=\"Y\",COUNT(#REF!), \"\")","v":""},null,"Lemoray","N",{"v":55.5389,"d":"55.53890"},{"v":-122.4833,"d":"-122.48330"},"http://www.google.com/maps/place/55.5389,-122.4833",8911,"Rural",2,2,"No","Yes","Yes","No ","Lemoray","FALSE","FALSE"]
[null,8912,"Dokie Siding","No","Yes","Yes","Peace River Regional District","Northeast",{"$nulls":8},"","","",null,0,0,null,null,{"$f":"IF(AB885=\"Y\",COUNT(#REF!), \"\")","v":""},null,"Dokie Siding","N",{"v":55.662477,"d":"55.66248"},{"v":-121.734267,"d":"-121.73427"},"http://www.google.com/maps/place/55.662477,-121.734267",8912,"Rural",402,206,"No","Yes","Yes","No ","Dokie Siding","FALSE","FALSE"]
[null,8913,"Wabi Hill","No","Yes","Yes","Peace River Regional District","Northeast",{"$nulls":8},"","","",null,0,0,null,null,{"$f":"IF(AB886=\"Y\",COUNT(#REF!), \"\")","v":""},null,"Wabi Hill","N",55.67069,{"v":-121.532394,"d":"-121.53239"},"http://www.google.com/maps/place/55.67069,-121.532394",8913,"Rural",345,128,"No","Yes","No","No ","Wabi Hill","FALSE","FALSE"]
[null,8914,"Twidwell Bend","No","No","Yes","Peace River Regional District","Northeast",{"$nulls":8},"","","",null,0,0,null,null,{"$f":"IF(AB887=\"Y\",COUNT(#REF!), \"\")","v":""},null,"Twidwell Bend","N",{"v":55.615495,"d":"55.61550"},{"v":-121.571497,"d":"-121.57150"},"http://www.google.com/maps/place/55.615495,-121.571497",8914,"Rural",21,8,"No","Yes","Yes","No ","Twidwell Bend","FALSE","FALSE"]
[null,8915,"East Pine","No","Yes","Yes","Peace River Regional District","Northeast",{"$nulls":8},"","","",null,0,0,null,null,{"$f":"IF(AB888=\"Y\",COUNT(#REF!), \"\")","v":""},null,"East Pine","N",{"v":55.716699,"d":"55.71670"},{"v":-121.216701,"d":"-121.21670"},"http://www.google.com/maps/place/55.716699,-121.216701",8915,"Rural",44,23,"No","Yes","No","No ","East Pine","FALSE","FALSE"]
[null,8916,"Arras","No","Yes","Yes","Peace River Regional District","Northeast",{"$nulls":8},"","","",null,0,0,null,null,{"$f":"IF(AB889=\"Y\",COUNT(#REF!), \"\")","v":""},null,"Arras","N",{"v":55.753519,"d":"55.75352"},{"v":-120.525783,"d":"-120.52578"},"http://www.google.com/maps/place/55.753519,-120.525783",8916,"Rural",199,71,"No","Yes","No","No ","Arras","FALSE","FALSE"]
[null,8917,"Groundbirch","No","No","Yes","Peace River Regional District","Northeast",{"$nulls":8},"","","",null,0,0,null,null,{"$f":"IF(AB890=\"Y\",COUNT(#REF!), \"\")","v":""},null,"Groundbirch","N",{"v":55.779964,"d":"55.77996"},{"v":-120.923326,"d":"-120.92333"},"http://www.google.com/maps/place/55.779964,-120.923326",8917,"Rural",45,23,"No","Yes","Yes","No ","Groundbirch","FALSE","FALSE"]
[null,8918,"Sunset Prairie","No","Yes","Yes","Peace River Regional District","Northeast",{"$nulls":8},"","","",null,0,0,null,null,{"$f":"IF(AB891=\"Y\",COUNT(#REF!), \"\")","v":""},null,"Sunset Prairie","N",{"v":55.839743,"d":"55.83974"},{"v":-120.763988,"d":"-120.76399"},"http://www.google.com/maps/place/55.839743,-120.763988",8918,"Rural",28,16,"No","Yes","Yes","No ","Sunset Prairie","FALSE","FALSE"]
[null,8919,"Progress","No","Yes","Yes","Peace River Regional District","Northeast",{"$nulls":8},"","","",null,0,0,null,null,{"$f":"IF(AB892=\"Y\",COUNT(#REF!), \"\")","v":""},null,"Progress","N",{"v":55.781707,"d":"55.78171"},{"v":-120.716192,"d":"-120.71619"},"http://www.google.com/maps/place/55.781707,-120.716192",8919,"Rural",73,29,"No","No","Yes","No ","Progress","FALSE","FALSE"]
[null,8920,"Willow Valley","No","No","Yes","Peace River Regional District","Northeast",{"$nulls":8},"","","",null,0,0,null,null,{"$f":"IF(AB893=\"Y\",COUNT(#REF!), \"\")","v":""},null,"Willow Valley","N",{"v":55.856302,"d":"55.85630"},{"v":-120.871525,"d":"-120.87153"},"http://www.google.com/maps/place/55.856302,-120.871525",8920,"Rural",26,16,"No","Yes","Yes","No ","Willow Valley","FALSE","FALSE"]
[null,8922,"Moberly Lake","No","No","Yes","Peace River Regional District","Northeast",{"$nulls":8},"","","",null,0,0,null,null,{"$f":"IF(AB894=\"Y\",COUNT(#REF!), \"\")","v":""},null,"Moberly Lake","N",{"v":55.833345,"d":"55.83335"},{"v":-121.758464,"d":"-121.75846"},"http://www.google.com/maps/place/55.833345,-121.758464",8922,"Rural",102,88,"No","Yes","No","No ","Moberly Lake","FALSE","FALSE"]
[null,8924,"Hudson's Hope","Yes","Yes","Yes","Peace River Regional District","Northeast",{"$nulls":8},"","","",null,0,0,null,null,{"$f":"IF(AB895=\"Y\",COUNT(#REF!), \"\")","v":""},null,"Hudson's Hope","N",{"v":56.031944,"d":"56.03194"},{"v":-121.906943,"d":"-121.90694"},"http://www.google.com/maps/place/56.031944,-121.906943",8924,"Rural",464,257,"Yes","No","No","No ","Hudson's Hope","FALSE","FALSE"]
[null,8925,"Attachie","No","No","Yes","Peace River Regional District","Northeast",{"$nulls":8},"","","",null,0,0,null,null,{"$f":"IF(AB896=\"Y\",COUNT(#REF!), \"\")","v":""},null,"Attachie","N",{"v":56.220478,"d":"56.22048"},{"v":-121.423331,"d":"-121.42333"},"http://www.google.com/maps/place/56.220478,-121.423331",8925,"Rural",5,2,"No","Yes","No","No ","Attachie","FALSE","FALSE"]
[null,8926,"Bear Flat","No","No","Yes","Peace River Regional District","Northeast",{"$nulls":8},"","","",null,0,0,null,null,{"$f":"IF(AB897=\"Y\",COUNT(#REF!), \"\")","v":""},null,"Bear Flat","N",{"v":56.274046,"d":"56.27405"},{"v":-121.230744,"d":"-121.23074"},"http://www.google.com/maps/place/56.274046,-121.230744",8926,"Rural",3,1,"No","Yes","No","No ","Bear Flat","FALSE","FALSE"]
[null,8927,"Farrell Creek","No","No","Yes","Peace River Regional District","Northeast",{"$nulls":8},"","","",null,0,0,null,null,{"$f":"IF(AB898=\"Y\",COUNT(#REF!), \"\")","v":""},null,"Farrell Creek","N",{"v":56.122756,"d":"56.12276"},{"v":-121.737926,"d":"-121.73793"},"http://www.google.com/maps/place/56.122756,-121.737926",8927,"Rural",4,2,"No","Yes","No","No ","Farrell Creek","FALSE","FALSE"]
[null,8928,"Mile 62 1/2","No","No","Yes","Peace River Regional District","Northeast",{"$nulls":8},"","","",null,0,0,null,null,{"$f":"IF(AB899=\"Y\",COUNT(#REF!), \"\")","v":""},null,"Mile 62 1/2","N",{"v":56.408379,"d":"56.40838"},{"v":-121.157301,"d":"-121.15730"},"http://www.google.com/maps/place/56.408379,-121.157301",8928,"Rural",185,71,"No","Yes","No","No ","Mile 62 1/2","FALSE","FALSE"]
[null,8929,"Charlie Lake","Yes","Yes","Yes","Peace River Regional District","Northeast",{"$nulls":8},"","","",null,0,0,null,null,{"$f":"IF(AB900=\"Y\",COUNT(#REF!), \"\")","v":""},null,"Charlie Lake","N",{"v":56.297401,"d":"56.29740"},{"v":-120.985399,"d":"-120.98540"},"http://www.google.com/maps/place/56.297401,-120.985399",8929,"Rural",1138,448,"Yes","No","No","No ","Charlie Lake","FALSE","FALSE"]
[null,8930,"Clairmont","Yes","Yes","Yes","Peace River Regional District","Northeast",{"$nulls":8},"","","",null,0,0,null,null,{"$f":"IF(AB901=\"Y\",COUNT(#REF!), \"\")","v":""},null,"Clairmont","N",{"v":56.255928,"d":"56.25593"},{"v":-120.899884,"d":"-120.89988"},"http://www.google.com/maps/place/56.255928,-120.899884",8930,"Rural",6893,3566,"Yes","No","No","No ","Clairmont","FALSE","FALSE"]
[null,8931,"Fort St. John","Yes","Yes","Yes","Peace River Regional District","Northeast",{"$nulls":8},"","","",null,0,0,null,null,{"$f":"IF(AB902=\"Y\",COUNT(#REF!), \"\")","v":""},null,"Fort St. John","N",{"v":56.246052,"d":"56.24605"},{"v":-120.844596,"d":"-120.84460"},"http://www.google.com/maps/place/56.246052,-120.844596",8931,"Rural",6893,3566,"Yes","No","Yes","No ","Fort St. John","FALSE","FALSE"]
[null,8932,"Grand Haven","Yes","Yes","Yes","Peace River Regional District","Northeast",{"$nulls":8},"","","",null,0,0,null,null,{"$f":"IF(AB903=\"Y\",COUNT(#REF!), \"\")","v":""},null,"Grand Haven","N",{"v":56.240206,"d":"56.24021"},{"v":-120.898661,"d":"-120.89866"},"http://www.google.com/maps/place/56.240206,-120.898661",8932,"Rural",6893,3566,"Yes","No","Yes","No ","Grand Haven","FALSE","FALSE"]
[null,8933,"Old Fort","Yes","Yes","Yes","Peace River Regional District","Northeast",{"$nulls":8},"","","",null,0,0,null,null,{"$f":"IF(AB904=\"Y\",COUNT(#REF!), \"\")","v":""},null,"Old Fort","N",{"v":56.202176,"d":"56.20218"},-120.82327,"http://www.google.com/maps/place/56.202176,-120.82327",8933,"Rural",8797,4393,"Yes","No","Yes","No ","Old Fort","FALSE","FALSE"]
[null,8934,"Charlie Lake part B","Yes","Yes","Yes","Peace River Regional District","Northeast",{"$nulls":8},"","","",null,0,0,null,null,{"$f":"IF(AB905=\"Y\",COUNT(#REF!), \"\")","v":""},null,"Charlie Lake part B","N",{"v":56.336792,"d":"56.33679"},{"v":-121.009291,"d":"-121.00929"},"http://www.google.com/maps/place/56.336792,-121.009291",8934,"Rural",1138,448,"Yes","No","Yes","No ","Charlie Lake part B","FALSE","FALSE"]
[null,8935,"South Taylor","No","Yes","Yes","Peace River Regional District","Northeast",{"$nulls":8},"","","",null,0,0,null,null,{"$f":"IF(AB906=\"Y\",COUNT(#REF!), \"\")","v":""},null,"South Taylor","N",{"v":56.106812,"d":"56.10681"},{"v":-120.633736,"d":"-120.63374"},"http://www.google.com/maps/place/56.106812,-120.633736",8935,"Rural",179,47,"No","Yes","Yes","No ","South Taylor","FALSE","FALSE"]
[null,8936,"Taylor","Yes","Yes","Yes","Peace River Regional District","Northeast",{"$nulls":8},"","","",null,0,0,null,null,{"$f":"IF(AB907=\"Y\",COUNT(#REF!), \"\")","v":""},null,"Taylor","N",{"v":56.154368,"d":"56.15437"},{"v":-120.679864,"d":"-120.67986"},"http://www.google.com/maps/place/56.154368,-120.679864",8936,"Rural",1499,608,"Yes","No","Yes","No ","Taylor","FALSE","FALSE"]
[null,8937,"Farmington","No","Yes","Yes","Peace River Regional District","Northeast",{"$nulls":8},"","","",null,0,0,null,null,{"$f":"IF(AB908=\"Y\",COUNT(#REF!), \"\")","v":""},null,"Farmington","N",{"v":55.900001,"d":"55.90000"},{"v":-120.499999,"d":"-120.50000"},"http://www.google.com/maps/place/55.900001,-120.499999",8937,"Rural",54,21,"No","Yes","No","No ","Farmington","FALSE","FALSE"]
[null,8938,"Dawson Creek","Yes","Yes","Yes","Peace River Regional District","Northeast",{"$nulls":8},"","","",null,0,0,null,null,{"$f":"IF(AB909=\"Y\",COUNT(#REF!), \"\")","v":""},null,"Dawson Creek","N",{"v":55.759514,"d":"55.75951"},{"v":-120.234544,"d":"-120.23454"},"http://www.google.com/maps/place/55.759514,-120.234544",8938,"Rural",6226,3256,"Yes","No","Yes","No ","Dawson Creek","FALSE","FALSE"]
[null,8939,"Rolla","No","No","Yes","Peace River Regional District","Northeast",{"$nulls":8},"","","",null,0,0,null,null,{"$f":"IF(AB910=\"Y\",COUNT(#REF!), \"\")","v":""},null,"Rolla","N",55.89861,{"v":-120.142591,"d":"-120.14259"},"http://www.google.com/maps/place/55.89861,-120.142591",8939,"Rural",136,62,"No","Yes","Yes","No ","Rolla","FALSE","FALSE"]
[null,8940,"Tower Lake","No","No","Yes","Peace River Regional District","Northeast",{"$nulls":8},"","","",null,0,0,null,null,{"$f":"IF(AB911=\"Y\",COUNT(#REF!), \"\")","v":""},null,"Tower Lake","N",{"v":56.015487,"d":"56.01549"},{"v":-120.561331,"d":"-120.56133"},"http://www.google.com/maps/place/56.015487,-120.561331",8940,"Rural",28,11,"No","Yes","No","No ","Tower Lake","FALSE","FALSE"]
[null,8941,"Kilkerran","No","Yes","Yes","Peace River Regional District","Northeast",{"$nulls":8},"","","",null,0,0,null,null,{"$f":"IF(AB912=\"Y\",COUNT(#REF!), \"\")","v":""},null,"Kilkerran","N",{"v":55.839514,"d":"55.83951"},{"v":-120.271564,"d":"-120.27156"},"http://www.google.com/maps/place/55.839514,-120.271564",8941,"Rural",34,12,"No","Yes","Yes","No ","Kilkerran","FALSE","FALSE"]
[null,8942,"Bessborough","No","Yes","Yes","Peace River Regional District","Northeast",{"$nulls":8},"","","",null,0,0,null,null,{"$f":"IF(AB913=\"Y\",COUNT(#REF!), \"\")","v":""},null,"Bessborough","N",{"v":55.810857,"d":"55.81086"},{"v":-120.506356,"d":"-120.50636"},"http://www.google.com/maps/place/55.810857,-120.506356",8942,"Rural",37,17,"No","Yes","No","No ","Bessborough","FALSE","FALSE"]
[null,8943,"Seven Mile Corner","No","No","Yes","Peace River Regional District","Northeast",{"$nulls":8},"","","",null,0,0,null,null,{"$f":"IF(AB914=\"Y\",COUNT(#REF!), \"\")","v":""},null,"Seven Mile Corner","N",{"v":55.897555,"d":"55.89756"},-120.32426,"http://www.google.com/maps/place/55.897555,-120.32426",8943,"Rural",26,12,"No","Yes","No","No ","Seven Mile Corner","FALSE","FALSE"]
[null,8944,"Clayhurst","No","No","Yes","Peace River Regional District","Northeast",{"$nulls":8},"","","",null,0,0,null,null,{"$f":"IF(AB915=\"Y\",COUNT(#REF!), \"\")","v":""},null,"Clayhurst","N",{"v":56.186796,"d":"56.18680"},{"v":-120.030465,"d":"-120.03047"},"http://www.google.com/maps/place/56.186796,-120.030465",8944,"Rural",28,10,"No","Yes","No","No ","Clayhurst","FALSE","FALSE"]
[null,8945,"Goodlow","No","No","Yes","Peace River Regional District","Northeast",{"$nulls":8},"","","",null,0,0,null,null,{"$f":"IF(AB916=\"Y\",COUNT(#REF!), \"\")","v":""},null,"Goodlow","N",{"v":56.333645,"d":"56.33365"},{"v":-120.136478,"d":"-120.13648"},"http://www.google.com/maps/place/56.333645,-120.136478",8945,"Rural",28,12,"No","Yes","No","No ","Goodlow","FALSE","FALSE"]
[null,8946,"Cecil Lake","No","Yes","Yes","Peace River Regional District","Northeast",{"$nulls":8},"","","",null,0,0,null,null,{"$f":"IF(AB917=\"Y\",COUNT(#REF!), \"\")","v":""},null,"Cecil Lake","N",{"v":56.305961,"d":"56.30596"},{"v":-120.576751,"d":"-120.57675"},"http://www.google.com/maps/place/56.305961,-120.576751",8946,"Rural",44,15,"No","Yes","No","No ","Cecil Lake","FALSE","FALSE"]
[null,8948,"Montney","No","Yes","Yes","Peace River Regional District","Northeast",{"$nulls":8},"","","",null,0,0,null,null,{"$f":"IF(AB918=\"Y\",COUNT(#REF!), \"\")","v":""},null,"Montney","N",{"v":56.450304,"d":"56.45030"},{"v":-120.926493,"d":"-120.92649"},"http://www.google.com/maps/place/56.450304,-120.926493",8948,"Rural",165,49,"No","Yes","No","No ","Montney","FALSE","FALSE"]
[null,8949,"Rose Prairie","No","Yes","Yes","Peace River Regional District","Northeast",{"$nulls":8},"","","",null,0,0,null,null,{"$f":"IF(AB919=\"Y\",COUNT(#REF!), \"\")","v":""},null,"Rose Prairie","N",56.50867,{"v":-120.783026,"d":"-120.78303"},"http://www.google.com/maps/place/56.50867,-120.783026",8949,"Rural",40,16,"No","Yes","Yes","No ","Rose Prairie","FALSE","FALSE"]
[null,8950,"Osborn","No","No","Yes","Peace River Regional District","Northeast",{"$nulls":8},"","","",null,0,0,null,null,{"$f":"IF(AB920=\"Y\",COUNT(#REF!), \"\")","v":""},null,"Osborn","N",{"v":56.604199,"d":"56.60420"},{"v":-120.377801,"d":"-120.37780"},"http://www.google.com/maps/place/56.604199,-120.377801",8950,"Rural",57,21,"No","Yes","Yes","No ","Osborn","FALSE","FALSE"]
[null,8951,"Peejay","No","No","Yes","Peace River Regional District","Northeast",{"$nulls":8},"","","",null,0,0,null,null,{"$f":"IF(AB921=\"Y\",COUNT(#REF!), \"\")","v":""},null,"Peejay","N",{"v":56.883299,"d":"56.88330"},{"v":-120.6167,"d":"-120.61670"},"http://www.google.com/maps/place/56.883299,-120.6167",8951,"Rural",17,6,"No","Yes","Yes","No ","Peejay","FALSE","FALSE"]
[null,8952,"Altona","No","No","Yes","Peace River Regional District","Northeast",{"$nulls":8},"","","",null,0,0,null,null,{"$f":"IF(AB922=\"Y\",COUNT(#REF!), \"\")","v":""},null,"Altona","N",{"v":56.877525,"d":"56.87753"},{"v":-120.953724,"d":"-120.95372"},"http://www.google.com/maps/place/56.877525,-120.953724",8952,"Rural",103,25,"No","Yes","Yes","No ","Altona","FALSE","FALSE"]
[null,8953,"Prespatou","No","Yes","Yes","Peace River Regional District","Northeast",{"$nulls":8},"","","",null,0,0,null,null,{"$f":"IF(AB923=\"Y\",COUNT(#REF!), \"\")","v":""},null,"Prespatou","N",{"v":56.922264,"d":"56.92226"},{"v":-121.062581,"d":"-121.06258"},"http://www.google.com/maps/place/56.922264,-121.062581",8953,"Rural",322,84,"No","Yes","Yes","No ","Prespatou","FALSE","FALSE"]
[null,8955,"Buick","No","No","Yes","Peace River Regional District","Northeast",{"$nulls":8},"","","",null,0,0,null,null,{"$f":"IF(AB924=\"Y\",COUNT(#REF!), \"\")","v":""},null,"Buick","N",{"v":56.762466,"d":"56.76247"},{"v":-121.270044,"d":"-121.27004"},"http://www.google.com/maps/place/56.762466,-121.270044",8955,"Rural",89,12,"No","Yes","No","No ","Buick","FALSE","FALSE"]
[null,8956,"Wonowon","No","No","Yes","Peace River Regional District","Northeast",{"$nulls":8},"","","",null,0,0,null,null,{"$f":"IF(AB925=\"Y\",COUNT(#REF!), \"\")","v":""},null,"Wonowon","N",{"v":56.728834,"d":"56.72883"},{"v":-121.814153,"d":"-121.81415"},"http://www.google.com/maps/place/56.728834,-121.814153",8956,"Rural",240,32,"No","Yes","Yes","No ","Wonowon","FALSE","FALSE"]
[null,8958,"Kobes","No","No","Yes","Peace River Regional District","Northeast",{"$nulls":8},"","","",null,0,0,null,null,{"$f":"IF(AB926=\"Y\",COUNT(#REF!), \"\")","v":""},null,"Kobes","N",{"v":56.638899,"d":"56.63890"},{"v":-121.650001,"d":"-121.65000"},"http://www.google.com/maps/place/56.638899,-121.650001",8958,"Rural",1,2,"No","Yes","Yes","No ","Kobes","FALSE","FALSE"]
[null,8959,"Upper Halfway","No","No","Yes","Peace River Regional District","Northeast",{"$nulls":8},"","","",null,0,0,null,null,{"$f":"IF(AB927=\"Y\",COUNT(#REF!), \"\")","v":""},null,"Upper Halfway","N",{"v":56.517639,"d":"56.51764"},{"v":-122.225726,"d":"-122.22573"},"http://www.google.com/maps/place/56.517639,-122.225726",8959,"Rural",2,1,"No","Yes","No","No ","Upper Halfway","FALSE","FALSE"]
[null,8960,"Pink Mountain","No","No","Yes","Peace River Regional District","Northeast",{"$nulls":8},"","","",null,0,0,null,null,{"$f":"IF(AB928=\"Y\",COUNT(#REF!), \"\")","v":""},null,"Pink Mountain","N",{"v":57.035654,"d":"57.03565"},{"v":-122.507348,"d":"-122.50735"},"http://www.google.com/maps/place/57.035654,-122.507348",8960,"Rural",39,14,"No","Yes","Yes","No ","Pink Mountain","FALSE","FALSE"]
[null,8961,"Boring Ranch","No","No","Yes","Peace River Regional District","Northeast",{"$nulls":8},"","","",null,0,0,null,null,{"$f":"IF(AB929=\"Y\",COUNT(#REF!), \"\")","v":""},null,"Boring Ranch","N",{"v":56.95,"d":"56.95000"},{"v":-122.700002,"d":"-122.70000"},"http://www.google.com/maps/place/56.95,-122.700002",8961,"Rural",2,1,"No","Yes","No","No ","Boring Ranch","FALSE","FALSE"]
[null,8962,{"$f":"HYPERLINK(AE930,AN930)","v":"Brady Ranch"},"No","No","Yes","Peace River Regional District","Northeast",{"$nulls":8},{"$f":"IF(L930=\"\",\"\",\nIF(SUM((J930*L930)/M930)<=N930,\"Sufficient Capacity\",\nIF(SUM((J930*L930)/M930)>N930,\"Not Enough Capacity\",\"Error\")))","v":""},{"$f":"IF(OR(ISBLANK(J930),ISBLANK(L930),ISBLANK(M930)), \"\",(J930*L930/M930))","v":""},{"$f":"IF(AND(COUNT(N930,R930)=2, OR($O$10=\"Last-Mile\", $O$10=\"Transport & Last-Mile\")), N930-R930, \"\")","v":""},null,{"$f":"IF(AND(AB930=\"Y\",I930<>\"\"),1,0)","v":0},{"$f":"IF(AND(AB930=\"Y\",I930=\"Last-Mile & Transport\"),1,0)","v":0},null,null,{"$f":"IF(AB930=\"Y\",COUNT(#REF!), \"\")","v":""},null,"Brady Ranch","N",{"v":56.833299,"d":"56.83330"},{"v":-122.6333,"d":"-122.63330"},"http://www.google.com/maps/place/56.833299,-122.6333",8962,"Rural",7,2,"No","Yes","No","No ",{"$f":"IF(AB930=\"Y\", CONCATENATE(AA930,\"*\"), AA930)","v":"Brady Ranch"},{"$f":"IF(I930=\"Last-Mile\",\"TRUE\",IF(I930=\"Transport & Last-Mile\",\"TRUE\",\"FALSE\"))","v":"FALSE"},{"$f":"IF(I930=\"Transport\",\"TRUE\",IF(I930=\"Transport & Last-Mile\",\"TRUE\",\"FALSE\"))","v":"FALSE"}]
[null,8963,"Beatton Ranch","No","No","Yes","Peace River Regional District","Northeast",{"$nulls":8},"","","",null,0,0,null,null,{"$f":"IF(AB931=\"Y\",COUNT(#REF!), \"\")","v":""},null,"Beatton Ranch","N",{"v":56.733301,"d":"56.73330"},{"v":-122.5833,"d":"-122.58330"},"http://www.google.com/maps/place/56.733301,-122.5833",8963,"Rural",2,1,"No","Yes","No","No ","Beatton Ranch","FALSE","FALSE"]
[null,8964,"McKearney Ranch","No","No","Yes","Peace River Regional District","Northeast",{"$nulls":8},"","","",null,0,0,null,null,{"$f":"IF(AB932=\"Y\",COUNT(#REF!), \"\")","v":""},null,"McKearney Ranch","N",{"v":56.6333,"d":"56.63330"},{"v":-122.466699,"d":"-122.46670"},"http://www.google.com/maps/place/56.6333,-122.466699",8964,"Rural",26,6,"No","Yes","No","No ","McKearney Ranch","FALSE","FALSE"]
[null,8965,"Simpson Ranch","No","No","Yes","Peace River Regional District","Northeast",{"$nulls":8},"","","",null,0,0,null,null,{"$f":"IF(AB933=\"Y\",COUNT(#REF!), \"\")","v":""},null,"Simpson Ranch","N",{"v":56.6,"d":"56.60000"},{"v":-122.433301,"d":"-122.43330"},"http://www.google.com/maps/place/56.6,-122.433301",8965,"Rural",26,6,"No","Yes","No","No ","Simpson Ranch","FALSE","FALSE"]
[null,8966,"Federal Ranch","No","No","Yes","Peace River Regional District","Northeast",{"$nulls":8},"","","",null,0,0,null,null,{"$f":"IF(AB934=\"Y\",COUNT(#REF!), \"\")","v":""},null,"Federal Ranch","N",{"v":56.4,"d":"56.40000"},{"v":-122.383299,"d":"-122.38330"},"http://www.google.com/maps/place/56.4,-122.383299",8966,"Rural",2,1,"No","Yes","No","No ","Federal Ranch","FALSE","FALSE"]
[null,8967,"Sikanni Chief","No","No","Yes","Peace River Regional District","Northeast",{"$nulls":8},"","","",null,0,0,null,null,{"$f":"IF(AB935=\"Y\",COUNT(#REF!), \"\")","v":""},null,"Sikanni Chief","N",{"v":57.234626,"d":"57.23463"},{"v":-122.694743,"d":"-122.69474"},"http://www.google.com/maps/place/57.234626,-122.694743",8967,"Rural",null,null,"No","No","No","No ","Sikanni Chief","FALSE","FALSE"]
[null,8968,"Buckinghorse River","No","No","No","Peace River Regional District","Northeast",{"$nulls":8},"","","",null,0,0,null,null,{"$f":"IF(AB936=\"Y\",COUNT(#REF!), \"\")","v":""},null,"Buckinghorse River","N",{"v":57.390144,"d":"57.39014"},-122.84167,"http://www.google.com/maps/place/57.390144,-122.84167",8968,"Rural",6,2,"No","Yes","No","No ","Buckinghorse River","FALSE","FALSE"]
[null,8970,"Fort Nelson","Yes","Yes","Yes","Northern Rockies Regional Municipality","Northeast",{"$nulls":8},"","","",null,0,0,null,null,{"$f":"IF(AB937=\"Y\",COUNT(#REF!), \"\")","v":""},null,"Fort Nelson","N",{"v":58.8056,"d":"58.80560"},{"v":-122.697201,"d":"-122.69720"},"http://www.google.com/maps/place/58.8056,-122.697201",8970,"Rural",3705,1837,"No","Yes","Yes","No ","Fort Nelson","FALSE","FALSE"]
[null,8972,"Snake River","No","No","Yes","Northern Rockies Regional Municipality","Northeast",{"$nulls":8},"","","",null,0,0,null,null,{"$f":"IF(AB938=\"Y\",COUNT(#REF!), \"\")","v":""},null,"Snake River","N",{"v":59.036397,"d":"59.03640"},{"v":-122.439215,"d":"-122.43922"},"http://www.google.com/maps/place/59.036397,-122.439215",8972,"Rural",1,0,"No","Yes","Yes","No ","Snake River","FALSE","FALSE"]
[null,8973,"Steamboat","No","No","Yes","Northern Rockies Regional Municipality","Northeast",{"$nulls":8},"","","",null,0,0,null,null,{"$f":"IF(AB939=\"Y\",COUNT(#REF!), \"\")","v":""},null,"Steamboat","N",{"v":58.675634,"d":"58.67563"},{"v":-123.712165,"d":"-123.71217"},"http://www.google.com/maps/place/58.675634,-123.712165",8973,"Rural",0,0,"No","Yes","No","No ","Steamboat","FALSE","FALSE"]
[null,8974,"Summit Lake","No","No","No","Northern Rockies Regional Municipality","Northeast",{"$nulls":8},"","","",null,0,0,null,null,{"$f":"IF(AB940=\"Y\",COUNT(#REF!), \"\")","v":""},null,"Summit Lake","N",{"v":58.655394,"d":"58.65539"},{"v":-124.637719,"d":"-124.63772"},"http://www.google.com/maps/place/58.655394,-124.637719",8974,"Rural",45,30,"No","Yes","No","No ","Summit Lake","FALSE","FALSE"]
[null,8975,"Toad River","No","No","No","Northern Rockies Regional Municipality","Northeast",{"$nulls":8},"","","",null,0,0,null,null,{"$f":"IF(AB941=\"Y\",COUNT(#REF!), \"\")","v":""},null,"Toad River","N",{"v":58.85,"d":"58.85000"},{"v":-125.233299,"d":"-125.23330"},"http://www.google.com/maps/place/58.85,-125.233299",8975,"Rural",15,5,"No","Yes","No","No ","Toad River","FALSE","FALSE"]
[null,8976,"Muncho Lake","No","No","No","Northern Rockies Regional Municipality","Northeast",{"$nulls":8},"","","",null,0,0,null,null,{"$f":"IF(AB942=\"Y\",COUNT(#REF!), \"\")","v":""},null,"Muncho Lake","N",{"v":58.9333,"d":"58.93330"},{"v":-125.766702,"d":"-125.76670"},"http://www.google.com/maps/place/58.9333,-125.766702",8976,"Rural",9,3,"No","Yes","No","No ","Muncho Lake","FALSE","FALSE"]
[null,8977,"Liard River","No","No","No","Northern Rockies Regional Municipality","Northeast",{"$nulls":8},"","","",null,0,0,null,null,{"$f":"IF(AB943=\"Y\",COUNT(#REF!), \"\")","v":""},null,"Liard River","N",{"v":59.4167,"d":"59.41670"},{"v":-126.083302,"d":"-126.08330"},"http://www.google.com/maps/place/59.4167,-126.083302",8977,"Rural",11,3,"No","Yes","Yes","No ","Liard River","FALSE","FALSE"]
[null,8978,"Coal River","No","No","No","Northern Rockies Regional Municipality","Northeast",{"$nulls":8},"","","",null,0,0,null,null,{"$f":"IF(AB944=\"Y\",COUNT(#REF!), \"\")","v":""},null,"Coal River","N",{"v":59.65,"d":"59.65000"},{"v":-126.9333,"d":"-126.93330"},"http://www.google.com/maps/place/59.65,-126.9333",8978,"Rural",1,0,"No","Yes","No","No ","Coal River","FALSE","FALSE"]
[null,8979,"Fireside","No","No","No","Northern Rockies Regional Municipality","Northeast",{"$nulls":8},"","","",null,0,0,null,null,{"$f":"IF(AB945=\"Y\",COUNT(#REF!), \"\")","v":""},null,"Fireside","N",{"v":59.670547,"d":"59.67055"},{"v":-127.136258,"d":"-127.13626"},"http://www.google.com/maps/place/59.670547,-127.136258",8979,"Rural",0,0,"No","Yes","No","No ","Fireside","FALSE","FALSE"]
[null,8980,"McDame","No","No","No","Stikine Regional District (Unincorporated)","Nechako",{"$nulls":8},"","","",null,0,0,null,null,{"$f":"IF(AB946=\"Y\",COUNT(#REF!), \"\")","v":""},null,"McDame","N",{"v":59.185586,"d":"59.18559"},-129.22515,"http://www.google.com/maps/place/59.185586,-129.22515",8980,"Rural",null,null,"No","No","No","No ","McDame","FALSE","FALSE"]
[null,8982,"Jade City","No","No","No","Stikine Regional District (Unincorporated)","Nechako",{"$nulls":8},"","","",null,0,0,null,null,{"$f":"IF(AB947=\"Y\",COUNT(#REF!), \"\")","v":""},null,"Jade City","N",{"v":59.246902,"d":"59.24690"},{"v":-129.655043,"d":"-129.65504"},"http://www.google.com/maps/place/59.246902,-129.655043",8982,"Rural",8,4,"No","Yes","No","No ","Jade City","FALSE","FALSE"]
[null,8983,"Dease Lake","No","No","No","Regional District of Kitimat-Stikine","North Coast",{"$nulls":8},"","","",null,0,0,null,null,{"$f":"IF(AB948=\"Y\",COUNT(#REF!), \"\")","v":""},null,"Dease Lake","N",{"v":58.4394,"d":"58.43940"},{"v":-129.995499,"d":"-129.99550"},"http://www.google.com/maps/place/58.4394,-129.995499",8983,"Rural",245,142,"No","Yes","Yes","No ","Dease Lake","FALSE","FALSE"]
[null,8984,"Tahltan","No","No","No","Regional District of Kitimat-Stikine","North Coast",{"$nulls":8},"","","",null,0,0,null,null,{"$f":"IF(AB949=\"Y\",COUNT(#REF!), \"\")","v":""},null,"Tahltan","N",{"v":58.472426,"d":"58.47243"},{"v":-130.015498,"d":"-130.01550"},"http://www.google.com/maps/place/58.472426,-130.015498",8984,"Rural",58,19,"No","Yes","No","No ","Tahltan","FALSE","FALSE"]
[null,8986,"Stikine","No","No","No","Regional District of Kitimat-Stikine","North Coast",{"$nulls":8},"","","",null,0,0,null,null,{"$f":"IF(AB950=\"Y\",COUNT(#REF!), \"\")","v":""},null,"Stikine","N",{"v":56.698135,"d":"56.69814"},-131.80644,"http://www.google.com/maps/place/56.698135,-131.80644",8986,"Rural",30,25,"No","Yes","Yes","No ","Stikine","FALSE","FALSE"]
[null,8988,"40 Mile Flats","No","No","No","Regional District of Kitimat-Stikine","North Coast",{"$nulls":8},"","","",null,0,0,null,null,{"$f":"IF(AB951=\"Y\",COUNT(#REF!), \"\")","v":""},null,"40 Mile Flats","N",57.93631,{"v":-130.050057,"d":"-130.05006"},"http://www.google.com/maps/place/57.93631,-130.050057",8988,"Rural",30,27,"No","Yes","No","No ","40 Mile Flats","FALSE","FALSE"]
[null,8989,"Eddontenajon","No","No","No","Regional District of Kitimat-Stikine","North Coast",{"$nulls":8},"","","",null,0,0,null,null,{"$f":"IF(AB952=\"Y\",COUNT(#REF!), \"\")","v":""},null,"Eddontenajon","N",{"v":57.822095,"d":"57.82210"},{"v":-129.958047,"d":"-129.95805"},"http://www.google.com/maps/place/57.822095,-129.958047",8989,"Rural",297,126,"No","Yes","No","No ","Eddontenajon","FALSE","FALSE"]
[null,8990,"Tatogga","No","No","No","Regional District of Kitimat-Stikine","North Coast",{"$nulls":8},"","","",null,0,0,null,null,{"$f":"IF(AB953=\"Y\",COUNT(#REF!), \"\")","v":""},null,"Tatogga","N",{"v":57.716348,"d":"57.71635"},{"v":-129.987351,"d":"-129.98735"},"http://www.google.com/maps/place/57.716348,-129.987351",8990,"Rural",2,2,"No","Yes","Yes","No ","Tatogga","FALSE","FALSE"]
[null,8992,"Lower Post*","No","No","No","Stikine Regional District (Unincorporated)","Nechako",{"$nulls":8},"","","",null,0,0,null,null,{"$f":"IF(AB954=\"Y\",COUNT(#REF!), \"\")","v":0},null,"Lower Post","Y",{"v":59.924942,"d":"59.92494"},{"v":-128.485983,"d":"-128.48598"},"http://www.google.com/maps/place/59.924942,-128.485983",8992,"Rural First Nations Primary Reserve",121,63,"No","Yes","No","No ","Lower Post*","FALSE","FALSE"]
[null,8993,"Tulsequah","No","No","No","Stikine Regional District (Unincorporated)","Nechako",{"$nulls":8},"","","",null,0,0,null,null,{"$f":"IF(AB955=\"Y\",COUNT(#REF!), \"\")","v":""},null,"Tulsequah","N",{"v":58.657651,"d":"58.65765"},{"v":-133.544045,"d":"-133.54405"},"http://www.google.com/maps/place/58.657651,-133.544045",8993,"Rural",null,null,"No","No","No","No ","Tulsequah","FALSE","FALSE"]
[null,8994,"Pleasant Camp","No","No","No","Stikine Regional District (Unincorporated)","Nechako",{"$nulls":8},"","","",null,0,0,null,null,{"$f":"IF(AB956=\"Y\",COUNT(#REF!), \"\")","v":""},null,"Pleasant Camp","N",{"v":59.454639,"d":"59.45464"},{"v":-136.365147,"d":"-136.36515"},"http://www.google.com/maps/place/59.454639,-136.365147",8994,"Rural",3,5,"No","Yes","Yes","No ","Pleasant Camp","FALSE","FALSE"]
[null,8995,"Bear Camp","No","No","No","Stikine Regional District (Unincorporated)","Nechako",{"$nulls":8},"","","",null,0,0,null,null,{"$f":"IF(AB957=\"Y\",COUNT(#REF!), \"\")","v":""},null,"Bear Camp","N",{"v":59.9167,"d":"59.91670"},{"v":-136.799999,"d":"-136.80000"},"http://www.google.com/maps/place/59.9167,-136.799999",8995,"Rural",3,5,"No","Yes","No","No ","Bear Camp","FALSE","FALSE"]
[null,8996,"Atlin","No","No","No","Stikine Regional District (Unincorporated)","Nechako",{"$nulls":8},"","","",null,0,0,null,null,{"$f":"IF(AB958=\"Y\",COUNT(#REF!), \"\")","v":""},null,"Atlin","N",{"v":59.567863,"d":"59.56786"},{"v":-133.696706,"d":"-133.69671"},"http://www.google.com/maps/place/59.567863,-133.696706",8996,"Rural",225,247,"No","Yes","No","No ","Atlin","FALSE","FALSE"]
[null,8998,"Fraser","No","No","No","Stikine Regional District (Unincorporated)","Nechako",{"$nulls":8},"","","",null,0,0,null,null,{"$f":"IF(AB959=\"Y\",COUNT(#REF!), \"\")","v":""},null,"Fraser","N",{"v":59.715867,"d":"59.71587"},{"v":-135.048794,"d":"-135.04879"},"http://www.google.com/maps/place/59.715867,-135.048794",8998,"Rural",3,5,"No","Yes","No","No ","Fraser","FALSE","FALSE"]
[null,8999,"Bennett","No","No","No","Stikine Regional District (Unincorporated)","Nechako",{"$nulls":8},"","","",null,0,0,null,null,{"$f":"IF(AB960=\"Y\",COUNT(#REF!), \"\")","v":""},null,"Bennett","N",{"v":59.845115,"d":"59.84512"},{"v":-134.986935,"d":"-134.98694"},"http://www.google.com/maps/place/59.845115,-134.986935",8999,"Rural",3,5,"No","Yes","No","No ","Bennett","FALSE","FALSE"]
[null,9000,"Tumbler Ridge","No","Yes","Yes","Peace River Regional District","Northeast",{"$nulls":8},"","","",null,0,0,null,null,{"$f":"IF(AB961=\"Y\",COUNT(#REF!), \"\")","v":""},null,"Tumbler Ridge","N",{"v":55.1333,"d":"55.13330"},{"v":-120.999999,"d":"-121.00000"},"http://www.google.com/maps/place/55.1333,-120.999999",9000,"Rural",1987,1565,"No","Yes","No","No ","Tumbler Ridge","FALSE","FALSE"]
[null,9001,"Kelly Lake","No","No","Yes","Peace River Regional District","Northeast",{"$nulls":8},"","","",null,0,0,null,null,{"$f":"IF(AB962=\"Y\",COUNT(#REF!), \"\")","v":""},null,"Kelly Lake","N",{"v":55.260183,"d":"55.26018"},{"v":-120.042959,"d":"-120.04296"},"http://www.google.com/maps/place/55.260183,-120.042959",9001,"Rural",49,22,"No","Yes","Yes","No ","Kelly Lake","FALSE","FALSE"]
[null,9002,"Yaku","No","No","No","North Coast Regional District","North Coast",{"$nulls":8},"","","",null,0,0,null,null,{"$f":"IF(AB963=\"Y\",COUNT(#REF!), \"\")","v":""},null,"Yaku","N",{"v":54.192332,"d":"54.19233"},{"v":-133.003274,"d":"-133.00327"},"http://www.google.com/maps/place/54.192332,-133.003274",9002,"Rural",5,2,"No","Yes","Yes","No ","Yaku","FALSE","FALSE"]
[null,9003,"Masset","No","Yes","Yes","North Coast Regional District","North Coast",{"$nulls":8},"","","",null,0,0,null,null,{"$f":"IF(AB964=\"Y\",COUNT(#REF!), \"\")","v":""},null,"Masset","N",{"v":54.017407,"d":"54.01741"},{"v":-132.1466,"d":"-132.14660"},"http://www.google.com/maps/place/54.017407,-132.1466",9003,"Rural",788,412,"No","Yes","No","No ","Masset","FALSE","FALSE"]
[null,9004,"Delkatla","No","Yes","Yes","North Coast Regional District","North Coast",{"$nulls":8},"","","",null,0,0,null,null,{"$f":"IF(AB965=\"Y\",COUNT(#REF!), \"\")","v":""},null,"Delkatla","N",{"v":54.008621,"d":"54.00862"},{"v":-132.129479,"d":"-132.12948"},"http://www.google.com/maps/place/54.008621,-132.129479",9004,"Rural",544,313,"No","Yes","Yes","No ","Delkatla","FALSE","FALSE"]
[null,9006,"Port Clements","Yes","Yes","Yes","North Coast Regional District","North Coast",{"$nulls":8},"","","",null,0,0,null,null,{"$f":"IF(AB966=\"Y\",COUNT(#REF!), \"\")","v":""},null,"Port Clements","N",{"v":53.685201,"d":"53.68520"},{"v":-132.178755,"d":"-132.17876"},"http://www.google.com/maps/place/53.685201,-132.178755",9006,"Rural",120,79,"No","Yes","Yes","No ","Port Clements","FALSE","FALSE"]
[null,9007,"Juskatla","No","No","No","North Coast Regional District","North Coast",{"$nulls":8},"","","",null,0,0,null,null,{"$f":"IF(AB967=\"Y\",COUNT(#REF!), \"\")","v":""},null,"Juskatla","N",{"v":53.610242,"d":"53.61024"},{"v":-132.311353,"d":"-132.31135"},"http://www.google.com/maps/place/53.610242,-132.311353",9007,"Rural",null,null,"No","No","No","No ","Juskatla","FALSE","FALSE"]
[null,9008,"Sewall","No","No","Yes","North Coast Regional District","North Coast",{"$nulls":8},"","","",null,0,0,null,null,{"$f":"IF(AB968=\"Y\",COUNT(#REF!), \"\")","v":""},null,"Sewall","N",{"v":53.762475,"d":"53.76248"},{"v":-132.298066,"d":"-132.29807"},"http://www.google.com/maps/place/53.762475,-132.298066",9008,"Rural",10,1,"No","Yes","No","No ","Sewall","FALSE","FALSE"]
[null,9009,"Tlell","Yes","Yes","No","North Coast Regional District","North Coast",{"$nulls":8},"","","",null,0,0,null,null,{"$f":"IF(AB969=\"Y\",COUNT(#REF!), \"\")","v":""},null,"Tlell","N",{"v":53.5667,"d":"53.56670"},{"v":-131.933299,"d":"-131.93330"},"http://www.google.com/maps/place/53.5667,-131.933299",9009,"Rural",144,87,"No","Yes","Yes","No ","Tlell","FALSE","FALSE"]
[null,9010,"Lawnhill","Yes","Yes","Yes","North Coast Regional District","North Coast",{"$nulls":8},"","","",null,0,0,null,null,{"$f":"IF(AB970=\"Y\",COUNT(#REF!), \"\")","v":""},null,"Lawnhill","N",{"v":53.403575,"d":"53.40358"},{"v":-131.922226,"d":"-131.92223"},"http://www.google.com/maps/place/53.403575,-131.922226",9010,"Rural",19,15,"No","Yes","Yes","No ","Lawnhill","FALSE","FALSE"]
[null,9011,"Sandspit","Yes","Yes","Yes","North Coast Regional District","North Coast",{"$nulls":8},"","","",null,0,0,null,null,{"$f":"IF(AB971=\"Y\",COUNT(#REF!), \"\")","v":""},null,"Sandspit","N",{"v":53.247917,"d":"53.24792"},-131.81443,"http://www.google.com/maps/place/53.247917,-131.81443",9011,"Rural",215,140,"No","Yes","No","No ","Sandspit","FALSE","FALSE"]
[null,9013,"Village of Queen Charlotte","No","No","Yes","North Coast Regional District","North Coast",{"$nulls":8},"","","",null,0,0,null,null,{"$f":"IF(AB972=\"Y\",COUNT(#REF!), \"\")","v":""},null,"Village of Queen Charlotte","N",{"v":53.256464,"d":"53.25646"},{"v":-132.094015,"d":"-132.09402"},"http://www.google.com/maps/place/53.256464,-132.094015",9013,"Rural",680,396,"No","Yes","Yes","No ","Village of Queen Charlotte","FALSE","FALSE"]
[null,9014,"Skidegate Landing","No","No","Yes","North Coast Regional District","North Coast",{"$nulls":8},"","","",null,0,0,null,null,{"$f":"IF(AB973=\"Y\",COUNT(#REF!), \"\")","v":""},null,"Skidegate Landing","N",{"v":53.247201,"d":"53.24720"},{"v":-132.0083,"d":"-132.00830"},"http://www.google.com/maps/place/53.247201,-132.0083",9014,"Rural",169,102,"No","Yes","Yes","No ","Skidegate Landing","FALSE","FALSE"]
[null,9015,"Sewell Inlet","No","No","No","North Coast Regional District","North Coast",{"$nulls":8},"","","",null,0,0,null,null,{"$f":"IF(AB974=\"Y\",COUNT(#REF!), \"\")","v":""},null,"Sewell Inlet","N",{"v":52.874898,"d":"52.87490"},{"v":-131.987129,"d":"-131.98713"},"http://www.google.com/maps/place/52.874898,-131.987129",9015,"Rural",11,6,"No","Yes","Yes","No ","Sewell Inlet","FALSE","FALSE"]
[null,9016,"Rose Harbour","No","No","No","North Coast Regional District","North Coast",{"$nulls":8},"","","",null,0,0,null,null,{"$f":"IF(AB975=\"Y\",COUNT(#REF!), \"\")","v":""},null,"Rose Harbour","N",52.14638,{"v":-131.0765649,"d":"-131.07656"},"http://www.google.com/maps/place/52.14638,-131.0765649",9016,"Rural",11,6,"No","Yes","Yes","No ","Rose Harbour","FALSE","FALSE"]
[null,9017,"Moresby Camp","No","No","No","North Coast Regional District","North Coast",{"$nulls":8},"","","",null,0,0,null,null,{"$f":"IF(AB976=\"Y\",COUNT(#REF!), \"\")","v":""},null,"Moresby Camp","N",{"v":53.047474,"d":"53.04747"},{"v":-132.028869,"d":"-132.02887"},"http://www.google.com/maps/place/53.047474,-132.028869",9017,"Rural",11,6,"No","Yes","No","No ","Moresby Camp","FALSE","FALSE"]
[null,9019,"Georgetown Mills","No","No","No","North Coast Regional District","North Coast",{"$nulls":8},"","","",null,0,0,null,null,{"$f":"IF(AB977=\"Y\",COUNT(#REF!), \"\")","v":""},null,"Georgetown Mills","N",{"v":54.471563,"d":"54.47156"},{"v":-130.398056,"d":"-130.39806"},"http://www.google.com/maps/place/54.471563,-130.398056",9019,"Rural",10,12,"No","Yes","No","No ","Georgetown Mills","FALSE","FALSE"]
[null,9020,"Renata","No","No","No","Regional District of Central Kootenay","Kootenay",{"$nulls":8},"","","",null,0,0,null,null,{"$f":"IF(AB978=\"Y\",COUNT(#REF!), \"\")","v":""},null,"Renata","N",{"v":49.426789,"d":"49.42679"},{"v":-118.106963,"d":"-118.10696"},"http://www.google.com/maps/place/49.426789,-118.106963",9020,"Rural",0,0,"No","Yes","No","No ","Renata","FALSE","FALSE"]
[null,9021,"Deer Park","No","Yes","No","Regional District of Central Kootenay","Kootenay",{"$nulls":8},"","","",null,0,0,null,null,{"$f":"IF(AB979=\"Y\",COUNT(#REF!), \"\")","v":""},null,"Deer Park","N",{"v":49.416217,"d":"49.41622"},{"v":-118.039438,"d":"-118.03944"},"http://www.google.com/maps/place/49.416217,-118.039438",9021,"Rural",91,104,"No","Yes","Yes","No ","Deer Park","FALSE","FALSE"]
[null,9022,"Zamora","No","No","Yes","Regional District of Kootenay Boundary","Kootenay",{"$nulls":8},"","","",null,0,0,null,null,{"$f":"IF(AB980=\"Y\",COUNT(#REF!), \"\")","v":""},null,"Zamora","N",{"v":49.150001,"d":"49.15000"},{"v":-118.983299,"d":"-118.98330"},"http://www.google.com/maps/place/49.150001,-118.983299",9022,"Rural",24,15,"No","Yes","Yes","No ","Zamora","FALSE","FALSE"]
[null,9023,"Rhone","No","No","No","Regional District of Kootenay Boundary","Kootenay",{"$nulls":8},"","","",null,0,0,null,null,{"$f":"IF(AB981=\"Y\",COUNT(#REF!), \"\")","v":""},null,"Rhone","N",{"v":49.219018,"d":"49.21902"},{"v":-119.018312,"d":"-119.01831"},"http://www.google.com/maps/place/49.219018,-119.018312",9023,"Rural",38,19,"No","Yes","No","No ","Rhone","FALSE","FALSE"]
[null,9024,"Westbridge","No","No","Yes","Regional District of Kootenay Boundary","Kootenay",{"$nulls":8},"","","",null,0,0,null,null,{"$f":"IF(AB982=\"Y\",COUNT(#REF!), \"\")","v":""},null,"Westbridge","N",{"v":49.171453,"d":"49.17145"},{"v":-118.975308,"d":"-118.97531"},"http://www.google.com/maps/place/49.171453,-118.975308",9024,"Rural",51,33,"No","Yes","Yes","No ","Westbridge","FALSE","FALSE"]
[null,9025,"Christian Valley","No","No","No","Regional District of Kootenay Boundary","Kootenay",{"$nulls":8},"","","",null,0,0,null,null,{"$f":"IF(AB983=\"Y\",COUNT(#REF!), \"\")","v":""},null,"Christian Valley","N",{"v":49.551274,"d":"49.55127"},{"v":-118.801631,"d":"-118.80163"},"http://www.google.com/maps/place/49.551274,-118.801631",9025,"Rural",5,4,"No","Yes","No","No ","Christian Valley","FALSE","FALSE"]
[null,9026,"McCulloch","No","No","Yes","Regional District of Central Okanagan","Thompson--Okanagan",{"$nulls":8},"","","",null,0,0,null,null,{"$f":"IF(AB984=\"Y\",COUNT(#REF!), \"\")","v":""},null,"McCulloch","N",{"v":49.794756,"d":"49.79476"},{"v":-119.190209,"d":"-119.19021"},"http://www.google.com/maps/place/49.794756,-119.190209",9026,"Rural",11,5,"No","Yes","No","No ","McCulloch","FALSE","FALSE"]
[null,9027,"Fosthall","No","No","Yes","Regional District of Central Kootenay","Kootenay",{"$nulls":8},"","","",null,0,0,null,null,{"$f":"IF(AB985=\"Y\",COUNT(#REF!), \"\")","v":""},null,"Fosthall","N",{"v":50.348786,"d":"50.34879"},{"v":-117.935057,"d":"-117.93506"},"http://www.google.com/maps/place/50.348786,-117.935057",9027,"Rural",0,0,"No","Yes","Yes","No ","Fosthall","FALSE","FALSE"]
[null,9028,"Retallack","Yes","Yes","No","Regional District of Central Kootenay","Kootenay",{"$nulls":8},"","","",null,0,0,null,null,{"$f":"IF(AB986=\"Y\",COUNT(#REF!), \"\")","v":""},null,"Retallack","N",{"v":50.041437,"d":"50.04144"},{"v":-117.139516,"d":"-117.13952"},"http://www.google.com/maps/place/50.041437,-117.139516",9028,"Rural",2,2,"No","Yes","Yes","No ","Retallack","FALSE","FALSE"]
[null,9029,"Argenta","Yes","Yes","No","Regional District of Central Kootenay","Kootenay",{"$nulls":8},"","","",null,0,0,null,null,{"$f":"IF(AB987=\"Y\",COUNT(#REF!), \"\")","v":""},null,"Argenta","N",{"v":50.166699,"d":"50.16670"},{"v":-116.916701,"d":"-116.91670"},"http://www.google.com/maps/place/50.166699,-116.916701",9029,"Rural",78,78,"No","Yes","No","No ","Argenta","FALSE","FALSE"]
[null,9030,"Shutty Bench","Yes","Yes","No","Regional District of Central Kootenay","Kootenay",{"$nulls":8},"","","",null,0,0,null,null,{"$f":"IF(AB988=\"Y\",COUNT(#REF!), \"\")","v":""},null,"Shutty Bench","N",{"v":49.962867,"d":"49.96287"},{"v":-116.907333,"d":"-116.90733"},"http://www.google.com/maps/place/49.962867,-116.907333",9030,"Rural",52,43,"No","Yes","Yes","No ","Shutty Bench","FALSE","FALSE"]
[null,9031,"Sandon","No","No","No","Regional District of Central Kootenay","Kootenay",{"$nulls":8},"","","",null,0,0,null,null,{"$f":"IF(AB989=\"Y\",COUNT(#REF!), \"\")","v":""},null,"Sandon","N",{"v":49.9833,"d":"49.98330"},{"v":-117.233299,"d":"-117.23330"},"http://www.google.com/maps/place/49.9833,-117.233299",9031,"Rural",0,0,"No","Yes","No","No ","Sandon","FALSE","FALSE"]
[null,9032,"Johnsons Landing","Yes","Yes","No","Regional District of Central Kootenay","Kootenay",{"$nulls":8},"","","",null,0,0,null,null,{"$f":"IF(AB990=\"Y\",COUNT(#REF!), \"\")","v":""},null,"Johnsons Landing","N",{"v":50.0833,"d":"50.08330"},{"v":-116.8833,"d":"-116.88330"},"http://www.google.com/maps/place/50.0833,-116.8833",9032,"Rural",69,69,"No","Yes","Yes","No ","Johnsons Landing","FALSE","FALSE"]
[null,9033,"Birchdale","No","No","No","Regional District of Central Kootenay","Kootenay",{"$nulls":8},"","","",null,0,0,null,null,{"$f":"IF(AB991=\"Y\",COUNT(#REF!), \"\")","v":""},null,"Birchdale","N",{"v":50.034395,"d":"50.03440"},{"v":-116.873517,"d":"-116.87352"},"http://www.google.com/maps/place/50.034395,-116.873517",9033,"Rural",33,39,"Yes","No","No","No ","Birchdale","FALSE","FALSE"]
[null,9034,"Mirror Lake","Yes","Yes","Yes","Regional District of Central Kootenay","Kootenay",{"$nulls":8},"","","",null,0,0,null,null,{"$f":"IF(AB992=\"Y\",COUNT(#REF!), \"\")","v":""},null,"Mirror Lake","N",{"v":49.8829,"d":"49.88290"},{"v":-116.901729,"d":"-116.90173"},"http://www.google.com/maps/place/49.8829,-116.901729",9034,"Rural",189,131,"No","No","No","No ","Mirror Lake","FALSE","FALSE"]
[null,9035,"Kootenay Bay","No","Yes","Yes","Regional District of Central Kootenay","Kootenay",{"$nulls":8},"","","",null,0,0,null,null,{"$f":"IF(AB993=\"Y\",COUNT(#REF!), \"\")","v":""},null,"Kootenay Bay","N",{"v":49.684851,"d":"49.68485"},{"v":-116.866411,"d":"-116.86641"},"http://www.google.com/maps/place/49.684851,-116.866411",9035,"Rural",294,207,"No","Yes","Yes","No ","Kootenay Bay","FALSE","FALSE"]
[null,9036,{"$f":"HYPERLINK(AE994,AN994)","v":"Gray Creek"},"No","Yes","Yes","Regional District of Central Kootenay","Kootenay",{"$nulls":8},{"$f":"IF(L994=\"\",\"\",\nIF(SUM((J994*L994)/M994)<=N994,\"Sufficient Capacity\",\nIF(SUM((J994*L994)/M994)>N994,\"Not Enough Capacity\",\"Error\")))","v":""},{"$f":"IF(OR(ISBLANK(J994),ISBLANK(L994),ISBLANK(M994)), \"\",(J994*L994/M994))","v":""},{"$f":"IF(AND(COUNT(N994,R994)=2, OR($O$10=\"Last-Mile\", $O$10=\"Transport & Last-Mile\")), N994-R994, \"\")","v":""},null,{"$f":"IF(AND(AB994=\"Y\",I994<>\"\"),1,0)","v":0},{"$f":"IF(AND(AB994=\"Y\",I994=\"Last-Mile & Transport\"),1,0)","v":0},null,null,{"$f":"IF(AB994=\"Y\",COUNT(#REF!), \"\")","v":""},null,"Gray Creek","N",{"v":49.6333,"d":"49.63330"},{"v":-116.783299,"d":"-116.78330"},"http://www.google.com/maps/place/49.6333,-116.783299",9036,"Rural",122,140,"No","Yes","Yes","No ",{"$f":"IF(AB994=\"Y\", CONCATENATE(AA994,\"*\"), AA994)","v":"Gray Creek"},{"$f":"IF(I994=\"Last-Mile\",\"TRUE\",IF(I994=\"Transport & Last-Mile\",\"TRUE\",\"FALSE\"))","v":"FALSE"},{"$f":"IF(I994=\"Transport\",\"TRUE\",IF(I994=\"Transport & Last-Mile\",\"TRUE\",\"FALSE\"))","v":"FALSE"}]
[null,9037,"Hall","No","No","Yes","Regional District of Central Kootenay","Kootenay",{"$nulls":8},"","","",null,0,0,null,null,{"$f":"IF(AB995=\"Y\",COUNT(#REF!), \"\")","v":""},null,"Hall","N",{"v":49.373975,"d":"49.37398"},-117.24261,"http://www.google.com/maps/place/49.373975,-117.24261",9037,"Rural",63,30,"No","Yes","Yes","No ","Hall","FALSE","FALSE"]
[null,9038,"Erie","No","Yes","No","Regional District of Central Kootenay","Kootenay",{"$nulls":8},"","","",null,0,0,null,null,{"$f":"IF(AB996=\"Y\",COUNT(#REF!), \"\")","v":""},null,"Erie","N",{"v":49.191207,"d":"49.19121"},{"v":-117.337387,"d":"-117.33739"},"http://www.google.com/maps/place/49.191207,-117.337387",9038,"Rural",289,162,"No","Yes","No","No ","Erie","FALSE","FALSE"]
[null,9039,"Meadows","No","Yes","No","Regional District of Central Kootenay","Kootenay",{"$nulls":8},"","","",null,0,0,null,null,{"$f":"IF(AB997=\"Y\",COUNT(#REF!), \"\")","v":""},null,"Meadows","N",{"v":49.185902,"d":"49.18590"},{"v":-117.395502,"d":"-117.39550"},"http://www.google.com/maps/place/49.185902,-117.395502",9039,"Rural",46,27,"No","Yes","Yes","No ","Meadows","FALSE","FALSE"]
[null,9040,"Jersey","No","Yes","Yes","Regional District of Central Kootenay","Kootenay",{"$nulls":8},"","","",null,0,0,null,null,{"$f":"IF(AB998=\"Y\",COUNT(#REF!), \"\")","v":""},null,"Jersey","N",{"v":49.1,"d":"49.10000"},{"v":-117.233301,"d":"-117.23330"},"http://www.google.com/maps/place/49.1,-117.233301",9040,"Rural",22,18,"No","Yes","No","No ","Jersey","FALSE","FALSE"]
[null,9041,"Kingsgate","No","Yes","No","Regional District of Central Kootenay","Kootenay",{"$nulls":8},"","","",null,0,0,null,null,{"$f":"IF(AB999=\"Y\",COUNT(#REF!), \"\")","v":""},null,"Kingsgate","N",{"v":49.002431,"d":"49.00243"},{"v":-116.178028,"d":"-116.17803"},"http://www.google.com/maps/place/49.002431,-116.178028",9041,"Rural",98,47,"No","Yes","Yes","No ","Kingsgate","FALSE","FALSE"]
[null,9042,"Lumberton","No","No","Yes","Regional District of East Kootenay","Kootenay",{"$nulls":8},"","","",null,0,0,null,null,{"$f":"IF(AB1000=\"Y\",COUNT(#REF!), \"\")","v":""},null,"Lumberton","N",{"v":49.423792,"d":"49.42379"},{"v":-115.876809,"d":"-115.87681"},"http://www.google.com/maps/place/49.423792,-115.876809",9042,"Rural",203,82,"No","No","No","No ","Lumberton","FALSE","FALSE"]
[null,9043,"Old Town","No","No","Yes","Regional District of East Kootenay","Kootenay",{"$nulls":8},"","","",null,0,0,null,null,{"$f":"IF(AB1001=\"Y\",COUNT(#REF!), \"\")","v":""},null,"Old Town","N",{"v":49.550001,"d":"49.55000"},{"v":-115.9667,"d":"-115.96670"},"http://www.google.com/maps/place/49.550001,-115.9667",9043,"Rural",30,17,"No","Yes","No","No ","Old Town","FALSE","FALSE"]
[null,9044,"Meachen","No","No","No","Regional District of East Kootenay","Kootenay",{"$nulls":8},"","","",null,0,0,null,null,{"$f":"IF(AB1002=\"Y\",COUNT(#REF!), \"\")","v":""},null,"Meachen","N",{"v":49.620739,"d":"49.62074"},{"v":-116.267258,"d":"-116.26726"},"http://www.google.com/maps/place/49.620739,-116.267258",9044,"Rural",1,1,"No","Yes","No","No ","Meachen","FALSE","FALSE"]
[null,9045,"Ta Ta Creek","No","Yes","Yes","Regional District of East Kootenay","Kootenay",{"$nulls":8},"","","",null,0,0,null,null,{"$f":"IF(AB1003=\"Y\",COUNT(#REF!), \"\")","v":""},null,"Ta Ta Creek","N",{"v":49.783301,"d":"49.78330"},{"v":-115.7833,"d":"-115.78330"},"http://www.google.com/maps/place/49.783301,-115.7833",9045,"Rural",307,360,"Yes","No","No","No ","Ta Ta Creek","FALSE","FALSE"]
[null,9046,"Premier Lake","No","No","Yes","Regional District of East Kootenay","Kootenay",{"$nulls":8},"","","",null,0,0,null,null,{"$f":"IF(AB1004=\"Y\",COUNT(#REF!), \"\")","v":""},null,"Premier Lake","N",{"v":49.951705,"d":"49.95171"},{"v":-115.658678,"d":"-115.65868"},"http://www.google.com/maps/place/49.951705,-115.658678",9046,"Rural",7,4,"No","Yes","Yes","No ","Premier Lake","FALSE","FALSE"]
[null,9047,"Kootenay Crossing","No","No","No","Regional District of East Kootenay","Kootenay",{"$nulls":8},"","","",null,0,0,null,null,{"$f":"IF(AB1005=\"Y\",COUNT(#REF!), \"\")","v":""},null,"Kootenay Crossing","N",{"v":50.8833,"d":"50.88330"},{"v":-116.049999,"d":"-116.05000"},"http://www.google.com/maps/place/50.8833,-116.049999",9047,"Rural",2,2,"No","Yes","Yes","No ","Kootenay Crossing","FALSE","FALSE"]
[null,9048,"Vermilion Crossing","No","No","No","Regional District of East Kootenay","Kootenay",{"$nulls":8},"","","",null,0,0,null,null,{"$f":"IF(AB1006=\"Y\",COUNT(#REF!), \"\")","v":""},null,"Vermilion Crossing","N",{"v":51.0333,"d":"51.03330"},{"v":-115.983301,"d":"-115.98330"},"http://www.google.com/maps/place/51.0333,-115.983301",9048,"Rural",null,null,"No","No","Yes","No ","Vermilion Crossing","FALSE","FALSE"]
[null,9050,"Oliver's Landing","Yes","Yes","Yes","Squamish-Lillooet Regional District","Lower Mainland--Southwest",{"$nulls":8},"","","",null,0,0,null,null,{"$f":"IF(AB1007=\"Y\",COUNT(#REF!), \"\")","v":""},null,"Oliver's Landing","N",{"v":49.583301,"d":"49.58330"},{"v":-123.220801,"d":"-123.22080"},"http://www.google.com/maps/place/49.583301,-123.220801",9050,"Rural",254,132,"No","No","Yes","No ","Oliver's Landing","FALSE","FALSE"]
[null,9051,"Britannia Beach","Yes","Yes","Yes","Squamish-Lillooet Regional District","Lower Mainland--Southwest",{"$nulls":8},"","","",null,0,0,null,null,{"$f":"IF(AB1008=\"Y\",COUNT(#REF!), \"\")","v":""},null,"Britannia Beach","N",{"v":49.627966,"d":"49.62797"},{"v":-123.203663,"d":"-123.20366"},"http://www.google.com/maps/place/49.627966,-123.203663",9051,"Rural",306,131,"Yes","No","No","No ","Britannia Beach","FALSE","FALSE"]
[null,9052,"Phillips Arm","No","No","No","Strathcona Regional District","Vancouver Island and Coast",{"$nulls":8},"","","",null,0,0,null,null,{"$f":"IF(AB1009=\"Y\",COUNT(#REF!), \"\")","v":""},null,"Phillips Arm","N",{"v":50.545928,"d":"50.54593"},{"v":-125.356483,"d":"-125.35648"},"http://www.google.com/maps/place/50.545928,-125.356483",9052,"Rural",6,20,"No","Yes","No","No ","Phillips Arm","FALSE","FALSE"]
[null,9053,"Heydon Bay*","No","No","No","Strathcona Regional District","Vancouver Island and Coast",{"$nulls":8},"","","",null,0,0,null,null,{"$f":"IF(AB1010=\"Y\",COUNT(#REF!), \"\")","v":0},null,"Heydon Bay","Y",50.57813,-125.57623,"http://www.google.com/maps/place/50.57813,-125.57623",9053,"Rural First Nations Secondary Reserve",2,4,"No","Yes","Yes","No ","Heydon Bay*","FALSE","FALSE"]
[null,9054,"Hardwicke Island","No","No","No","Strathcona Regional District","Vancouver Island and Coast",{"$nulls":8},"","","",null,0,0,null,null,{"$f":"IF(AB1011=\"Y\",COUNT(#REF!), \"\")","v":""},null,"Hardwicke Island","N",{"v":50.416699,"d":"50.41670"},{"v":-125.916701,"d":"-125.91670"},"http://www.google.com/maps/place/50.416699,-125.916701",9054,"Rural",2,4,"No","Yes","Yes","No ","Hardwicke Island","FALSE","FALSE"]
[null,9056,"Kingcome Inlet","No","No","No","Regional District of Mount Waddington","Vancouver Island and Coast",{"$nulls":8},"","","",null,0,0,null,null,{"$f":"IF(AB1012=\"Y\",COUNT(#REF!), \"\")","v":""},null,"Kingcome Inlet","N",{"v":50.95,"d":"50.95000"},{"v":-126.199999,"d":"-126.20000"},"http://www.google.com/maps/place/50.95,-126.199999",9056,"Rural",5,4,"No","Yes","Yes","No ","Kingcome Inlet","FALSE","FALSE"]
[null,9057,"Owen Bay","No","No","No","Strathcona Regional District","Vancouver Island and Coast",{"$nulls":8},"","","",null,0,0,null,null,{"$f":"IF(AB1013=\"Y\",COUNT(#REF!), \"\")","v":""},null,"Owen Bay","N",{"v":50.316879,"d":"50.31688"},{"v":-125.214114,"d":"-125.21411"},"http://www.google.com/maps/place/50.316879,-125.214114",9057,"Rural",12,23,"No","Yes","Yes","No ","Owen Bay","FALSE","FALSE"]
[null,9058,"Leo Creek","No","No","No","Bulkley Nechako Regional District","Nechako",{"$nulls":8},"","","",null,0,0,null,null,{"$f":"IF(AB1014=\"Y\",COUNT(#REF!), \"\")","v":""},null,"Leo Creek","N",{"v":55.08302778,"d":"55.08303"},{"v":-125.56010278,"d":"-125.56010"},"http://www.google.com/maps/place/55.08302778,-125.56010278",9058,"Rural",null,null,"No","No","Yes","No ","Leo Creek","FALSE","FALSE"]
[null,9059,"Baker Creek","No","No","No","Cariboo Regional District","Cariboo",{"$nulls":8},"","","",null,0,0,null,null,{"$f":"IF(AB1015=\"Y\",COUNT(#REF!), \"\")","v":""},null,"Baker Creek","N",{"v":52.927449,"d":"52.92745"},{"v":-123.017374,"d":"-123.01737"},"http://www.google.com/maps/place/52.927449,-123.017374",9059,"Rural",31,18,"No","Yes","Yes","No ","Baker Creek","FALSE","FALSE"]
[null,9060,"Redstone","No","No","No","Cariboo Regional District","Cariboo",{"$nulls":8},"","","",null,0,0,null,null,{"$f":"IF(AB1016=\"Y\",COUNT(#REF!), \"\")","v":""},null,"Redstone","N",{"v":52.1333,"d":"52.13330"},{"v":-123.699999,"d":"-123.70000"},"http://www.google.com/maps/place/52.1333,-123.699999",9060,"Rural",null,null,"No","No","No","No ","Redstone","FALSE","FALSE"]
[null,10003,"Martin Valley","No","No","No","Central Coast Regional District","Vancouver Island and Coast",{"$nulls":8},"","","",null,0,0,null,null,{"$f":"IF(AB1017=\"Y\",COUNT(#REF!), \"\")","v":""},null,"Martin Valley","N",{"v":52.361826,"d":"52.36183"},{"v":-127.723285,"d":"-127.72329"},"http://www.google.com/maps/place/52.361826,-127.723285",10003,"Rural",69,40,"No","Yes","No","No ","Martin Valley","FALSE","FALSE"]
[null,50501,"Taku River Tlingit*","No","No","No","Stikine Regional District (Unincorporated)","Nechako",{"$nulls":8},"","","",null,0,0,null,null,{"$f":"IF(AB1018=\"Y\",COUNT(#REF!), \"\")","v":0},null,"Taku River Tlingit","Y",{"v":59.505817395,"d":"59.50582"},{"v":-133.658689059,"d":"-133.65869"},"http://www.google.com/maps/place/59.505817395,-133.658689059",50501,"Rural First Nations Primary Reserve",162,100,"No","Yes","Yes","Yes ","Taku River Tlingit*","FALSE","FALSE"]
[null,50504,"Good Hope Lake (Dease River)*","No","No","No","Stikine Regional District (Unincorporated)","Nechako",{"$nulls":8},"","","",null,0,0,null,null,{"$f":"IF(AB1019=\"Y\",COUNT(#REF!), \"\")","v":0},null,"Good Hope Lake (Dease River)","Y",{"v":59.294676499,"d":"59.29468"},{"v":-129.288208096,"d":"-129.28821"},"http://www.google.com/maps/place/59.294676499,-129.288208096",50504,"Rural First Nations Primary Reserve",15,6,"No","Yes","Yes","No ","Good Hope Lake (Dease River)*","FALSE","FALSE"]
[null,50530,"Moricetown (Witset First Nation)*","Yes","Yes","Yes","Regional District of Kitimat-Stikine","North Coast",{"$nulls":8},"","","",null,0,0,null,null,{"$f":"IF(AB1020=\"Y\",COUNT(#REF!), \"\")","v":0},null,"Moricetown (Witset First Nation)","Y",{"v":55.021566266,"d":"55.02157"},{"v":-127.33091458,"d":"-127.33091"},"http://www.google.com/maps/place/55.021566266,-127.33091458",50530,"Rural First Nations Primary Reserve",651,236,"Yes","No","No","No ","Moricetown (Witset First Nation)*","FALSE","FALSE"]
[null,50531,"Hazelton (Gitanmaax)*","Yes","Yes","Yes","Regional District of Kitimat-Stikine","North Coast",{"$nulls":8},"","","",null,0,0,null,null,{"$f":"IF(AB1021=\"Y\",COUNT(#REF!), \"\")","v":0},null,"Hazelton (Gitanmaax)","Y",{"v":55.255671125,"d":"55.25567"},{"v":-127.675038195,"d":"-127.67504"},"http://www.google.com/maps/place/55.255671125,-127.675038195",50531,"Rural First Nations Secondary Reserve",818,317,"Yes","No","Yes","No ","Hazelton (Gitanmaax)*","FALSE","FALSE"]
[null,50532,"Kispiox*","Yes","Yes","Yes","Regional District of Kitimat-Stikine","North Coast",{"$nulls":8},"","","",null,0,0,null,null,{"$f":"IF(AB1022=\"Y\",COUNT(#REF!), \"\")","v":0},null,"Kispiox","Y",{"v":55.355299273,"d":"55.35530"},{"v":-127.691096164,"d":"-127.69110"},"http://www.google.com/maps/place/55.355299273,-127.691096164",50532,"Rural First Nations Primary Reserve",357,130,"Yes","No","Yes","No ","Kispiox*","FALSE","FALSE"]
[null,50533,"Glen Vowell*","Yes","Yes","Yes","Regional District of Kitimat-Stikine","North Coast",{"$nulls":8},"","","",null,0,0,null,null,{"$f":"IF(AB1023=\"Y\",COUNT(#REF!), \"\")","v":0},null,"Glen Vowell","Y",{"v":55.309967275,"d":"55.30997"},{"v":-127.674359142,"d":"-127.67436"},"http://www.google.com/maps/place/55.309967275,-127.674359142",50533,"Rural First Nations Primary Reserve",510,184,"No","No","No","No ","Glen Vowell*","FALSE","FALSE"]
[null,50534,"Hagwilget (Hagwilget Village)*","No","Yes","Yes","Regional District of Kitimat-Stikine","North Coast",{"$nulls":8},"","","",null,0,0,null,null,{"$f":"IF(AB1024=\"Y\",COUNT(#REF!), \"\")","v":0},null,"Hagwilget (Hagwilget Village)","Y",{"v":55.253538461,"d":"55.25354"},{"v":-127.600300568,"d":"-127.60030"},"http://www.google.com/maps/place/55.253538461,-127.600300568",50534,"Rural First Nations Primary Reserve",755,383,"No","No","Yes","No ","Hagwilget (Hagwilget Village)*","FALSE","FALSE"]
[null,50535,"Kitseguecla (Gitsegukla)*","No","No","Yes","Regional District of Kitimat-Stikine","North Coast",{"$nulls":8},"","","",null,0,0,null,null,{"$f":"IF(AB1025=\"Y\",COUNT(#REF!), \"\")","v":0},null,"Kitseguecla (Gitsegukla)","Y",{"v":55.087686089,"d":"55.08769"},{"v":-127.829590143,"d":"-127.82959"},"http://www.google.com/maps/place/55.087686089,-127.829590143",50535,"Rural First Nations Primary Reserve",427,143,"No","Yes","Yes","No ","Kitseguecla (Gitsegukla)*","FALSE","FALSE"]
[null,50536,"Kitwanga (Gitwangak)*","No","No","Yes","Regional District of Kitimat-Stikine","North Coast",{"$nulls":8},"","","",null,0,0,null,null,{"$f":"IF(AB1026=\"Y\",COUNT(#REF!), \"\")","v":0},null,"Kitwanga (Gitwangak)","Y",{"v":55.099255217,"d":"55.09926"},{"v":-128.06793311,"d":"-128.06793"},"http://www.google.com/maps/place/55.099255217,-128.06793311",50536,"Rural First Nations Primary Reserve",454,176,"No","Yes","Yes","No ","Kitwanga (Gitwangak)*","FALSE","FALSE"]
[null,50537,"Gitanyow*","No","No","No","Regional District of Kitimat-Stikine","North Coast",{"$nulls":8},"","","",null,0,0,null,null,{"$f":"IF(AB1027=\"Y\",COUNT(#REF!), \"\")","v":0},null,"Gitanyow","Y",{"v":55.26763522,"d":"55.26764"},{"v":-128.070618182,"d":"-128.07062"},"http://www.google.com/maps/place/55.26763522,-128.070618182",50537,"Rural First Nations Primary Reserve",436,137,"No","Yes","No","No ","Gitanyow*","FALSE","FALSE"]
[null,50538,"Bella Bella (Heiltsuk)*","No","Yes","Yes","Central Coast Regional District","Vancouver Island and Coast",{"$nulls":8},"","","",null,0,0,null,null,{"$f":"IF(AB1028=\"Y\",COUNT(#REF!), \"\")","v":0},null,"Bella Bella (Heiltsuk)","Y",{"v":52.169770157,"d":"52.16977"},{"v":-128.144901014,"d":"-128.14490"},"http://www.google.com/maps/place/52.169770157,-128.144901014",50538,"Rural First Nations Primary Reserve",944,436,"No","Yes","No","No ","Bella Bella (Heiltsuk)*","FALSE","FALSE"]
[null,50539,"Nuxalk Nation*","No","No","Yes","Central Coast Regional District","Vancouver Island and Coast",{"$nulls":8},"","","",null,0,0,null,null,{"$f":"IF(AB1029=\"Y\",COUNT(#REF!), \"\")","v":0},null,"Nuxalk Nation","Y",{"v":52.363600918,"d":"52.36360"},{"v":-126.710542817,"d":"-126.71054"},"http://www.google.com/maps/place/52.363600918,-126.710542817",50539,"Rural First Nations Secondary Reserve",945,372,"No","Yes","No","No ","Nuxalk Nation*","FALSE","FALSE"]
[null,50540,"Klemtu (Kitasoo)*","No","Yes","Yes","Regional District of Kitimat-Stikine","North Coast",{"$nulls":8},"","","",null,0,0,null,null,{"$f":"IF(AB1030=\"Y\",COUNT(#REF!), \"\")","v":0},null,"Klemtu (Kitasoo)","Y",{"v":52.590618481,"d":"52.59062"},{"v":-128.51967353,"d":"-128.51967"},"http://www.google.com/maps/place/52.590618481,-128.51967353",50540,"Rural First Nations Primary Reserve",292,103,"No","Yes","Yes","No ","Klemtu (Kitasoo)*","FALSE","FALSE"]
[null,50541,"Oweekeno (Wuikinuxv Nation)*","No","No","No","Central Coast Regional District","Vancouver Island and Coast",{"$nulls":8},"","","",null,0,0,null,null,{"$f":"IF(AB1031=\"Y\",COUNT(#REF!), \"\")","v":0},null,"Oweekeno (Wuikinuxv Nation)","Y",{"v":51.680112586,"d":"51.68011"},{"v":-127.23206379,"d":"-127.23206"},"http://www.google.com/maps/place/51.680112586,-127.23206379",50541,"Rural First Nations Primary Reserve",36,21,"No","Yes","Yes","No ","Oweekeno (Wuikinuxv Nation)*","FALSE","FALSE"]
[null,50542,"Saulteau First Nations*","No","No","Yes","Peace River Regional District","Northeast",{"$nulls":8},"","","",null,0,0,null,null,{"$f":"IF(AB1032=\"Y\",COUNT(#REF!), \"\")","v":0},null,"Saulteau First Nations","Y",{"v":55.852219195,"d":"55.85222"},{"v":-121.653003729,"d":"-121.65300"},"http://www.google.com/maps/place/55.852219195,-121.653003729",50542,"Rural First Nations Primary Reserve",291,101,"No","Yes","Yes","No ","Saulteau First Nations*","FALSE","FALSE"]
[null,50543,"Fort Nelson First Nation*","Yes","Yes","Yes","Northern Rockies Regional Municipality","Northeast",{"$nulls":8},"","","",null,0,0,null,null,{"$f":"IF(AB1033=\"Y\",COUNT(#REF!), \"\")","v":0},null,"Fort Nelson First Nation","Y",{"v":58.770105036,"d":"58.77011"},{"v":-122.659725939,"d":"-122.65973"},"http://www.google.com/maps/place/58.770105036,-122.659725939",50543,"Rural First Nations Primary Reserve",58,30,"No","Yes","Yes","No ","Fort Nelson First Nation*","FALSE","FALSE"]
[null,50544,"Prophet River First Nation*","No","No","Yes","Northern Rockies Regional Municipality","Northeast",{"$nulls":8},"","","",null,0,0,null,null,{"$f":"IF(AB1034=\"Y\",COUNT(#REF!), \"\")","v":0},null,"Prophet River First Nation","Y",{"v":58.092540436,"d":"58.09254"},{"v":-122.697530337,"d":"-122.69753"},"http://www.google.com/maps/place/58.092540436,-122.697530337",50544,"Rural First Nations Primary Reserve",106,76,"No","Yes","Yes","No ","Prophet River First Nation*","FALSE","FALSE"]
[null,50545,"West Moberly First Nations*","No","No","Yes","Peace River Regional District","Northeast",{"$nulls":8},"","","",null,0,0,null,null,{"$f":"IF(AB1035=\"Y\",COUNT(#REF!), \"\")","v":0},null,"West Moberly First Nations","Y",{"v":55.82791187,"d":"55.82791"},{"v":-121.852487973,"d":"-121.85249"},"http://www.google.com/maps/place/55.82791187,-121.852487973",50545,"Rural First Nations Primary Reserve",160,65,"No","Yes","Yes","No ","West Moberly First Nations*","FALSE","FALSE"]
[null,50546,"Halfway River First Nation*","No","No","Yes","Peace River Regional District","Northeast",{"$nulls":8},"","","",null,0,0,null,null,{"$f":"IF(AB1036=\"Y\",COUNT(#REF!), \"\")","v":0},null,"Halfway River First Nation","Y",{"v":56.513367,"d":"56.51337"},{"v":-121.964969,"d":"-121.96497"},"http://www.google.com/maps/place/56.513367,-121.964969",50546,"Rural First Nations Primary Reserve",172,61,"No","Yes","Yes","No ","Halfway River First Nation*","FALSE","FALSE"]
[null,50547,"Blueberry River First Nations*","No","No","No","Peace River Regional District","Northeast",{"$nulls":8},"","","",null,0,0,null,null,{"$f":"IF(AB1037=\"Y\",COUNT(#REF!), \"\")","v":0},null,"Blueberry River First Nations","Y",{"v":56.704040799,"d":"56.70404"},{"v":-121.112413197,"d":"-121.11241"},"http://www.google.com/maps/place/56.704040799,-121.112413197",50547,"Rural First Nations Primary Reserve",29,11,"No","Yes","No","No ","Blueberry River First Nations*","FALSE","FALSE"]
[null,50548,"Doig River First Nation*","No","No","Yes","Peace River Regional District","Northeast",{"$nulls":8},"","","",null,0,0,null,null,{"$f":"IF(AB1038=\"Y\",COUNT(#REF!), \"\")","v":0},null,"Doig River First Nation","Y",{"v":56.577853627,"d":"56.57785"},{"v":-120.495585061,"d":"-120.49559"},"http://www.google.com/maps/place/56.577853627,-120.495585061",50548,"Rural First Nations Primary Reserve",105,49,"No","Yes","Yes","No ","Doig River First Nation*","FALSE","FALSE"]
[null,50549,"Burrard (Tsleil-Waututh Nation)*","Yes","Yes","Yes","Metro Vancouver Regional District","Lower Mainland--Southwest",{"$nulls":8},"","","",null,0,0,null,null,{"$f":"IF(AB1039=\"Y\",COUNT(#REF!), \"\")","v":0},null,"Burrard (Tsleil-Waututh Nation)","Y",{"v":49.310978091,"d":"49.31098"},{"v":-122.989135369,"d":"-122.98914"},"http://www.google.com/maps/place/49.310978091,-122.989135369",50549,"Urban First Nations Primary Reserve",18670,6990,"Yes","No","No","No ","Burrard (Tsleil-Waututh Nation)*","FALSE","FALSE"]
[null,50550,"Musqueam*","Yes","Yes","Yes","Metro Vancouver Regional District","Lower Mainland--Southwest",{"$nulls":8},"","","",null,0,0,null,null,{"$f":"IF(AB1040=\"Y\",COUNT(#REF!), \"\")","v":0},null,"Musqueam","Y",49.22494,{"v":-123.1992,"d":"-123.19920"},"http://www.google.com/maps/place/49.22494,-123.1992",50550,"Urban First Nations Primary Reserve",2584,1023,"Yes","No","No","No ","Musqueam*","FALSE","FALSE"]
[null,50551,"Sechelt Indian Government District (Sechelt)*","Yes","Yes","Yes","Sunshine Coast Regional District","Lower Mainland--Southwest",{"$nulls":8},"","","",null,0,0,null,null,{"$f":"IF(AB1041=\"Y\",COUNT(#REF!), \"\")","v":0},null,"Sechelt Indian Government District (Sechelt)","Y",{"v":49.473899608,"d":"49.47390"},{"v":-123.749955536,"d":"-123.74996"},"http://www.google.com/maps/place/49.473899608,-123.749955536",50551,"Rural First Nations Primary Reserve",5865,2977,"Yes","No","Yes","No ","Sechelt Indian Government District (Sechelt)*","FALSE","FALSE"]
[null,50552,"Homalco*","No","Yes","Yes","Strathcona Regional District","Vancouver Island and Coast",{"$nulls":8},"","","",null,0,0,null,null,{"$f":"IF(AB1042=\"Y\",COUNT(#REF!), \"\")","v":0},null,"Homalco","Y",{"v":49.951639738,"d":"49.95164"},{"v":-125.243608422,"d":"-125.24361"},"http://www.google.com/maps/place/49.951639738,-125.243608422",50552,"Rural First Nations Primary Reserve",178,68,"No","Yes","Yes","No ","Homalco*","FALSE","FALSE"]
[null,50553,"Klahoose First Nation*","No","No","Yes","Strathcona Regional District","Vancouver Island and Coast",{"$nulls":8},"","","",null,0,0,null,null,{"$f":"IF(AB1043=\"Y\",COUNT(#REF!), \"\")","v":0},null,"Klahoose First Nation","Y",{"v":50.125831272,"d":"50.12583"},{"v":-124.921269027,"d":"-124.92127"},"http://www.google.com/maps/place/50.125831272,-124.921269027",50553,"Rural First Nations Primary Reserve",177,117,"No","Yes","Yes","No ","Klahoose First Nation*","FALSE","FALSE"]
[null,50554,"Sliammon (Tla'amin Nation)*","Yes","Yes","Yes",null,"Vancouver Island and Coast",{"$nulls":8},"","","",null,0,0,null,null,{"$f":"IF(AB1044=\"Y\",COUNT(#REF!), \"\")","v":0},null,"Sliammon (Tla'amin Nation)","Y",49.90059,{"v":-124.617391,"d":"-124.61739"},"http://www.google.com/maps/place/49.90059,-124.617391",50554,"Rural First Nations Primary Reserve",481,225,"Yes","No","No","No ","Sliammon (Tla'amin Nation)*","FALSE","FALSE"]
[null,50555,"Squamish*","Yes","Yes","Yes","Metro Vancouver Regional District","Lower Mainland--Southwest",{"$nulls":8},"","","",null,0,0,null,null,{"$f":"IF(AB1045=\"Y\",COUNT(#REF!), \"\")","v":0},null,"Squamish","Y",{"v":49.318261453,"d":"49.31826"},{"v":-123.083572229,"d":"-123.08357"},"http://www.google.com/maps/place/49.318261453,-123.083572229",50555,"Urban First Nations Primary Reserve",47239,20236,"Yes","No","Yes","No ","Squamish*","FALSE","FALSE"]
[null,50556,"N'Quatqua*","No","No","No","Squamish-Lillooet Regional District","Lower Mainland--Southwest",{"$nulls":8},"","","",null,0,0,null,null,{"$f":"IF(AB1046=\"Y\",COUNT(#REF!), \"\")","v":0},null,"N'Quatqua","Y",{"v":50.527549614,"d":"50.52755"},{"v":-122.484196977,"d":"-122.48420"},"http://www.google.com/maps/place/50.527549614,-122.484196977",50556,"Rural First Nations Primary Reserve",185,105,"No","Yes","Yes","No ","N'Quatqua*","FALSE","FALSE"]
[null,50557,"Mount Currie (Lil'wat Nation)*","Yes","Yes","Yes","Squamish-Lillooet Regional District","Lower Mainland--Southwest",{"$nulls":8},"","","",null,0,0,null,null,{"$f":"IF(AB1047=\"Y\",COUNT(#REF!), \"\")","v":0},null,"Mount Currie (Lil'wat Nation)","Y",{"v":50.33212805,"d":"50.33213"},{"v":-122.662688197,"d":"-122.66269"},"http://www.google.com/maps/place/50.33212805,-122.662688197",50557,"Rural First Nations Primary Reserve",753,247,"Yes","No","No","No ","Mount Currie (Lil'wat Nation)*","FALSE","FALSE"]
[null,50558,"Aitchelitz*","Yes","Yes","Yes","Fraser Valley Regional District","Lower Mainland--Southwest",{"$nulls":8},"","","",null,0,0,null,null,{"$f":"IF(AB1048=\"Y\",COUNT(#REF!), \"\")","v":0},null,"Aitchelitz","Y",{"v":49.150417311,"d":"49.15042"},{"v":-121.986896773,"d":"-121.98690"},"http://www.google.com/maps/place/49.150417311,-121.986896773",50558,"Rural First Nations Primary Reserve",27163,12788,"Yes","No","Yes","No ","Aitchelitz*","FALSE","FALSE"]
[null,50559,"Chehalis (Sts'ailes)*","Yes","Yes","Yes","Fraser Valley Regional District","Lower Mainland--Southwest",{"$nulls":8},"","","",null,0,0,null,null,{"$f":"IF(AB1049=\"Y\",COUNT(#REF!), \"\")","v":0},null,"Chehalis (Sts'ailes)","Y",{"v":49.298510556,"d":"49.29851"},{"v":-121.914171648,"d":"-121.91417"},"http://www.google.com/maps/place/49.298510556,-121.914171648",50559,"Rural First Nations Primary Reserve",532,168,"Yes","No","No","No ","Chehalis (Sts'ailes)*","FALSE","FALSE"]
[null,50560,"Kwikwetlem First Nation*","Yes","Yes","Yes","Metro Vancouver Regional District","Lower Mainland--Southwest",{"$nulls":8},"","","",null,0,0,null,null,{"$f":"IF(AB1050=\"Y\",COUNT(#REF!), \"\")","v":0},null,"Kwikwetlem First Nation","Y",{"v":49.230160912,"d":"49.23016"},{"v":-122.805957041,"d":"-122.80596"},"http://www.google.com/maps/place/49.230160912,-122.805957041",50560,"Urban First Nations Primary Reserve",47015,18042,"Yes","No","Yes","No ","Kwikwetlem First Nation*","FALSE","FALSE"]
[null,50561,"Douglas*","No","No","No","Fraser Valley Regional District","Lower Mainland--Southwest",{"$nulls":8},"","","",null,0,0,null,null,{"$f":"IF(AB1051=\"Y\",COUNT(#REF!), \"\")","v":0},null,"Douglas","Y",{"v":49.75599262,"d":"49.75599"},{"v":-122.201085099,"d":"-122.20109"},"http://www.google.com/maps/place/49.75599262,-122.201085099",50561,"Rural First Nations Primary Reserve",57,19,"No","Yes","Yes","No ","Douglas*","FALSE","FALSE"]
[null,50562,"Skookumchuck (Skatin Nations)*","No","No","No","Fraser Valley Regional District","Lower Mainland--Southwest",{"$nulls":8},"","","",null,0,0,null,null,{"$f":"IF(AB1052=\"Y\",COUNT(#REF!), \"\")","v":0},null,"Skookumchuck (Skatin Nations)","Y",{"v":49.938295825,"d":"49.93830"},{"v":-122.410397335,"d":"-122.41040"},"http://www.google.com/maps/place/49.938295825,-122.410397335",50562,"Rural First Nations Primary Reserve",85,28,"No","Yes","Yes","No ","Skookumchuck (Skatin Nations)*","FALSE","FALSE"]
[null,50563,"Katzie*","Yes","Yes","Yes","Metro Vancouver Regional District","Lower Mainland--Southwest",{"$nulls":8},"","","",null,0,0,null,null,{"$f":"IF(AB1053=\"Y\",COUNT(#REF!), \"\")","v":0},null,"Katzie","Y",{"v":49.201425396,"d":"49.20143"},{"v":-122.676930484,"d":"-122.67693"},"http://www.google.com/maps/place/49.201425396,-122.676930484",50563,"Urban First Nations Primary Reserve",16904,6634,"Yes","No","Yes","No ","Katzie*","FALSE","FALSE"]
[null,50564,"Kwantlen First Nation*","Yes","Yes","Yes","Metro Vancouver Regional District","Lower Mainland--Southwest",{"$nulls":8},"","","",null,0,0,null,null,{"$f":"IF(AB1054=\"Y\",COUNT(#REF!), \"\")","v":0},null,"Kwantlen First Nation","Y",{"v":49.171443898,"d":"49.17144"},{"v":-122.56549429,"d":"-122.56549"},"http://www.google.com/maps/place/49.171443898,-122.56549429",50564,"Rural First Nations Primary Reserve",5090,1930,"Yes","No","Yes","No ","Kwantlen First Nation*","FALSE","FALSE"]
[null,50565,"Matsqui*","Yes","Yes","Yes","Fraser Valley Regional District","Lower Mainland--Southwest",{"$nulls":8},"","","",null,0,0,null,null,{"$f":"IF(AB1055=\"Y\",COUNT(#REF!), \"\")","v":0},null,"Matsqui","Y",{"v":49.104450849,"d":"49.10445"},{"v":-122.338804672,"d":"-122.33880"},"http://www.google.com/maps/place/49.104450849,-122.338804672",50565,"Rural First Nations Primary Reserve",1756,575,"Yes","No","No","No ","Matsqui*","FALSE","FALSE"]
[null,50566,"New Westminster*","Yes","Yes","Yes","Metro Vancouver Regional District","Lower Mainland--Southwest",{"$nulls":8},"","","",null,0,0,null,null,{"$f":"IF(AB1056=\"Y\",COUNT(#REF!), \"\")","v":0},null,"New Westminster","Y",{"v":49.236323,"d":"49.23632"},{"v":-123.023974,"d":"-123.02397"},"http://www.google.com/maps/place/49.236323,-123.023974",50566,"Urban First Nations Secondary Reserve",155263,63204,"Yes","No","Yes","No ","New Westminster*","FALSE","FALSE"]
[null,50567,"Samahquam*","No","No","No","Fraser Valley Regional District","Lower Mainland--Southwest",{"$nulls":8},"","","",null,0,0,null,null,{"$f":"IF(AB1057=\"Y\",COUNT(#REF!), \"\")","v":0},null,"Samahquam","Y",{"v":49.990575735,"d":"49.99058"},{"v":-122.458107698,"d":"-122.45811"},"http://www.google.com/maps/place/49.990575735,-122.458107698",50567,"Rural First Nations Primary Reserve",10,3,"No","Yes","Yes","No ","Samahquam*","FALSE","FALSE"]
[null,50568,{"$f":"HYPERLINK(AE1058,AN1058)","v":"Scowlitz (Sq'éwlets)*"},"Yes","Yes","Yes","Fraser Valley Regional District","Lower Mainland--Southwest",{"$nulls":8},{"$f":"IF(L1058=\"\",\"\",\nIF(SUM((J1058*L1058)/M1058)<=N1058,\"Sufficient Capacity\",\nIF(SUM((J1058*L1058)/M1058)>N1058,\"Not Enough Capacity\",\"Error\")))","v":""},{"$f":"IF(OR(ISBLANK(J1058),ISBLANK(L1058),ISBLANK(M1058)), \"\",(J1058*L1058/M1058))","v":""},{"$f":"IF(AND(COUNT(N1058,R1058)=2, OR($O$10=\"Last-Mile\", $O$10=\"Transport & Last-Mile\")), N1058-R1058, \"\")","v":""},null,{"$f":"IF(AND(AB1058=\"Y\",I1058<>\"\"),1,0)","v":0},{"$f":"IF(AND(AB1058=\"Y\",I1058=\"Last-Mile & Transport\"),1,0)","v":0},null,null,{"$f":"IF(AB1058=\"Y\",COUNT(#REF!), \"\")","v":0},null,"Scowlitz (Sq'éwlets)","Y",{"v":49.2359419,"d":"49.23594"},{"v":-122.00245605,"d":"-122.00246"},"http://www.google.com/maps/place/49.2359419,-122.00245605",50568,"Rural First Nations Primary Reserve",796,432,"Yes","No","Yes","No ",{"$f":"IF(AB1058=\"Y\", CONCATENATE(AA1058,\"*\"), AA1058)","v":"Scowlitz (Sq'éwlets)*"},{"$f":"IF(I1058=\"Last-Mile\",\"TRUE\",IF(I1058=\"Transport & Last-Mile\",\"TRUE\",\"FALSE\"))","v":"FALSE"},{"$f":"IF(I1058=\"Transport\",\"TRUE\",IF(I1058=\"Transport & Last-Mile\",\"TRUE\",\"FALSE\"))","v":"FALSE"}]
[null,50569,"Semiahmoo*","Yes","Yes","Yes","Metro Vancouver Regional District","Lower Mainland--Southwest",{"$nulls":8},"","","",null,0,0,null,null,{"$f":"IF(AB1059=\"Y\",COUNT(#REF!), \"\")","v":0},null,"Semiahmoo","Y",{"v":49.014531999,"d":"49.01453"},{"v":-122.77774078,"d":"-122.77774"},"http://www.google.com/maps/place/49.014531999,-122.77774078",50569,"Rural First Nations Primary Reserve",13775,5676,"Yes","No","Yes","No ","Semiahmoo*","FALSE","FALSE"]
[null,50570,"Shxwhá:y Village*","Yes","Yes","Yes","Fraser Valley Regional District","Lower Mainland--Southwest",{"$nulls":8},"","","",null,0,0,null,null,{"$f":"IF(AB1060=\"Y\",COUNT(#REF!), \"\")","v":0},null,"Shxwhá:y Village","Y",{"v":49.168969803,"d":"49.16897"},{"v":-121.988923606,"d":"-121.98892"},"http://www.google.com/maps/place/49.168969803,-121.988923606",50570,"Rural First Nations Primary Reserve",27163,12788,"Yes","No","Yes","No ","Shxwhá:y Village*","FALSE","FALSE"]
[null,50571,"Skowkale*","Yes","Yes","Yes","Fraser Valley Regional District","Lower Mainland--Southwest",{"$nulls":8},"","","",null,0,0,null,null,{"$f":"IF(AB1061=\"Y\",COUNT(#REF!), \"\")","v":0},null,"Skowkale","Y",{"v":49.141712689,"d":"49.14171"},{"v":-121.940579261,"d":"-121.94058"},"http://www.google.com/maps/place/49.141712689,-121.940579261",50571,"Rural First Nations Primary Reserve",27163,12788,"Yes","No","Yes","No ","Skowkale*","FALSE","FALSE"]
[null,50572,"Soowahlie*","Yes","Yes","Yes","Fraser Valley Regional District","Lower Mainland--Southwest",{"$nulls":8},"","","",null,0,0,null,null,{"$f":"IF(AB1062=\"Y\",COUNT(#REF!), \"\")","v":0},null,"Soowahlie","Y",{"v":49.081020085,"d":"49.08102"},{"v":-121.968958886,"d":"-121.96896"},"http://www.google.com/maps/place/49.081020085,-121.968958886",50572,"Rural First Nations Primary Reserve",27513,10888,"Yes","No","Yes","No ","Soowahlie*","FALSE","FALSE"]
[null,50573,"Skwah*","Yes","Yes","Yes","Fraser Valley Regional District","Lower Mainland--Southwest",{"$nulls":8},"","","",null,0,0,null,null,{"$f":"IF(AB1063=\"Y\",COUNT(#REF!), \"\")","v":0},null,"Skwah","Y",{"v":49.177749134,"d":"49.17775"},{"v":-121.971968117,"d":"-121.97197"},"http://www.google.com/maps/place/49.177749134,-121.971968117",50573,"Urban First Nations Primary Reserve",7464,2914,"Yes","No","Yes","No ","Skwah*","FALSE","FALSE"]
[null,50574,"Squiala First Nation*","Yes","Yes","Yes","Fraser Valley Regional District","Lower Mainland--Southwest",{"$nulls":8},"","","",null,0,0,null,null,{"$f":"IF(AB1064=\"Y\",COUNT(#REF!), \"\")","v":0},null,"Squiala First Nation","Y",{"v":49.158014,"d":"49.15801"},{"v":-121.979421,"d":"-121.97942"},"http://www.google.com/maps/place/49.158014,-121.979421",50574,"Rural First Nations Primary Reserve",27163,12788,"Yes","No","No","No ","Squiala First Nation*","FALSE","FALSE"]
[null,50575,"Tzeachten*","Yes","Yes","Yes","Fraser Valley Regional District","Lower Mainland--Southwest",{"$nulls":8},"","","",null,0,0,null,null,{"$f":"IF(AB1065=\"Y\",COUNT(#REF!), \"\")","v":0},null,"Tzeachten","Y",{"v":49.111856,"d":"49.11186"},{"v":-121.953976,"d":"-121.95398"},"http://www.google.com/maps/place/49.111856,-121.953976",50575,"Urban First Nations Primary Reserve",27513,10888,"Yes","No","Yes","No ","Tzeachten*","FALSE","FALSE"]
[null,50576,"Yakweakwioose*","Yes","Yes","Yes","Fraser Valley Regional District","Lower Mainland--Southwest",{"$nulls":8},"","","",null,0,0,null,null,{"$f":"IF(AB1066=\"Y\",COUNT(#REF!), \"\")","v":0},null,"Yakweakwioose","Y",{"v":49.132615302,"d":"49.13262"},{"v":-121.938564952,"d":"-121.93856"},"http://www.google.com/maps/place/49.132615302,-121.938564952",50576,"Rural First Nations Primary Reserve",27163,12788,"Yes","No","Yes","No ","Yakweakwioose*","FALSE","FALSE"]
[null,50577,"Tsawwassen First Nation*","Yes","Yes","Yes","Metro Vancouver Regional District","Lower Mainland--Southwest",{"$nulls":8},"","","",null,0,0,null,null,{"$f":"IF(AB1067=\"Y\",COUNT(#REF!), \"\")","v":0},null,"Tsawwassen First Nation","Y",{"v":49.037882663,"d":"49.03788"},{"v":-123.097696314,"d":"-123.09770"},"http://www.google.com/maps/place/49.037882663,-123.097696314",50577,"Urban First Nations Primary Reserve",8716,3354,"Yes","No","Yes","No ","Tsawwassen First Nation*","FALSE","FALSE"]
[null,50578,"Sumas First Nation*","Yes","Yes","Yes","Fraser Valley Regional District","Lower Mainland--Southwest",{"$nulls":8},"","","",null,0,0,null,null,{"$f":"IF(AB1068=\"Y\",COUNT(#REF!), \"\")","v":0},null,"Sumas First Nation","Y",{"v":49.055516307,"d":"49.05552"},{"v":-122.195016475,"d":"-122.19502"},"http://www.google.com/maps/place/49.055516307,-122.195016475",50578,"Rural First Nations Primary Reserve",7918,3015,"Yes","No","No","No ","Sumas First Nation*","FALSE","FALSE"]
[null,50579,"Deroche (Leq' a: mel First Nation)*","Yes","Yes","Yes","Fraser Valley Regional District","Lower Mainland--Southwest",{"$nulls":8},"","","",null,0,0,null,null,{"$f":"IF(AB1069=\"Y\",COUNT(#REF!), \"\")","v":0},null,"Deroche (Leq' a: mel First Nation)","Y",{"v":49.187501866,"d":"49.18750"},{"v":-122.074570002,"d":"-122.07457"},"http://www.google.com/maps/place/49.187501866,-122.074570002",50579,"Rural First Nations Secondary Reserve",412,190,"Yes","No","No","No ","Deroche (Leq' a: mel First Nation)*","FALSE","FALSE"]
[null,50580,"Kwaw-kwaw-Apilt*","Yes","Yes","Yes","Fraser Valley Regional District","Lower Mainland--Southwest",{"$nulls":8},"","","",null,0,0,null,null,{"$f":"IF(AB1070=\"Y\",COUNT(#REF!), \"\")","v":0},null,"Kwaw-kwaw-Apilt","Y",{"v":49.166849682,"d":"49.16685"},{"v":-121.975245699,"d":"-121.97525"},"http://www.google.com/maps/place/49.166849682,-121.975245699",50580,"Urban First Nations Primary Reserve",27163,12788,"Yes","No","Yes","No ","Kwaw-kwaw-Apilt*","FALSE","FALSE"]
[null,50581,"Seabird Island*","No","Yes","Yes","Fraser Valley Regional District","Lower Mainland--Southwest",{"$nulls":8},"","","",null,0,0,null,null,{"$f":"IF(AB1071=\"Y\",COUNT(#REF!), \"\")","v":0},null,"Seabird Island","Y",{"v":49.255121717,"d":"49.25512"},{"v":-121.730396716,"d":"-121.73040"},"http://www.google.com/maps/place/49.255121717,-121.730396716",50581,"Rural First Nations Primary Reserve",730,245,"No","No","Yes","No ","Seabird Island*","FALSE","FALSE"]
[null,50582,"Skawahlook First Nation*","No","No","Yes","Fraser Valley Regional District","Lower Mainland--Southwest",{"$nulls":8},"","","",null,0,0,null,null,{"$f":"IF(AB1072=\"Y\",COUNT(#REF!), \"\")","v":0},null,"Skawahlook First Nation","Y",{"v":49.356845609,"d":"49.35685"},{"v":-121.606183637,"d":"-121.60618"},"http://www.google.com/maps/place/49.356845609,-121.606183637",50582,"Rural First Nations Primary Reserve",217,88,"No","No","Yes","No ","Skawahlook First Nation*","FALSE","FALSE"]
[null,50583,"Chawathil*","No","No","Yes","Fraser Valley Regional District","Lower Mainland--Southwest",{"$nulls":8},"","","",null,0,0,null,null,{"$f":"IF(AB1073=\"Y\",COUNT(#REF!), \"\")","v":0},null,"Chawathil","Y",{"v":49.369822294,"d":"49.36982"},{"v":-121.552604417,"d":"-121.55260"},"http://www.google.com/maps/place/49.369822294,-121.552604417",50583,"Rural First Nations Primary Reserve",394,160,"No","No","No","No ","Chawathil*","FALSE","FALSE"]
[null,50584,"Cheam*","Yes","Yes","Yes","Fraser Valley Regional District","Lower Mainland--Southwest",{"$nulls":8},"","","",null,0,0,null,null,{"$f":"IF(AB1074=\"Y\",COUNT(#REF!), \"\")","v":0},null,"Cheam","Y",{"v":49.189786987,"d":"49.18979"},{"v":-121.783488476,"d":"-121.78349"},"http://www.google.com/maps/place/49.189786987,-121.783488476",50584,"Rural First Nations Primary Reserve",2923,1074,"Yes","No","No","No ","Cheam*","FALSE","FALSE"]
[null,50585,"Popkum*","No","Yes","Yes","Fraser Valley Regional District","Lower Mainland--Southwest",{"$nulls":8},"","","",null,0,0,null,null,{"$f":"IF(AB1075=\"Y\",COUNT(#REF!), \"\")","v":0},null,"Popkum","Y",{"v":49.209512856,"d":"49.20951"},{"v":-121.710082836,"d":"-121.71008"},"http://www.google.com/maps/place/49.209512856,-121.710082836",50585,"Rural First Nations Primary Reserve",253,113,"No","No","Yes","No ","Popkum*","FALSE","FALSE"]
[null,50586,"Peters First Nation*","Yes","Yes","Yes","Fraser Valley Regional District","Lower Mainland--Southwest",{"$nulls":8},"","","",null,0,0,null,null,{"$f":"IF(AB1076=\"Y\",COUNT(#REF!), \"\")","v":0},null,"Peters First Nation","Y",{"v":49.293865117,"d":"49.29387"},{"v":-121.657945525,"d":"-121.65795"},"http://www.google.com/maps/place/49.293865117,-121.657945525",50586,"Rural First Nations Primary Reserve",38,18,"No","No","Yes","No ","Peters First Nation*","FALSE","FALSE"]
[null,50587,"Shxw'ow'hamel First Nation*","No","Yes","Yes","Fraser Valley Regional District","Lower Mainland--Southwest",{"$nulls":8},"","","",null,0,0,null,null,{"$f":"IF(AB1077=\"Y\",COUNT(#REF!), \"\")","v":0},null,"Shxw'ow'hamel First Nation","Y",{"v":49.343025919,"d":"49.34303"},{"v":-121.606664649,"d":"-121.60666"},"http://www.google.com/maps/place/49.343025919,-121.606664649",50587,"Rural First Nations Primary Reserve",217,88,"No","No","Yes","No ","Shxw'ow'hamel First Nation*","FALSE","FALSE"]
[null,50588,"Union Bar First Nation*","Yes","Yes","Yes","Fraser Valley Regional District","Lower Mainland--Southwest",{"$nulls":8},"","","",null,0,0,null,null,{"$f":"IF(AB1078=\"Y\",COUNT(#REF!), \"\")","v":0},null,"Union Bar First Nation","Y",{"v":49.435226,"d":"49.43523"},{"v":-121.438138,"d":"-121.43814"},"http://www.google.com/maps/place/49.435226,-121.438138",50588,"Rural First Nations Primary Reserve",49,35,"Yes","No","Yes","No ","Union Bar First Nation*","FALSE","FALSE"]
[null,50589,"Yale (Yale First Nation)*","Yes","Yes","Yes","Fraser Valley Regional District","Lower Mainland--Southwest",{"$nulls":8},"","","",null,0,0,null,null,{"$f":"IF(AB1079=\"Y\",COUNT(#REF!), \"\")","v":0},null,"Yale (Yale First Nation)","Y",{"v":49.562177161,"d":"49.56218"},{"v":-121.42601193,"d":"-121.42601"},"http://www.google.com/maps/place/49.562177161,-121.42601193",50589,"Rural First Nations Primary Reserve",122,92,"No","Yes","Yes","No ","Yale (Yale First Nation)*","FALSE","FALSE"]
[null,50590,"Bridge River*","No","No","Yes","Squamish-Lillooet Regional District","Lower Mainland--Southwest",{"$nulls":8},"","","",null,0,0,null,null,{"$f":"IF(AB1080=\"Y\",COUNT(#REF!), \"\")","v":0},null,"Bridge River","Y",{"v":50.769540807,"d":"50.76954"},{"v":-121.96409765,"d":"-121.96410"},"http://www.google.com/maps/place/50.769540807,-121.96409765",50590,"Rural First Nations Primary Reserve",208,79,"No","Yes","No","No ","Bridge River*","FALSE","FALSE"]
[null,50591,"Cayoose Creek*","No","No","Yes","Squamish-Lillooet Regional District","Lower Mainland--Southwest",{"$nulls":8},"","","",null,0,0,null,null,{"$f":"IF(AB1081=\"Y\",COUNT(#REF!), \"\")","v":0},null,"Cayoose Creek","Y",{"v":50.674303825,"d":"50.67430"},{"v":-121.934060123,"d":"-121.93406"},"http://www.google.com/maps/place/50.674303825,-121.934060123",50591,"Rural First Nations Primary Reserve",1790,965,"No","Yes","No","No ","Cayoose Creek*","FALSE","FALSE"]
[null,50592,"Xaxli'p*","No","No","No","Squamish-Lillooet Regional District","Lower Mainland--Southwest",{"$nulls":8},"","","",null,0,0,null,null,{"$f":"IF(AB1082=\"Y\",COUNT(#REF!), \"\")","v":0},null,"Xaxli'p","Y",{"v":50.734625224,"d":"50.73463"},{"v":-121.864423819,"d":"-121.86442"},"http://www.google.com/maps/place/50.734625224,-121.864423819",50592,"Rural First Nations Primary Reserve",107,51,"No","Yes","Yes","No ","Xaxli'p*","FALSE","FALSE"]
[null,50593,"T'it'q'et*","No","Yes","Yes","Squamish-Lillooet Regional District","Lower Mainland--Southwest",{"$nulls":8},"","","",null,0,0,null,null,{"$f":"IF(AB1083=\"Y\",COUNT(#REF!), \"\")","v":0},null,"T'it'q'et","Y",{"v":50.678208235,"d":"50.67821"},{"v":-121.942150103,"d":"-121.94215"},"http://www.google.com/maps/place/50.678208235,-121.942150103",50593,"Rural First Nations Primary Reserve",359,173,"No","Yes","Yes","No ","T'it'q'et*","FALSE","FALSE"]
[null,50594,"Pavilion (Ts'kw'aylaxw First Nation)*","No","No","No","Squamish-Lillooet Regional District","Lower Mainland--Southwest",{"$nulls":8},"","","",null,0,0,null,null,{"$f":"IF(AB1084=\"Y\",COUNT(#REF!), \"\")","v":0},null,"Pavilion (Ts'kw'aylaxw First Nation)","Y",{"v":50.885892747,"d":"50.88589"},{"v":-121.818992986,"d":"-121.81899"},"http://www.google.com/maps/place/50.885892747,-121.818992986",50594,"Rural First Nations Primary Reserve",52,25,"No","Yes","Yes","No ","Pavilion (Ts'kw'aylaxw First Nation)*","FALSE","FALSE"]
[null,50595,"Shalalth (Tsal'alh)*","No","No","No","Squamish-Lillooet Regional District","Lower Mainland--Southwest",{"$nulls":8},"","","",null,0,0,null,null,{"$f":"IF(AB1085=\"Y\",COUNT(#REF!), \"\")","v":0},null,"Shalalth (Tsal'alh)","Y",{"v":50.72916019,"d":"50.72916"},{"v":-122.214439072,"d":"-122.21444"},"http://www.google.com/maps/place/50.72916019,-122.214439072",50595,"Rural First Nations Secondary Reserve",133,55,"No","Yes","No","No ","Shalalth (Tsal'alh)*","FALSE","FALSE"]
[null,50596,"Osoyoos*","Yes","Yes","Yes","Regional District of Okanagan-Similkameen","Thompson--Okanagan",{"$nulls":8},"","","",null,0,0,null,null,{"$f":"IF(AB1086=\"Y\",COUNT(#REF!), \"\")","v":0},null,"Osoyoos","Y",{"v":49.184677743,"d":"49.18468"},{"v":-119.536597194,"d":"-119.53660"},"http://www.google.com/maps/place/49.184677743,-119.536597194",50596,"Rural First Nations Primary Reserve",5824,2714,"Yes","No","Yes","No ","Osoyoos*","FALSE","FALSE"]
[null,50597,"Penticton*","Yes","Yes","Yes","Regional District of Okanagan-Similkameen","Thompson--Okanagan",{"$nulls":8},"","","",null,0,0,null,null,{"$f":"IF(AB1087=\"Y\",COUNT(#REF!), \"\")","v":0},null,"Penticton","Y",{"v":49.49136808,"d":"49.49137"},{"v":-119.644762842,"d":"-119.64476"},"http://www.google.com/maps/place/49.49136808,-119.644762842",50597,"Rural First Nations Primary Reserve",18171,9566,"Yes","No","Yes","No ","Penticton*","FALSE","FALSE"]
[null,50598,"Lower Similkameen*","No","No","Yes","Regional District of Okanagan-Similkameen","Thompson--Okanagan",{"$nulls":8},"","","",null,0,0,null,null,{"$f":"IF(AB1088=\"Y\",COUNT(#REF!), \"\")","v":0},null,"Lower Similkameen","Y",{"v":49.051432157,"d":"49.05143"},{"v":-119.723798038,"d":"-119.72380"},"http://www.google.com/maps/place/49.051432157,-119.723798038",50598,"Rural First Nations Primary Reserve",87,34,"No","Yes","No","No ","Lower Similkameen*","FALSE","FALSE"]
[null,50599,"Upper Similkameen*","No","Yes","Yes","Regional District of Okanagan-Similkameen","Thompson--Okanagan",{"$nulls":8},"","","",null,0,0,null,null,{"$f":"IF(AB1089=\"Y\",COUNT(#REF!), \"\")","v":0},null,"Upper Similkameen","Y",{"v":49.355863031,"d":"49.35586"},{"v":-120.078733533,"d":"-120.07873"},"http://www.google.com/maps/place/49.355863031,-120.078733533",50599,"Rural First Nations Primary Reserve",240,164,"No","Yes","No","No ","Upper Similkameen*","FALSE","FALSE"]
[null,50600,"Spallumcheen (Splatsin)*","Yes","Yes","Yes","Regional District of North Okanagan","Thompson--Okanagan",{"$nulls":8},"","","",null,0,0,null,null,{"$f":"IF(AB1090=\"Y\",COUNT(#REF!), \"\")","v":0},null,"Spallumcheen (Splatsin)","Y",{"v":50.542514197,"d":"50.54251"},{"v":-119.138698037,"d":"-119.13870"},"http://www.google.com/maps/place/50.542514197,-119.138698037",50600,"Rural First Nations Primary Reserve",1985,970,"Yes","No","Yes","No ","Spallumcheen (Splatsin)*","FALSE","FALSE"]
[null,50601,"Westbank First Nation*","Yes","Yes","Yes","Regional District of Central Okanagan","Thompson--Okanagan",{"$nulls":8},"","","",null,0,0,null,null,{"$f":"IF(AB1091=\"Y\",COUNT(#REF!), \"\")","v":0},null,"Westbank First Nation","Y",{"v":49.834470504,"d":"49.83447"},{"v":-119.615793433,"d":"-119.61579"},"http://www.google.com/maps/place/49.834470504,-119.615793433",50601,"Urban First Nations Primary Reserve",20108,8809,"Yes","No","Yes","No ","Westbank First Nation*","FALSE","FALSE"]
[null,50602,"?aqam*","No","Yes","Yes","Regional District of East Kootenay","Kootenay",{"$nulls":8},"","","",null,0,0,null,null,{"$f":"IF(AB1092=\"Y\",COUNT(#REF!), \"\")","v":0},null,"?aqam","Y",{"v":49.583492611,"d":"49.58349"},{"v":-115.754511788,"d":"-115.75451"},"http://www.google.com/maps/place/49.583492611,-115.754511788",50602,"Rural First Nations Secondary Reserve",105,38,"No","No","Yes","No ","?aqam*","FALSE","FALSE"]
[null,50603,"Tobacco Plains*","No","No","Yes","Regional District of East Kootenay","Kootenay",{"$nulls":8},"","","",null,0,0,null,null,{"$f":"IF(AB1093=\"Y\",COUNT(#REF!), \"\")","v":0},null,"Tobacco Plains","Y",{"v":49.093333908,"d":"49.09333"},{"v":-115.081905417,"d":"-115.08191"},"http://www.google.com/maps/place/49.093333908,-115.081905417",50603,"Rural First Nations Primary Reserve",86,74,"No","Yes","No","No ","Tobacco Plains*","FALSE","FALSE"]
[null,50604,"?Akisq'nuk First Nation*","No","No","Yes","Regional District of East Kootenay","Kootenay",{"$nulls":8},"","","",{"$f":"COUNTA(J1094:J2335)","v":0},0,0,{"$f":"SUM(J1094:J2335)","v":0},{"$f":"COUNTA(#REF!)","v":1},{"$f":"IF(AB1094=\"Y\",COUNT(#REF!), \"\")","v":0},{"$f":"SUM(#REF!)","v":{"$error":"#REF!"}},"?Akisq'nuk First Nation","Y",{"v":50.411307768,"d":"50.41131"},{"v":-115.908159529,"d":"-115.90816"},"http://www.google.com/maps/place/50.411307768,-115.908159529",50604,"Rural First Nations Primary Reserve",61,50,"No","Yes","Yes","No ","?Akisq'nuk First Nation*","FALSE","FALSE"]
[null,50605,"Shuswap*","Yes","Yes","Yes","Regional District of East Kootenay","Kootenay",{"$nulls":8},"","","",null,0,0,null,null,{"$f":"IF(AB1095=\"Y\",COUNT(#REF!), \"\")","v":0},null,"Shuswap","Y",{"v":50.51585948,"d":"50.51586"},{"v":-116.007264788,"d":"-116.00726"},"http://www.google.com/maps/place/50.51585948,-116.007264788",50605,"Rural First Nations Primary Reserve",633,571,"Yes","No","Yes","No ","Shuswap*","FALSE","FALSE"]
[null,50606,"Lower Kootenay*","Yes","Yes","Yes","Regional District of Central Kootenay","Kootenay",{"$nulls":8},"","","",null,0,0,null,null,{"$f":"IF(AB1096=\"Y\",COUNT(#REF!), \"\")","v":0},null,"Lower Kootenay","Y",{"v":49.066742628,"d":"49.06674"},{"v":-116.516265401,"d":"-116.51627"},"http://www.google.com/maps/place/49.066742628,-116.516265401",50606,"Rural First Nations Primary Reserve",79,39,"No","No","No","No ","Lower Kootenay*","FALSE","FALSE"]
[null,50607,"Lake Babine Nation*","No","Yes","Yes","Bulkley Nechako Regional District","Nechako",{"$nulls":8},"","","",null,0,0,null,null,{"$f":"IF(AB1097=\"Y\",COUNT(#REF!), \"\")","v":0},null,"Lake Babine Nation","Y",{"v":54.238616625,"d":"54.23862"},{"v":-125.762517416,"d":"-125.76252"},"http://www.google.com/maps/place/54.238616625,-125.762517416",50607,"Rural First Nations Primary Reserve",2478,1013,"No","Yes","Yes","No ","Lake Babine Nation*","FALSE","FALSE"]
[null,50608,"Takla Landing (Takla Nation)*","No","No","No","Bulkley Nechako Regional District","Nechako",{"$nulls":8},"","","",null,0,0,null,null,{"$f":"IF(AB1098=\"Y\",COUNT(#REF!), \"\")","v":0},null,"Takla Landing (Takla Nation)","Y",{"v":55.482356,"d":"55.48236"},{"v":-125.975336,"d":"-125.97534"},"http://www.google.com/maps/place/55.482356,-125.975336",50608,"Rural First Nations Primary Reserve",75,34,"No","Yes","Yes","Yes ","Takla Landing (Takla Nation)*","FALSE","FALSE"]
[null,50609,"Tsay Keh Dene*","No","No","No","Peace River Regional District","Northeast",{"$nulls":8},"","","",null,0,0,null,null,{"$f":"IF(AB1099=\"Y\",COUNT(#REF!), \"\")","v":0},null,"Tsay Keh Dene","Y",{"v":56.892647,"d":"56.89265"},{"v":-124.962364,"d":"-124.96236"},"http://www.google.com/maps/place/56.892647,-124.962364",50609,"Remote First Nations Primary Reserve",5,1,"No","Yes","Yes","No ","Tsay Keh Dene*","FALSE","FALSE"]
[null,50610,"Fort Ware (Kwadacha)*","No","No","No","Peace River Regional District","Northeast",{"$nulls":8},"","","",null,0,0,null,null,{"$f":"IF(AB1100=\"Y\",COUNT(#REF!), \"\")","v":0},null,"Fort Ware (Kwadacha)","Y",{"v":57.42367325,"d":"57.42367"},{"v":-125.630282177,"d":"-125.63028"},"http://www.google.com/maps/place/57.42367325,-125.630282177",50610,"Remote First Nations Primary Reserve",332,128,"No","Yes","Yes","No ","Fort Ware (Kwadacha)*","FALSE","FALSE"]
[null,50611,"Lheidli T'enneh*","Yes","Yes","Yes","Regional District of Fraser-Fort George","Cariboo",{"$nulls":8},"","","",null,0,0,null,null,{"$f":"IF(AB1101=\"Y\",COUNT(#REF!), \"\")","v":0},null,"Lheidli T'enneh","Y",{"v":54.008833527,"d":"54.00883"},{"v":-122.614301486,"d":"-122.61430"},"http://www.google.com/maps/place/54.008833527,-122.614301486",50611,"Rural First Nations Primary Reserve",305,119,"No","No","Yes","No ","Lheidli T'enneh*","FALSE","FALSE"]
[null,50612,"Nadleh Whuten*","Yes","Yes","Yes","Bulkley Nechako Regional District","Nechako",{"$nulls":8},"","","",null,0,0,null,null,{"$f":"IF(AB1102=\"Y\",COUNT(#REF!), \"\")","v":0},null,"Nadleh Whuten","Y",{"v":54.086247902,"d":"54.08625"},{"v":-124.590887052,"d":"-124.59089"},"http://www.google.com/maps/place/54.086247902,-124.590887052",50612,"Rural First Nations Primary Reserve",211,109,"No","Yes","No","No ","Nadleh Whuten*","FALSE","FALSE"]
[null,50613,"Stellat'en First Nation*","Yes","Yes","Yes","Bulkley Nechako Regional District","Nechako",{"$nulls":8},"","","",null,0,0,null,null,{"$f":"IF(AB1103=\"Y\",COUNT(#REF!), \"\")","v":0},null,"Stellat'en First Nation","Y",{"v":54.063796504,"d":"54.06380"},{"v":-124.911113623,"d":"-124.91111"},"http://www.google.com/maps/place/54.063796504,-124.911113623",50613,"Rural First Nations Primary Reserve",275,100,"No","Yes","No","No ","Stellat'en First Nation*","FALSE","FALSE"]
[null,50614,"Nak'azdli Whut'en*","Yes","Yes","Yes","Bulkley Nechako Regional District","Nechako",{"$nulls":8},"","","",null,0,0,null,null,{"$f":"IF(AB1104=\"Y\",COUNT(#REF!), \"\")","v":0},null,"Nak'azdli Whut'en","Y",{"v":54.438457861,"d":"54.43846"},{"v":-124.250154361,"d":"-124.25015"},"http://www.google.com/maps/place/54.438457861,-124.250154361",50614,"Rural First Nations Primary Reserve",1598,736,"No","Yes","No","No ","Nak'azdli Whut'en*","FALSE","FALSE"]
[null,50615,"Saik'uz First Nation*","Yes","Yes","Yes","Bulkley Nechako Regional District","Nechako",{"$nulls":8},"","","",null,0,0,null,null,{"$f":"IF(AB1105=\"Y\",COUNT(#REF!), \"\")","v":0},null,"Saik'uz First Nation","Y",{"v":53.943390537,"d":"53.94339"},{"v":-124.114033181,"d":"-124.11403"},"http://www.google.com/maps/place/53.943390537,-124.114033181",50615,"Rural First Nations Primary Reserve",245,96,"No","Yes","Yes","No ","Saik'uz First Nation*","FALSE","FALSE"]
[null,50616,"Okanagan*","Yes","Yes","Yes","Regional District of North Okanagan","Thompson--Okanagan",{"$nulls":8},"","","",null,0,0,null,null,{"$f":"IF(AB1106=\"Y\",COUNT(#REF!), \"\")","v":0},null,"Okanagan","Y",{"v":50.356222024,"d":"50.35622"},{"v":-119.318103845,"d":"-119.31810"},"http://www.google.com/maps/place/50.356222024,-119.318103845",50616,"Rural First Nations Primary Reserve",957,481,"Yes","No","No","No ","Okanagan*","FALSE","FALSE"]
[null,50617,"Sunnyside (Tl'azt'en Nation)*","No","No","Yes","Bulkley Nechako Regional District","Nechako",{"$nulls":8},"","","",null,0,0,null,null,{"$f":"IF(AB1107=\"Y\",COUNT(#REF!), \"\")","v":0},null,"Sunnyside (Tl'azt'en Nation)","Y",{"v":54.655868834,"d":"54.65587"},{"v":-124.723572847,"d":"-124.72357"},"http://www.google.com/maps/place/54.655868834,-124.723572847",50617,"Rural First Nations Secondary Reserve",401,114,"No","Yes","No","No ","Sunnyside (Tl'azt'en Nation)*","FALSE","FALSE"]
[null,50618,"McLeod Lake*","No","No","Yes","Regional District of Fraser-Fort George","Cariboo",{"$nulls":8},"","","",null,0,0,null,null,{"$f":"IF(AB1108=\"Y\",COUNT(#REF!), \"\")","v":0},null,"McLeod Lake","Y",{"v":54.984563978,"d":"54.98456"},{"v":-123.045835417,"d":"-123.04584"},"http://www.google.com/maps/place/54.984563978,-123.045835417",50618,"Rural First Nations Primary Reserve",129,81,"No","Yes","No","No ","McLeod Lake*","FALSE","FALSE"]
[null,50619,"Burns Lake*","No","Yes","Yes","Bulkley Nechako Regional District","Nechako",{"$nulls":8},"","","",null,0,0,null,null,{"$f":"IF(AB1109=\"Y\",COUNT(#REF!), \"\")","v":0},null,"Burns Lake","Y",{"v":54.236657095,"d":"54.23666"},{"v":-125.771112955,"d":"-125.77111"},"http://www.google.com/maps/place/54.236657095,-125.771112955",50619,"Rural First Nations Primary Reserve",2478,1013,"No","Yes","No","No ","Burns Lake*","FALSE","FALSE"]
[null,50620,"Cheslatta Carrier Nation*","No","No","Yes","Bulkley Nechako Regional District","Nechako",{"$nulls":8},"","","",null,0,0,null,null,{"$f":"IF(AB1110=\"Y\",COUNT(#REF!), \"\")","v":0},null,"Cheslatta Carrier Nation","Y",{"v":54.002474907,"d":"54.00247"},{"v":-125.714104902,"d":"-125.71410"},"http://www.google.com/maps/place/54.002474907,-125.714104902",50620,"Rural First Nations Primary Reserve",38,30,"No","Yes","No","No ","Cheslatta Carrier Nation*","FALSE","FALSE"]
[null,50622,"Campbell River No.11*","Yes","Yes","Yes","Strathcona Regional District","Vancouver Island and Coast",{"$nulls":8},"","","",null,0,0,null,null,{"$f":"IF(AB1111=\"Y\",COUNT(#REF!), \"\")","v":0},null,"Campbell River No.11","Y",{"v":50.031657403,"d":"50.03166"},{"v":-125.247919353,"d":"-125.24792"},"http://www.google.com/maps/place/50.031657403,-125.247919353",50622,"Urban First Nations Primary Reserve",6241,3178,"Yes","No","No","No ","Campbell River No.11*","FALSE","FALSE"]
[null,50623,"Cape Mudge*","Yes","Yes","Yes","Strathcona Regional District","Vancouver Island and Coast",{"$nulls":8},"","","",null,0,0,null,null,{"$f":"IF(AB1112=\"Y\",COUNT(#REF!), \"\")","v":0},null,"Cape Mudge","Y",{"v":50.018405453,"d":"50.01841"},{"v":-125.290922893,"d":"-125.29092"},"http://www.google.com/maps/place/50.018405453,-125.290922893",50623,"Urban First Nations Primary Reserve",6372,2852,"Yes","No","No","No ","Cape Mudge*","FALSE","FALSE"]
[null,50624,"Comox (K'ómoks First Nation)*","Yes","Yes","Yes","Comox Valley Regional District","Vancouver Island and Coast",{"$nulls":8},"","","",null,0,0,null,null,{"$f":"IF(AB1113=\"Y\",COUNT(#REF!), \"\")","v":0},null,"Comox (K'ómoks First Nation)","Y",{"v":49.6787687,"d":"49.67877"},{"v":-124.958903812,"d":"-124.95890"},"http://www.google.com/maps/place/49.6787687,-124.958903812",50624,"Rural First Nations Primary Reserve",9659,4816,"Yes","No","No","No ","Comox (K'ómoks First Nation)*","FALSE","FALSE"]
[null,50625,"Health Bay (Kwikwasut'inuxw Haxwa'mis)*","No","No","No","Regional District of Mount Waddington","Vancouver Island and Coast",{"$nulls":8},"","","",null,0,0,null,null,{"$f":"IF(AB1114=\"Y\",COUNT(#REF!), \"\")","v":0},null,"Health Bay (Kwikwasut'inuxw Haxwa'mis)","Y",{"v":50.696396786,"d":"50.69640"},{"v":-126.600633263,"d":"-126.60063"},"http://www.google.com/maps/place/50.696396786,-126.600633263",50625,"Rural First Nations Primary Reserve",27,20,"No","Yes","No","No ","Health Bay (Kwikwasut'inuxw Haxwa'mis)*","FALSE","FALSE"]
[null,50626,"Kwakiutl*","Yes","Yes","Yes","Regional District of Mount Waddington","Vancouver Island and Coast",{"$nulls":8},"","","",null,0,0,null,null,{"$f":"IF(AB1115=\"Y\",COUNT(#REF!), \"\")","v":0},null,"Kwakiutl","Y",{"v":50.694496009,"d":"50.69450"},{"v":-127.408677014,"d":"-127.40868"},"http://www.google.com/maps/place/50.694496009,-127.408677014",50626,"Rural First Nations Primary Reserve",453,193,"Yes","No","Yes","No ","Kwakiutl*","FALSE","FALSE"]
[null,50627,"Gwawaenuk Tribe*","No","No","No","Regional District of Mount Waddington","Vancouver Island and Coast",{"$nulls":8},"","","",null,0,0,null,null,{"$f":"IF(AB1116=\"Y\",COUNT(#REF!), \"\")","v":0},null,"Gwawaenuk Tribe","Y",{"v":50.924020743,"d":"50.92402"},{"v":-126.82213322,"d":"-126.82213"},"http://www.google.com/maps/place/50.924020743,-126.82213322",50627,"Rural First Nations Primary Reserve",5,2,"No","Yes","Yes","No ","Gwawaenuk Tribe*","FALSE","FALSE"]
[null,50628,"Kwiakah*","No","No","No","Strathcona Regional District","Vancouver Island and Coast",{"$nulls":8},"","","",null,0,0,null,null,{"$f":"IF(AB1117=\"Y\",COUNT(#REF!), \"\")","v":0},null,"Kwiakah","Y",{"v":50.422685992,"d":"50.42269"},{"v":-125.157760384,"d":"-125.15776"},"http://www.google.com/maps/place/50.422685992,-125.157760384",50628,"Rural First Nations Secondary Reserve",null,null,"No","No","Yes","No ","Kwiakah*","FALSE","FALSE"]
[null,50629,"Mamalilikulla-Qwe'Qwa'Sot'Em (Mamalilikulla First Nation)*","No","No","Yes","Regional District of Mount Waddington","Vancouver Island and Coast",{"$nulls":8},"","","",null,0,0,null,null,{"$f":"IF(AB1118=\"Y\",COUNT(#REF!), \"\")","v":0},null,"Mamalilikulla-Qwe'Qwa'Sot'Em (Mamalilikulla First Nation)","Y",{"v":50.59424358,"d":"50.59424"},{"v":-126.682328314,"d":"-126.68233"},"http://www.google.com/maps/place/50.59424358,-126.682328314",50629,"Rural First Nations Primary Reserve",5,4,"No","Yes","No","No ","Mamalilikulla-Qwe'Qwa'Sot'Em (Mamalilikulla First Nation)*","FALSE","FALSE"]
[null,50630,"Mowachaht/Muchalaht*","No","No","No","Strathcona Regional District","Vancouver Island and Coast",{"$nulls":8},"","","",null,0,0,null,null,{"$f":"IF(AB1119=\"Y\",COUNT(#REF!), \"\")","v":0},null,"Mowachaht/Muchalaht","Y",{"v":49.811040011,"d":"49.81104"},{"v":-126.07186484,"d":"-126.07186"},"http://www.google.com/maps/place/49.811040011,-126.07186484",50630,"Rural First Nations Primary Reserve",187,61,"No","Yes","No","No ","Mowachaht/Muchalaht*","FALSE","FALSE"]
[null,50631,"Namgis First Nation*","No","No","Yes","Regional District of Mount Waddington","Vancouver Island and Coast",{"$nulls":8},"","","",null,0,0,null,null,{"$f":"IF(AB1120=\"Y\",COUNT(#REF!), \"\")","v":0},null,"Namgis First Nation","Y",{"v":50.596006166,"d":"50.59601"},{"v":-126.935274432,"d":"-126.93527"},"http://www.google.com/maps/place/50.596006166,-126.935274432",50631,"Rural First Nations Primary Reserve",622,302,"No","Yes","No","No ","Namgis First Nation*","FALSE","FALSE"]
[null,50632,"Bull Harbour (Tlatlasikwala)*","No","No","No","Regional District of Mount Waddington","Vancouver Island and Coast",{"$nulls":8},"","","",null,0,0,null,null,{"$f":"IF(AB1121=\"Y\",COUNT(#REF!), \"\")","v":0},null,"Bull Harbour (Tlatlasikwala)","Y",{"v":50.922475255,"d":"50.92248"},{"v":-127.93998874,"d":"-127.93999"},"http://www.google.com/maps/place/50.922475255,-127.93998874",50632,"Rural First Nations Primary Reserve",0,7,"No","Yes","No","No ","Bull Harbour (Tlatlasikwala)*","FALSE","FALSE"]
[null,50633,{"$f":"HYPERLINK(AE1122,AN1122)","v":"Quatsino First Nation*"},"No","No","Yes","Regional District of Mount Waddington","Vancouver Island and Coast",{"$nulls":8},{"$f":"IF(L1122=\"\",\"\",\nIF(SUM((J1122*L1122)/M1122)<=N1122,\"Sufficient Capacity\",\nIF(SUM((J1122*L1122)/M1122)>N1122,\"Not Enough Capacity\",\"Error\")))","v":""},{"$f":"IF(OR(ISBLANK(J1122),ISBLANK(L1122),ISBLANK(M1122)), \"\",(J1122*L1122/M1122))","v":""},{"$f":"IF(AND(COUNT(N1122,R1122)=2, OR($O$10=\"Last-Mile\", $O$10=\"Transport & Last-Mile\")), N1122-R1122, \"\")","v":""},null,{"$f":"IF(AND(AB1122=\"Y\",I1122<>\"\"),1,0)","v":0},{"$f":"IF(AND(AB1122=\"Y\",I1122=\"Last-Mile & Transport\"),1,0)","v":0},null,null,{"$f":"IF(AB1122=\"Y\",COUNT(#REF!), \"\")","v":0},null,"Quatsino First Nation","Y",{"v":50.614095,"d":"50.61410"},-127.57128,"http://www.google.com/maps/place/50.614095,-127.57128",50633,"Rural First Nations Primary Reserve",227,82,"No","Yes","Yes","No ",{"$f":"IF(AB1122=\"Y\", CONCATENATE(AA1122,\"*\"), AA1122)","v":"Quatsino First Nation*"},{"$f":"IF(I1122=\"Last-Mile\",\"TRUE\",IF(I1122=\"Transport & Last-Mile\",\"TRUE\",\"FALSE\"))","v":"FALSE"},{"$f":"IF(I1122=\"Transport\",\"TRUE\",IF(I1122=\"Transport & Last-Mile\",\"TRUE\",\"FALSE\"))","v":"FALSE"}]
[null,50634,"Ehattesaht*","No","No","No","Strathcona Regional District","Vancouver Island and Coast",{"$nulls":8},"","","",null,0,0,null,null,{"$f":"IF(AB1123=\"Y\",COUNT(#REF!), \"\")","v":0},null,"Ehattesaht","Y",{"v":49.873929015,"d":"49.87393"},{"v":-126.979280349,"d":"-126.97928"},"http://www.google.com/maps/place/49.873929015,-126.979280349",50634,"Rural First Nations Primary Reserve",4,13,"No","Yes","No","No ","Ehattesaht*","FALSE","FALSE"]
[null,50635,"Da'naxda'xw First Nation*","No","No","No","Regional District of Mount Waddington","Vancouver Island and Coast",{"$nulls":8},"","","",null,0,0,null,null,{"$f":"IF(AB1124=\"Y\",COUNT(#REF!), \"\")","v":0},null,"Da'naxda'xw First Nation","Y",{"v":51.015832512,"d":"51.01583"},{"v":-125.614468897,"d":"-125.61447"},"http://www.google.com/maps/place/51.015832512,-125.614468897",50635,"Rural First Nations Secondary Reserve",3,9,"No","Yes","No","No ","Da'naxda'xw First Nation*","FALSE","FALSE"]
[null,50636,"Kingcome (Dzawada'enuxw First Nation)*","No","No","No","Regional District of Mount Waddington","Vancouver Island and Coast",{"$nulls":8},"","","",null,0,0,null,null,{"$f":"IF(AB1125=\"Y\",COUNT(#REF!), \"\")","v":0},null,"Kingcome (Dzawada'enuxw First Nation)","Y",{"v":50.977275534,"d":"50.97728"},{"v":-126.180201254,"d":"-126.18020"},"http://www.google.com/maps/place/50.977275534,-126.180201254",50636,"Rural First Nations Primary Reserve",78,45,"No","Yes","Yes","No ","Kingcome (Dzawada'enuxw First Nation)*","FALSE","FALSE"]
[null,50637,"Tlowitsis Tribe*","No","No","No","Strathcona Regional District","Vancouver Island and Coast",{"$nulls":8},"","","",null,0,0,null,null,{"$f":"IF(AB1126=\"Y\",COUNT(#REF!), \"\")","v":0},null,"Tlowitsis Tribe","Y",{"v":50.528704148,"d":"50.52870"},{"v":-125.988071676,"d":"-125.98807"},"http://www.google.com/maps/place/50.528704148,-125.988071676",50637,"Rural First Nations Primary Reserve",2,4,"No","Yes","No","No ","Tlowitsis Tribe*","FALSE","FALSE"]
[null,50638,"Kyuquot (Ka:'yu:'k't'h'/Che:k:tles7et'h' First Nations)*","No","No","No","Strathcona Regional District","Vancouver Island and Coast",{"$nulls":8},"","","",null,0,0,null,null,{"$f":"IF(AB1127=\"Y\",COUNT(#REF!), \"\")","v":0},null,"Kyuquot (Ka:'yu:'k't'h'/Che:k:tles7et'h' First Nations)","Y",{"v":50.030573782,"d":"50.03057"},{"v":-127.37823364,"d":"-127.37823"},"http://www.google.com/maps/place/50.030573782,-127.37823364",50638,"Rural First Nations Primary Reserve",181,53,"No","Yes","Yes","No ","Kyuquot (Ka:'yu:'k't'h'/Che:k:tles7et'h' First Nations)*","FALSE","FALSE"]
[null,50639,"Nuchatlaht*","No","No","No","Strathcona Regional District","Vancouver Island and Coast",{"$nulls":8},"","","",null,0,0,null,null,{"$f":"IF(AB1128=\"Y\",COUNT(#REF!), \"\")","v":0},null,"Nuchatlaht","Y",{"v":49.990261631,"d":"49.99026"},{"v":-126.942083034,"d":"-126.94208"},"http://www.google.com/maps/place/49.990261631,-126.942083034",50639,"Rural First Nations Primary Reserve",23,8,"No","Yes","Yes","No ","Nuchatlaht*","FALSE","FALSE"]
[null,50640,"Beecher Bay*","Yes","Yes","Yes","Capital Regional District","Vancouver Island and Coast",{"$nulls":8},"","","",null,0,0,null,null,{"$f":"IF(AB1129=\"Y\",COUNT(#REF!), \"\")","v":0},null,"Beecher Bay","Y",{"v":48.337563767,"d":"48.33756"},{"v":-123.608301999,"d":"-123.60830"},"http://www.google.com/maps/place/48.337563767,-123.608301999",50640,"Rural First Nations Primary Reserve",1348,563,"Yes","No","Yes","No ","Beecher Bay*","FALSE","FALSE"]
[null,50641,"Chemainus (Stz'uminus First Nation)*","Yes","Yes","Yes","Cowichan Valley Regional District","Vancouver Island and Coast",{"$nulls":8},"","","",null,0,0,null,null,{"$f":"IF(AB1130=\"Y\",COUNT(#REF!), \"\")","v":0},null,"Chemainus (Stz'uminus First Nation)","Y",{"v":48.993023934,"d":"48.99302"},{"v":-123.772111335,"d":"-123.77211"},"http://www.google.com/maps/place/48.993023934,-123.772111335",50641,"Rural First Nations Primary Reserve",971,316,"Yes","No","No","No ","Chemainus (Stz'uminus First Nation)*","FALSE","FALSE"]
[null,50642,"Cowichan*","Yes","Yes","Yes","Cowichan Valley Regional District","Vancouver Island and Coast",{"$nulls":8},"","","",null,0,0,null,null,{"$f":"IF(AB1131=\"Y\",COUNT(#REF!), \"\")","v":0},null,"Cowichan","Y",{"v":48.776217696,"d":"48.77622"},{"v":-123.709288442,"d":"-123.70929"},"http://www.google.com/maps/place/48.776217696,-123.709288442",50642,"Rural First Nations Secondary Reserve",13267,6189,"Yes","No","No","No ","Cowichan*","FALSE","FALSE"]
[null,50643,"Lake Cowichan First Nation*","Yes","Yes","Yes","Cowichan Valley Regional District","Vancouver Island and Coast",{"$nulls":8},"","","",null,0,0,null,null,{"$f":"IF(AB1132=\"Y\",COUNT(#REF!), \"\")","v":0},null,"Lake Cowichan First Nation","Y",{"v":48.82604956,"d":"48.82605"},{"v":-124.069746544,"d":"-124.06975"},"http://www.google.com/maps/place/48.82604956,-124.069746544",50643,"Rural First Nations Primary Reserve",2864,1388,"Yes","No","No","No ","Lake Cowichan First Nation*","FALSE","FALSE"]
[null,50644,"Esquimalt*","Yes","Yes","Yes","Capital Regional District","Vancouver Island and Coast",{"$nulls":8},"","","",null,0,0,null,null,{"$f":"IF(AB1133=\"Y\",COUNT(#REF!), \"\")","v":0},null,"Esquimalt","Y",{"v":48.444930034,"d":"48.44493"},{"v":-123.430415926,"d":"-123.43042"},"http://www.google.com/maps/place/48.444930034,-123.430415926",50644,"Rural First Nations Primary Reserve",42282,21677,"Yes","No","No","No ","Esquimalt*","FALSE","FALSE"]
[null,50645,"Halalt*","Yes","Yes","Yes","Cowichan Valley Regional District","Vancouver Island and Coast",{"$nulls":8},"","","",null,0,0,null,null,{"$f":"IF(AB1134=\"Y\",COUNT(#REF!), \"\")","v":0},null,"Halalt","Y",{"v":48.873995042,"d":"48.87400"},{"v":-123.696124543,"d":"-123.69612"},"http://www.google.com/maps/place/48.873995042,-123.696124543",50645,"Rural First Nations Primary Reserve",712,273,"Yes","No","No","No ","Halalt*","FALSE","FALSE"]
[null,50646,"Lyackson*","No","No","Yes","Cowichan Valley Regional District","Vancouver Island and Coast",{"$nulls":8},"","","",null,0,0,null,null,{"$f":"IF(AB1135=\"Y\",COUNT(#REF!), \"\")","v":0},null,"Lyackson","Y",{"v":49.042106631,"d":"49.04211"},{"v":-123.643271134,"d":"-123.64327"},"http://www.google.com/maps/place/49.042106631,-123.643271134",50646,"Rural First Nations Primary Reserve",null,null,"No","No","Yes","No ","Lyackson*","FALSE","FALSE"]
[null,50647,"Malahat Nation*","Yes","Yes","Yes","Cowichan Valley Regional District","Vancouver Island and Coast",{"$nulls":8},"","","",null,0,0,null,null,{"$f":"IF(AB1136=\"Y\",COUNT(#REF!), \"\")","v":0},null,"Malahat Nation","Y",{"v":48.613672616,"d":"48.61367"},{"v":-123.520412907,"d":"-123.52041"},"http://www.google.com/maps/place/48.613672616,-123.520412907",50647,"Rural First Nations Primary Reserve",2278,895,"Yes","No","Yes","No ","Malahat Nation*","FALSE","FALSE"]
[null,50648,"Snuneymuxw First Nation*","Yes","Yes","Yes","Regional District of Nanaimo","Vancouver Island and Coast",{"$nulls":8},"","","",null,0,0,null,null,{"$f":"IF(AB1137=\"Y\",COUNT(#REF!), \"\")","v":0},null,"Snuneymuxw First Nation","Y",{"v":49.15166709,"d":"49.15167"},{"v":-123.930277307,"d":"-123.93028"},"http://www.google.com/maps/place/49.15166709,-123.930277307",50648,"Rural First Nations Primary Reserve",1551,760,"Yes","No","Yes","No ","Snuneymuxw First Nation*","FALSE","FALSE"]
[null,50649,"Nanoose First Nation*","Yes","Yes","Yes","Regional District of Nanaimo","Vancouver Island and Coast",{"$nulls":8},"","","",null,0,0,null,null,{"$f":"IF(AB1138=\"Y\",COUNT(#REF!), \"\")","v":0},null,"Nanoose First Nation","Y",{"v":49.252999981,"d":"49.25300"},{"v":-124.130031842,"d":"-124.13003"},"http://www.google.com/maps/place/49.252999981,-124.130031842",50649,"Rural First Nations Primary Reserve",1996,914,"Yes","No","No","No ","Nanoose First Nation*","FALSE","FALSE"]
[null,50650,"Penelakut (Penelakut Tribe)*","Yes","Yes","Yes","Cowichan Valley Regional District","Vancouver Island and Coast",{"$nulls":8},"","","",null,0,0,null,null,{"$f":"IF(AB1139=\"Y\",COUNT(#REF!), \"\")","v":0},null,"Penelakut (Penelakut Tribe)","Y",{"v":48.97149163,"d":"48.97149"},{"v":-123.658393775,"d":"-123.65839"},"http://www.google.com/maps/place/48.97149163,-123.658393775",50650,"Rural First Nations Primary Reserve",724,348,"No","No","Yes","No ","Penelakut (Penelakut Tribe)*","FALSE","FALSE"]
[null,50651,"Qualicum First Nation*","Yes","Yes","Yes","Regional District of Nanaimo","Vancouver Island and Coast",{"$nulls":8},"","","",null,0,0,null,null,{"$f":"IF(AB1140=\"Y\",COUNT(#REF!), \"\")","v":0},null,"Qualicum First Nation","Y",{"v":49.394389896,"d":"49.39439"},{"v":-124.61630108,"d":"-124.61630"},"http://www.google.com/maps/place/49.394389896,-124.61630108",50651,"Rural First Nations Primary Reserve",1027,593,"Yes","No","Yes","No ","Qualicum First Nation*","FALSE","FALSE"]
[null,50652,"Pauquachin*","Yes","Yes","Yes","Capital Regional District","Vancouver Island and Coast",{"$nulls":8},"","","",null,0,0,null,null,{"$f":"IF(AB1141=\"Y\",COUNT(#REF!), \"\")","v":0},null,"Pauquachin","Y",{"v":48.627153456,"d":"48.62715"},{"v":-123.458456922,"d":"-123.45846"},"http://www.google.com/maps/place/48.627153456,-123.458456922",50652,"Urban First Nations Primary Reserve",1713,710,"Yes","No","Yes","No ","Pauquachin*","FALSE","FALSE"]
[null,50653,"Tsartlip*","Yes","Yes","Yes","Capital Regional District","Vancouver Island and Coast",{"$nulls":8},"","","",null,0,0,null,null,{"$f":"IF(AB1142=\"Y\",COUNT(#REF!), \"\")","v":0},null,"Tsartlip","Y",{"v":48.581272331,"d":"48.58127"},{"v":-123.467466399,"d":"-123.46747"},"http://www.google.com/maps/place/48.581272331,-123.467466399",50653,"Rural First Nations Primary Reserve",7409,3123,"Yes","No","No","No ","Tsartlip*","FALSE","FALSE"]
[null,50654,"Tsawout First Nation*","Yes","Yes","Yes","Capital Regional District","Vancouver Island and Coast",{"$nulls":8},"","","",null,0,0,null,null,{"$f":"IF(AB1143=\"Y\",COUNT(#REF!), \"\")","v":0},null,"Tsawout First Nation","Y",{"v":48.591983,"d":"48.59198"},-123.39068,"http://www.google.com/maps/place/48.591983,-123.39068",50654,"Urban First Nations Primary Reserve",9159,3979,"Yes","No","Yes","No ","Tsawout First Nation*","FALSE","FALSE"]
[null,50655,"Tseycum*","Yes","Yes","Yes","Capital Regional District","Vancouver Island and Coast",{"$nulls":8},"","","",null,0,0,null,null,{"$f":"IF(AB1144=\"Y\",COUNT(#REF!), \"\")","v":0},null,"Tseycum","Y",{"v":48.666039486,"d":"48.66604"},{"v":-123.451344362,"d":"-123.45134"},"http://www.google.com/maps/place/48.666039486,-123.451344362",50655,"Rural First Nations Primary Reserve",2946,1364,"Yes","No","No","No ","Tseycum*","FALSE","FALSE"]
[null,50656,"Songhees Nation (Songhees First Nation)*","Yes","Yes","Yes","Capital Regional District","Vancouver Island and Coast",{"$nulls":8},"","","",null,0,0,null,null,{"$f":"IF(AB1145=\"Y\",COUNT(#REF!), \"\")","v":0},null,"Songhees Nation (Songhees First Nation)","Y",48.44143,{"v":-123.428152,"d":"-123.42815"},"http://www.google.com/maps/place/48.44143,-123.428152",50656,"Rural First Nations Primary Reserve",42282,21677,"Yes","No","Yes","No ","Songhees Nation (Songhees First Nation)*","FALSE","FALSE"]
[null,50657,"T'Sou-ke First Nation*","Yes","Yes","Yes","Capital Regional District","Vancouver Island and Coast",{"$nulls":8},"","","",null,0,0,null,null,{"$f":"IF(AB1146=\"Y\",COUNT(#REF!), \"\")","v":0},null,"T'Sou-ke First Nation","Y",{"v":48.384648022,"d":"48.38465"},{"v":-123.697181191,"d":"-123.69718"},"http://www.google.com/maps/place/48.384648022,-123.697181191",50657,"Rural First Nations Primary Reserve",6136,2793,"Yes","No","Yes","No ","T'Sou-ke First Nation*","FALSE","FALSE"]
[null,50658,"Pacheedaht First Nation*","No","No","No","Capital Regional District","Vancouver Island and Coast",{"$nulls":8},"","","",null,0,0,null,null,{"$f":"IF(AB1147=\"Y\",COUNT(#REF!), \"\")","v":0},null,"Pacheedaht First Nation","Y",{"v":48.576773609,"d":"48.57677"},{"v":-124.407701127,"d":"-124.40770"},"http://www.google.com/maps/place/48.576773609,-124.407701127",50658,"Rural First Nations Primary Reserve",72,36,"No","Yes","Yes","No ","Pacheedaht First Nation*","FALSE","FALSE"]
[null,50659,"Ahousaht*","No","No","No","Regional District of Alberni-Clayoquot","Vancouver Island and Coast",{"$nulls":8},"","","",null,0,0,null,null,{"$f":"IF(AB1148=\"Y\",COUNT(#REF!), \"\")","v":0},null,"Ahousaht","Y",{"v":49.275433361,"d":"49.27543"},{"v":-126.057568756,"d":"-126.05757"},"http://www.google.com/maps/place/49.275433361,-126.057568756",50659,"Rural First Nations Secondary Reserve",607,192,"No","Yes","Yes","No ","Ahousaht*","FALSE","FALSE"]
[null,50660,"Opitsat (Tla-o-qui-aht First Nations)*","No","No","Yes","Regional District of Alberni-Clayoquot","Vancouver Island and Coast",{"$nulls":8},"","","",null,0,0,null,null,{"$f":"IF(AB1149=\"Y\",COUNT(#REF!), \"\")","v":0},null,"Opitsat (Tla-o-qui-aht First Nations)","Y",{"v":49.173348235,"d":"49.17335"},{"v":-125.912071784,"d":"-125.91207"},"http://www.google.com/maps/place/49.173348235,-125.912071784",50660,"Rural First Nations Primary Reserve",511,241,"Yes","No","Yes","No ","Opitsat (Tla-o-qui-aht First Nations)*","FALSE","FALSE"]
[null,50661,"Hesquiaht*","No","Yes","Yes","Regional District of Alberni-Clayoquot","Vancouver Island and Coast",{"$nulls":8},"","","",null,0,0,null,null,{"$f":"IF(AB1150=\"Y\",COUNT(#REF!), \"\")","v":0},null,"Hesquiaht","Y",{"v":49.366486915,"d":"49.36649"},{"v":-126.273015536,"d":"-126.27302"},"http://www.google.com/maps/place/49.366486915,-126.273015536",50661,"Rural First Nations Primary Reserve",44,40,"No","Yes","Yes","No ","Hesquiaht*","FALSE","FALSE"]
[null,50662,"Ditidaht*","No","No","No","Cowichan Valley Regional District","Vancouver Island and Coast",{"$nulls":8},"","","",null,0,0,null,null,{"$f":"IF(AB1151=\"Y\",COUNT(#REF!), \"\")","v":0},null,"Ditidaht","Y",{"v":48.809278517,"d":"48.80928"},{"v":-124.669701742,"d":"-124.66970"},"http://www.google.com/maps/place/48.809278517,-124.669701742",50662,"Rural First Nations Primary Reserve",163,74,"No","Yes","No","No ","Ditidaht*","FALSE","FALSE"]
[null,50663,"Huu-ay-aht First Nations*","No","No","No","Regional District of Alberni-Clayoquot","Vancouver Island and Coast",{"$nulls":8},"","","",null,0,0,null,null,{"$f":"IF(AB1152=\"Y\",COUNT(#REF!), \"\")","v":0},null,"Huu-ay-aht First Nations","Y",{"v":48.80207854,"d":"48.80208"},{"v":-125.127155567,"d":"-125.12716"},"http://www.google.com/maps/place/48.80207854,-125.127155567",50663,"Rural First Nations Primary Reserve",94,75,"No","Yes","No","No ","Huu-ay-aht First Nations*","FALSE","FALSE"]
[null,50664,"Hupacasath First Nation*","Yes","Yes","Yes","Regional District of Alberni-Clayoquot","Vancouver Island and Coast",{"$nulls":8},"","","",null,0,0,null,null,{"$f":"IF(AB1153=\"Y\",COUNT(#REF!), \"\")","v":0},null,"Hupacasath First Nation","Y",{"v":49.26579844,"d":"49.26580"},{"v":-124.825090475,"d":"-124.82509"},"http://www.google.com/maps/place/49.26579844,-124.825090475",50664,"Rural First Nations Primary Reserve",8294,3960,"Yes","No","No","No ","Hupacasath First Nation*","FALSE","FALSE"]
[null,50665,"Tseshaht*","Yes","Yes","Yes","Regional District of Alberni-Clayoquot","Vancouver Island and Coast",{"$nulls":8},"","","",null,0,0,null,null,{"$f":"IF(AB1154=\"Y\",COUNT(#REF!), \"\")","v":0},null,"Tseshaht","Y",{"v":49.267225,"d":"49.26723"},{"v":-124.848919,"d":"-124.84892"},"http://www.google.com/maps/place/49.267225,-124.848919",50665,"Rural First Nations Primary Reserve",1870,844,"Yes","No","Yes","No ","Tseshaht*","FALSE","FALSE"]
[null,50666,"Toquaht*","Yes","Yes","Yes","Regional District of Alberni-Clayoquot","Vancouver Island and Coast",{"$nulls":8},"","","",null,0,0,null,null,{"$f":"IF(AB1155=\"Y\",COUNT(#REF!), \"\")","v":0},null,"Toquaht","Y",{"v":48.945046,"d":"48.94505"},{"v":-125.556988,"d":"-125.55699"},"http://www.google.com/maps/place/48.945046,-125.556988",50666,"Rural First Nations Secondary Reserve",1071,540,"Yes","No","No","No ","Toquaht*","FALSE","FALSE"]
[null,50667,"Uchucklesaht*","No","No","No","Regional District of Alberni-Clayoquot","Vancouver Island and Coast",{"$nulls":8},"","","",null,0,0,null,null,{"$f":"IF(AB1156=\"Y\",COUNT(#REF!), \"\")","v":0},null,"Uchucklesaht","Y",{"v":49.024,"d":"49.02400"},{"v":-125.04,"d":"-125.04000"},"http://www.google.com/maps/place/49.024,-125.04",50667,"Rural First Nations Primary Reserve",10,49,"No","Yes","Yes","No ","Uchucklesaht*","FALSE","FALSE"]
[null,50668,"Ucluelet First Nation*","Yes","Yes","Yes","Regional District of Alberni-Clayoquot","Vancouver Island and Coast",{"$nulls":8},"","","",null,0,0,null,null,{"$f":"IF(AB1157=\"Y\",COUNT(#REF!), \"\")","v":0},null,"Ucluelet First Nation","Y",{"v":48.936417171,"d":"48.93642"},{"v":-125.52596562,"d":"-125.52597"},"http://www.google.com/maps/place/48.936417171,-125.52596562",50668,"Rural First Nations Primary Reserve",1075,474,"Yes","No","Yes","No ","Ucluelet First Nation*","FALSE","FALSE"]
[null,50669,"Old Massett (Old Massett Village Council)*","No","Yes","Yes","North Coast Regional District","North Coast",{"$nulls":8},"","","",null,0,0,null,null,{"$f":"IF(AB1158=\"Y\",COUNT(#REF!), \"\")","v":0},null,"Old Massett (Old Massett Village Council)","Y",{"v":54.034414102,"d":"54.03441"},{"v":-132.175030324,"d":"-132.17503"},"http://www.google.com/maps/place/54.034414102,-132.175030324",50669,"Rural First Nations Primary Reserve",788,412,"No","Yes","No","No ","Old Massett (Old Massett Village Council)*","FALSE","FALSE"]
[null,50670,"Skidegate*","No","No","Yes","North Coast Regional District","North Coast",{"$nulls":8},"","","",null,0,0,null,null,{"$f":"IF(AB1159=\"Y\",COUNT(#REF!), \"\")","v":0},null,"Skidegate","Y",{"v":53.266887,"d":"53.26689"},{"v":-131.989501,"d":"-131.98950"},"http://www.google.com/maps/place/53.266887,-131.989501",50670,"Rural First Nations Primary Reserve",836,382,"No","Yes","Yes","No ","Skidegate*","FALSE","FALSE"]
[null,50671,"Nisga'a Village of Gingolx*","No","No","Yes","Regional District of Kitimat-Stikine","North Coast",{"$nulls":8},"","","",null,0,0,null,null,{"$f":"IF(AB1160=\"Y\",COUNT(#REF!), \"\")","v":0},null,"Nisga'a Village of Gingolx","Y",{"v":54.994412418,"d":"54.99441"},{"v":-129.957333439,"d":"-129.95733"},"http://www.google.com/maps/place/54.994412418,-129.957333439",50671,"Rural First Nations Primary Reserve",365,140,"No","Yes","Yes","No ","Nisga'a Village of Gingolx*","FALSE","FALSE"]
[null,50672,"Kitkatla (Gitxaala Nation)*","No","No","No","North Coast Regional District","North Coast",{"$nulls":8},"","","",null,0,0,null,null,{"$f":"IF(AB1161=\"Y\",COUNT(#REF!), \"\")","v":0},null,"Kitkatla (Gitxaala Nation)","Y",{"v":53.796382118,"d":"53.79638"},{"v":-130.433075895,"d":"-130.43308"},"http://www.google.com/maps/place/53.796382118,-130.433075895",50672,"Rural First Nations Primary Reserve",353,143,"No","Yes","Yes","No ","Kitkatla (Gitxaala Nation)*","FALSE","FALSE"]
[null,50673,"Metlakatla First Nation*","Yes","Yes","Yes","North Coast Regional District","North Coast",{"$nulls":8},"","","",null,0,0,null,null,{"$f":"IF(AB1162=\"Y\",COUNT(#REF!), \"\")","v":0},null,"Metlakatla First Nation","Y",{"v":54.336949561,"d":"54.33695"},{"v":-130.444229115,"d":"-130.44423"},"http://www.google.com/maps/place/54.336949561,-130.444229115",50673,"Rural First Nations Primary Reserve",83,48,"No","Yes","No","No ","Metlakatla First Nation*","FALSE","FALSE"]
[null,50674,"Lax Kw'alaams*","No","No","No","North Coast Regional District","North Coast",{"$nulls":8},"","","",null,0,0,null,null,{"$f":"IF(AB1163=\"Y\",COUNT(#REF!), \"\")","v":0},null,"Lax Kw'alaams","Y",{"v":54.558568174,"d":"54.55857"},{"v":-130.433140512,"d":"-130.43314"},"http://www.google.com/maps/place/54.558568174,-130.433140512",50674,"Rural First Nations Primary Reserve",476,218,"No","Yes","Yes","No ","Lax Kw'alaams*","FALSE","FALSE"]
[null,50675,"Hartley Bay (Gitga'at First Nation)*","No","No","Yes","North Coast Regional District","North Coast",{"$nulls":8},"","","",null,0,0,null,null,{"$f":"IF(AB1164=\"Y\",COUNT(#REF!), \"\")","v":0},null,"Hartley Bay (Gitga'at First Nation)","Y",{"v":53.424005194,"d":"53.42401"},{"v":-129.253277582,"d":"-129.25328"},"http://www.google.com/maps/place/53.424005194,-129.253277582",50675,"Rural First Nations Primary Reserve",81,73,"No","Yes","Yes","No ","Hartley Bay (Gitga'at First Nation)*","FALSE","FALSE"]
[null,50676,"Kitamaat Village (Haisla Nation)*","Yes","Yes","Yes","Regional District of Kitimat-Stikine","North Coast",{"$nulls":8},"","","",null,0,0,null,null,{"$f":"IF(AB1165=\"Y\",COUNT(#REF!), \"\")","v":0},null,"Kitamaat Village (Haisla Nation)","Y",{"v":53.975475403,"d":"53.97548"},{"v":-128.645930028,"d":"-128.64593"},"http://www.google.com/maps/place/53.975475403,-128.645930028",50676,"Rural First Nations Primary Reserve",525,197,"Yes","No","Yes","No ","Kitamaat Village (Haisla Nation)*","FALSE","FALSE"]
[null,50677,"New Aiyansh (Nisga'a Village of New Aiyansh)*","No","No","Yes","Regional District of Kitimat-Stikine","North Coast",{"$nulls":8},"","","",null,0,0,null,null,{"$f":"IF(AB1166=\"Y\",COUNT(#REF!), \"\")","v":0},null,"New Aiyansh (Nisga'a Village of New Aiyansh)","Y",55.20553,{"v":-129.078713,"d":"-129.07871"},"http://www.google.com/maps/place/55.20553,-129.078713",50677,"Rural First Nations Primary Reserve",215,97,"No","Yes","No","No ","New Aiyansh (Nisga'a Village of New Aiyansh)*","FALSE","FALSE"]
[null,50678,"Laxgalts'ap (Nisga'a Village of Laxgalt'sap)*","No","No","Yes","Regional District of Kitimat-Stikine","North Coast",{"$nulls":8},"","","",null,0,0,null,null,{"$f":"IF(AB1167=\"Y\",COUNT(#REF!), \"\")","v":0},null,"Laxgalts'ap (Nisga'a Village of Laxgalt'sap)","Y",{"v":55.033876528,"d":"55.03388"},{"v":-129.5794391,"d":"-129.57944"},"http://www.google.com/maps/place/55.033876528,-129.5794391",50678,"Rural First Nations Primary Reserve",349,115,"No","Yes","Yes","No ","Laxgalts'ap (Nisga'a Village of Laxgalt'sap)*","FALSE","FALSE"]
[null,50679,"Gitwinksihlkw (Nisga'a Village of Gitwinksihlkw)*","No","No","No","Regional District of Kitimat-Stikine","North Coast",{"$nulls":8},"","","",null,0,0,null,null,{"$f":"IF(AB1168=\"Y\",COUNT(#REF!), \"\")","v":0},null,"Gitwinksihlkw (Nisga'a Village of Gitwinksihlkw)","Y",{"v":55.192522304,"d":"55.19252"},{"v":-129.220901072,"d":"-129.22090"},"http://www.google.com/maps/place/55.192522304,-129.220901072",50679,"Rural First Nations Primary Reserve",193,53,"No","Yes","No","No ","Gitwinksihlkw (Nisga'a Village of Gitwinksihlkw)*","FALSE","FALSE"]
[null,50680,"Kitselas*","Yes","Yes","Yes","Regional District of Kitimat-Stikine","North Coast",{"$nulls":8},"","","",null,0,0,null,null,{"$f":"IF(AB1169=\"Y\",COUNT(#REF!), \"\")","v":0},null,"Kitselas","Y",{"v":54.493313704,"d":"54.49331"},{"v":-128.583467649,"d":"-128.58347"},"http://www.google.com/maps/place/54.493313704,-128.583467649",50680,"Rural First Nations Primary Reserve",594,272,"Yes","No","Yes","No ","Kitselas*","FALSE","FALSE"]
[null,50681,"Kitsumkalum*","Yes","Yes","Yes","Regional District of Kitimat-Stikine","North Coast",{"$nulls":8},"","","",null,0,0,null,null,{"$f":"IF(AB1170=\"Y\",COUNT(#REF!), \"\")","v":0},null,"Kitsumkalum","Y",{"v":54.522887,"d":"54.52289"},{"v":-128.667329,"d":"-128.66733"},"http://www.google.com/maps/place/54.522887,-128.667329",50681,"Rural First Nations Primary Reserve",1236,498,"Yes","No","Yes","No ","Kitsumkalum*","FALSE","FALSE"]
[null,50682,"Telegraph Creek (Tahltan)*","No","No","No","Regional District of Kitimat-Stikine","North Coast",{"$nulls":8},"","","",null,0,0,null,null,{"$f":"IF(AB1171=\"Y\",COUNT(#REF!), \"\")","v":0},null,"Telegraph Creek (Tahltan)","Y",{"v":57.906884789,"d":"57.90688"},{"v":-131.160409854,"d":"-131.16041"},"http://www.google.com/maps/place/57.906884789,-131.160409854",50682,"Rural First Nations Primary Reserve",83,62,"No","Yes","Yes","No ","Telegraph Creek (Tahltan)*","FALSE","FALSE"]
[null,50683,"Iskut*","No","No","No","Regional District of Kitimat-Stikine","North Coast",{"$nulls":8},"","","",null,0,0,null,null,{"$f":"IF(AB1172=\"Y\",COUNT(#REF!), \"\")","v":0},null,"Iskut","Y",{"v":57.837182435,"d":"57.83718"},{"v":-129.989173096,"d":"-129.98917"},"http://www.google.com/maps/place/57.837182435,-129.989173096",50683,"Rural First Nations Primary Reserve",297,126,"No","Yes","Yes","No ","Iskut*","FALSE","FALSE"]
[null,50684,"Adams Lake*","No","No","Yes","Thompson-Nicola Regional District","Thompson--Okanagan",{"$nulls":8},"","","",null,0,0,null,null,{"$f":"IF(AB1173=\"Y\",COUNT(#REF!), \"\")","v":0},null,"Adams Lake","Y",{"v":50.828685489,"d":"50.82869"},{"v":-119.701465439,"d":"-119.70147"},"http://www.google.com/maps/place/50.828685489,-119.701465439",50684,"Rural First Nations Primary Reserve",2605,1302,"No","Yes","No","No ","Adams Lake*","FALSE","FALSE"]
[null,50685,"Ashcroft*","No","No","Yes","Thompson-Nicola Regional District","Thompson--Okanagan",{"$nulls":8},"","","",null,0,0,null,null,{"$f":"IF(AB1174=\"Y\",COUNT(#REF!), \"\")","v":0},null,"Ashcroft","Y",{"v":50.720386885,"d":"50.72039"},{"v":-121.322474811,"d":"-121.32247"},"http://www.google.com/maps/place/50.720386885,-121.322474811",50685,"Rural First Nations Primary Reserve",1302,669,"No","Yes","No","No ","Ashcroft*","FALSE","FALSE"]
[null,50686,"Bonaparte*","No","No","Yes","Thompson-Nicola Regional District","Thompson--Okanagan",{"$nulls":8},"","","",null,0,0,null,null,{"$f":"IF(AB1175=\"Y\",COUNT(#REF!), \"\")","v":0},null,"Bonaparte","Y",{"v":50.842151949,"d":"50.84215"},{"v":-121.385288531,"d":"-121.38529"},"http://www.google.com/maps/place/50.842151949,-121.385288531",50686,"Rural First Nations Primary Reserve",127,54,"No","Yes","No","No ","Bonaparte*","FALSE","FALSE"]
[null,50687,"Skeetchestn*","No","No","No","Thompson-Nicola Regional District","Thompson--Okanagan",{"$nulls":8},"","","",null,0,0,null,null,{"$f":"IF(AB1176=\"Y\",COUNT(#REF!), \"\")","v":0},null,"Skeetchestn","Y",{"v":50.840870956,"d":"50.84087"},{"v":-120.945864717,"d":"-120.94586"},"http://www.google.com/maps/place/50.840870956,-120.945864717",50687,"Rural First Nations Primary Reserve",181,82,"No","Yes","Yes","No ","Skeetchestn*","FALSE","FALSE"]
[null,50688,"Tk'emlúps te Secwépemc*","Yes","Yes","Yes","Thompson-Nicola Regional District","Thompson--Okanagan",{"$nulls":8},"","","",null,0,0,null,null,{"$f":"IF(AB1177=\"Y\",COUNT(#REF!), \"\")","v":0},null,"Tk'emlúps te Secwépemc","Y",{"v":50.682038305,"d":"50.68204"},{"v":-120.296506554,"d":"-120.29651"},"http://www.google.com/maps/place/50.682038305,-120.296506554",50688,"Rural First Nations Secondary Reserve",7330,3074,"Yes","No","Yes","No ","Tk'emlúps te Secwépemc*","FALSE","FALSE"]
[null,50689,"Little Shuswap Lake*","No","Yes","Yes","Columbia-Shuswap Regional District","Thompson--Okanagan",{"$nulls":8},"","","",null,0,0,null,null,{"$f":"IF(AB1178=\"Y\",COUNT(#REF!), \"\")","v":0},null,"Little Shuswap Lake","Y",{"v":50.870243535,"d":"50.87024"},{"v":-119.599653325,"d":"-119.59965"},"http://www.google.com/maps/place/50.870243535,-119.599653325",50689,"Rural First Nations Primary Reserve",77,93,"No","Yes","Yes","No ","Little Shuswap Lake*","FALSE","FALSE"]
[null,50690,"Neskonlith*","Yes","Yes","Yes","Thompson-Nicola Regional District","Thompson--Okanagan",{"$nulls":8},"","","",null,0,0,null,null,{"$f":"IF(AB1179=\"Y\",COUNT(#REF!), \"\")","v":0},null,"Neskonlith","Y",{"v":50.773332534,"d":"50.77333"},{"v":-119.730580052,"d":"-119.73058"},"http://www.google.com/maps/place/50.773332534,-119.730580052",50690,"Rural First Nations Primary Reserve",287,118,"No","No","No","No ","Neskonlith*","FALSE","FALSE"]
[null,50691,"Simpcw First Nation*","No","No","Yes","Thompson-Nicola Regional District","Thompson--Okanagan",{"$nulls":8},"","","",null,0,0,null,null,{"$f":"IF(AB1180=\"Y\",COUNT(#REF!), \"\")","v":0},null,"Simpcw First Nation","Y",{"v":51.31689545,"d":"51.31690"},{"v":-120.149026395,"d":"-120.14903"},"http://www.google.com/maps/place/51.31689545,-120.149026395",50691,"Rural First Nations Secondary Reserve",157,77,"No","Yes","No","No ","Simpcw First Nation*","FALSE","FALSE"]
[null,50692,"Cook's Ferry (Oregon Jack Creek)*","No","Yes","Yes","Thompson-Nicola Regional District","Thompson--Okanagan",{"$nulls":8},"","","",null,0,0,null,null,{"$f":"IF(AB1181=\"Y\",COUNT(#REF!), \"\")","v":0},null,"Cook's Ferry (Oregon Jack Creek)","Y",{"v":50.619421522,"d":"50.61942"},{"v":-121.319117044,"d":"-121.31912"},"http://www.google.com/maps/place/50.619421522,-121.319117044",50692,"Rural First Nations Primary Reserve",5,5,"No","Yes","No","No ","Cook's Ferry (Oregon Jack Creek)*","FALSE","FALSE"]
[null,50693,"Coldwater*","No","No","Yes","Thompson-Nicola Regional District","Thompson--Okanagan",{"$nulls":8},"","","",null,0,0,null,null,{"$f":"IF(AB1182=\"Y\",COUNT(#REF!), \"\")","v":0},null,"Coldwater","Y",{"v":50.027103635,"d":"50.02710"},{"v":-120.855204051,"d":"-120.85520"},"http://www.google.com/maps/place/50.027103635,-120.855204051",50693,"Rural First Nations Primary Reserve",283,103,"No","Yes","No","No ","Coldwater*","FALSE","FALSE"]
[null,50694,"Cook's Ferry*","No","No","Yes","Thompson-Nicola Regional District","Thompson--Okanagan",{"$nulls":8},"","","",null,0,0,null,null,{"$f":"IF(AB1183=\"Y\",COUNT(#REF!), \"\")","v":0},null,"Cook's Ferry","Y",{"v":50.42409072,"d":"50.42409"},{"v":-121.317911128,"d":"-121.31791"},"http://www.google.com/maps/place/50.42409072,-121.317911128",50694,"Rural First Nations Primary Reserve",60,36,"No","Yes","No","No ","Cook's Ferry*","FALSE","FALSE"]
[null,50695,"Shulus (Lower Nicola)*","No","Yes","Yes","Thompson-Nicola Regional District","Thompson--Okanagan",{"$nulls":8},"","","",null,0,0,null,null,{"$f":"IF(AB1184=\"Y\",COUNT(#REF!), \"\")","v":0},null,"Shulus (Lower Nicola)","Y",{"v":50.138327736,"d":"50.13833"},{"v":-120.857681537,"d":"-120.85768"},"http://www.google.com/maps/place/50.138327736,-120.857681537",50695,"Rural First Nations Primary Reserve",1090,539,"No","Yes","Yes","No ","Shulus (Lower Nicola)*","FALSE","FALSE"]
[null,50696,"Nicomen*","No","No","Yes","Thompson-Nicola Regional District","Thompson--Okanagan",{"$nulls":8},"","","",null,0,0,null,null,{"$f":"IF(AB1185=\"Y\",COUNT(#REF!), \"\")","v":0},null,"Nicomen","Y",{"v":50.264437138,"d":"50.26444"},{"v":-121.39824636,"d":"-121.39825"},"http://www.google.com/maps/place/50.264437138,-121.39824636",50696,"Rural First Nations Primary Reserve",68,22,"No","Yes","Yes","No ","Nicomen*","FALSE","FALSE"]
[null,50697,{"$f":"HYPERLINK(AE1186,AN1186)","v":"Upper Nicola*"},"No","No","Yes","Thompson-Nicola Regional District","Thompson--Okanagan",{"$nulls":8},{"$f":"IF(L1186=\"\",\"\",\nIF(SUM((J1186*L1186)/M1186)<=N1186,\"Sufficient Capacity\",\nIF(SUM((J1186*L1186)/M1186)>N1186,\"Not Enough Capacity\",\"Error\")))","v":""},{"$f":"IF(OR(ISBLANK(J1186),ISBLANK(L1186),ISBLANK(M1186)), \"\",(J1186*L1186/M1186))","v":""},{"$f":"IF(AND(COUNT(N1186,R1186)=2, OR($O$10=\"Last-Mile\", $O$10=\"Transport & Last-Mile\")), N1186-R1186, \"\")","v":""},null,{"$f":"IF(AND(AB1186=\"Y\",I1186<>\"\"),1,0)","v":0},{"$f":"IF(AND(AB1186=\"Y\",I1186=\"Last-Mile & Transport\"),1,0)","v":0},null,null,{"$f":"IF(AB1186=\"Y\",COUNT(#REF!), \"\")","v":0},null,"Upper Nicola","Y",{"v":50.141989451,"d":"50.14199"},{"v":-120.28242517,"d":"-120.28243"},"http://www.google.com/maps/place/50.141989451,-120.28242517",50697,"Rural First Nations Primary Reserve",126,65,"No","Yes","Yes","No ",{"$f":"IF(AB1186=\"Y\", CONCATENATE(AA1186,\"*\"), AA1186)","v":"Upper Nicola*"},{"$f":"IF(I1186=\"Last-Mile\",\"TRUE\",IF(I1186=\"Transport & Last-Mile\",\"TRUE\",\"FALSE\"))","v":"FALSE"},{"$f":"IF(I1186=\"Transport\",\"TRUE\",IF(I1186=\"Transport & Last-Mile\",\"TRUE\",\"FALSE\"))","v":"FALSE"}]
[null,50698,"Shackan*","No","No","No","Thompson-Nicola Regional District","Thompson--Okanagan",{"$nulls":8},"","","",null,0,0,null,null,{"$f":"IF(AB1187=\"Y\",COUNT(#REF!), \"\")","v":0},null,"Shackan","Y",{"v":50.29338822,"d":"50.29339"},{"v":-121.175373007,"d":"-121.17537"},"http://www.google.com/maps/place/50.29338822,-121.175373007",50698,"Rural First Nations Primary Reserve",39,22,"No","Yes","Yes","No ","Shackan*","FALSE","FALSE"]
[null,50699,"Nooaitch*","No","No","No","Thompson-Nicola Regional District","Thompson--Okanagan",{"$nulls":8},"","","",null,0,0,null,null,{"$f":"IF(AB1188=\"Y\",COUNT(#REF!), \"\")","v":0},null,"Nooaitch","Y",{"v":50.153435773,"d":"50.15344"},{"v":-121.035106361,"d":"-121.03511"},"http://www.google.com/maps/place/50.153435773,-121.035106361",50699,"Rural First Nations Primary Reserve",153,61,"No","Yes","Yes","No ","Nooaitch*","FALSE","FALSE"]
[null,50700,"Boothroyd*","Yes","Yes","Yes","Fraser Valley Regional District","Lower Mainland--Southwest",{"$nulls":8},"","","",null,0,0,null,null,{"$f":"IF(AB1189=\"Y\",COUNT(#REF!), \"\")","v":0},null,"Boothroyd","Y",{"v":49.963070753,"d":"49.96307"},{"v":-121.484964595,"d":"-121.48496"},"http://www.google.com/maps/place/49.963070753,-121.484964595",50700,"Rural First Nations Primary Reserve",81,46,"No","No","No","No ","Boothroyd*","FALSE","FALSE"]
[null,50701,"Boston Bar First Nation*","Yes","Yes","Yes","Fraser Valley Regional District","Lower Mainland--Southwest",{"$nulls":8},"","","",null,0,0,null,null,{"$f":"IF(AB1190=\"Y\",COUNT(#REF!), \"\")","v":0},null,"Boston Bar First Nation","Y",{"v":49.87717051,"d":"49.87717"},{"v":-121.450370376,"d":"-121.45037"},"http://www.google.com/maps/place/49.87717051,-121.450370376",50701,"Rural First Nations Primary Reserve",111,82,"Yes","No","No","No ","Boston Bar First Nation*","FALSE","FALSE"]
[null,50702,"Whispering Pines/Clinton*","No","No","Yes","Thompson-Nicola Regional District","Thompson--Okanagan",{"$nulls":8},"","","",null,0,0,null,null,{"$f":"IF(AB1191=\"Y\",COUNT(#REF!), \"\")","v":0},null,"Whispering Pines/Clinton","Y",{"v":50.986696924,"d":"50.98670"},{"v":-120.240793348,"d":"-120.24079"},"http://www.google.com/maps/place/50.986696924,-120.240793348",50702,"Rural First Nations Primary Reserve",203,84,"No","Yes","Yes","No ","Whispering Pines/Clinton*","FALSE","FALSE"]
[null,50703,"High Bar*","No","No","No","Thompson-Nicola Regional District","Thompson--Okanagan",{"$nulls":8},"","","",null,0,0,null,null,{"$f":"IF(AB1192=\"Y\",COUNT(#REF!), \"\")","v":0},null,"High Bar","Y",{"v":51.113042994,"d":"51.11304"},{"v":-122.018082129,"d":"-122.01808"},"http://www.google.com/maps/place/51.113042994,-122.018082129",50703,"Rural First Nations Primary Reserve",0,1,"No","Yes","No","No ","High Bar*","FALSE","FALSE"]
[null,50704,"Kanaka Bar*","No","No","Yes","Thompson-Nicola Regional District","Thompson--Okanagan",{"$nulls":8},"","","",null,0,0,null,null,{"$f":"IF(AB1193=\"Y\",COUNT(#REF!), \"\")","v":0},null,"Kanaka Bar","Y",{"v":50.112176966,"d":"50.11218"},{"v":-121.5620351,"d":"-121.56204"},"http://www.google.com/maps/place/50.112176966,-121.5620351",50704,"Rural First Nations Primary Reserve",85,18,"No","Yes","No","No ","Kanaka Bar*","FALSE","FALSE"]
[null,50705,"Lytton*","Yes","Yes","Yes","Thompson-Nicola Regional District","Thompson--Okanagan",{"$nulls":8},"","","",null,0,0,null,null,{"$f":"IF(AB1194=\"Y\",COUNT(#REF!), \"\")","v":0},null,"Lytton","Y",{"v":50.237487,"d":"50.23749"},{"v":-121.577555,"d":"-121.57756"},"http://www.google.com/maps/place/50.237487,-121.577555",50705,"Rural First Nations Primary Reserve",607,276,"Yes","No","Yes","No ","Lytton*","FALSE","FALSE"]
[null,50706,"Siska*","No","No","No","Thompson-Nicola Regional District","Thompson--Okanagan",{"$nulls":8},"","","",null,0,0,null,null,{"$f":"IF(AB1195=\"Y\",COUNT(#REF!), \"\")","v":0},null,"Siska","Y",{"v":50.136346185,"d":"50.13635"},{"v":-121.571554917,"d":"-121.57155"},"http://www.google.com/maps/place/50.136346185,-121.571554917",50706,"Rural First Nations Primary Reserve",101,39,"No","Yes","Yes","No ","Siska*","FALSE","FALSE"]
[null,50707,"Skuppah*","No","No","Yes","Thompson-Nicola Regional District","Thompson--Okanagan",{"$nulls":8},"","","",null,0,0,null,null,{"$f":"IF(AB1196=\"Y\",COUNT(#REF!), \"\")","v":0},null,"Skuppah","Y",{"v":50.187592161,"d":"50.18759"},{"v":-121.573860869,"d":"-121.57386"},"http://www.google.com/maps/place/50.187592161,-121.573860869",50707,"Rural First Nations Primary Reserve",72,32,"No","Yes","Yes","No ","Skuppah*","FALSE","FALSE"]
[null,50708,"Spuzzum*","No","No","Yes","Fraser Valley Regional District","Lower Mainland--Southwest",{"$nulls":8},"","","",null,0,0,null,null,{"$f":"IF(AB1197=\"Y\",COUNT(#REF!), \"\")","v":0},null,"Spuzzum","Y",{"v":49.661023326,"d":"49.66102"},{"v":-121.411473898,"d":"-121.41147"},"http://www.google.com/maps/place/49.661023326,-121.411473898",50708,"Rural First Nations Primary Reserve",41,16,"No","Yes","Yes","No ","Spuzzum*","FALSE","FALSE"]
[null,50709,"?Esdilagh First Nation*","Yes","Yes","Yes","Cariboo Regional District","Cariboo",{"$nulls":8},"","","",null,0,0,null,null,{"$f":"IF(AB1198=\"Y\",COUNT(#REF!), \"\")","v":0},null,"?Esdilagh First Nation","Y",{"v":52.562844921,"d":"52.56284"},{"v":-122.496775954,"d":"-122.49678"},"http://www.google.com/maps/place/52.562844921,-122.496775954",50709,"Rural First Nations Primary Reserve",24,13,"No","Yes","No","No ","?Esdilagh First Nation*","FALSE","FALSE"]
[null,50710,"Alexis Creek*","Yes","Yes","No","Cariboo Regional District","Cariboo",{"$nulls":8},"","","",null,0,0,null,null,{"$f":"IF(AB1199=\"Y\",COUNT(#REF!), \"\")","v":0},null,"Alexis Creek","Y",{"v":52.138577579,"d":"52.13858"},{"v":-123.952087706,"d":"-123.95209"},"http://www.google.com/maps/place/52.138577579,-123.952087706",50710,"Rural First Nations Primary Reserve",196,64,"No","Yes","Yes","No ","Alexis Creek*","FALSE","FALSE"]
[null,50711,"Alkali Lake (Esk'etemc)*","Yes","Yes","No","Cariboo Regional District","Cariboo",{"$nulls":8},"","","",null,0,0,null,null,{"$f":"IF(AB1200=\"Y\",COUNT(#REF!), \"\")","v":0},null,"Alkali Lake (Esk'etemc)","Y",{"v":51.788658832,"d":"51.78866"},{"v":-122.236447751,"d":"-122.23645"},"http://www.google.com/maps/place/51.788658832,-122.236447751",50711,"Rural First Nations Primary Reserve",321,120,"Yes","No","No","No ","Alkali Lake (Esk'etemc)*","FALSE","FALSE"]
[null,50712,"Tl'etinqox Government*","Yes","Yes","No","Cariboo Regional District","Cariboo",{"$nulls":8},"","","",null,0,0,null,null,{"$f":"IF(AB1201=\"Y\",COUNT(#REF!), \"\")","v":0},null,"Tl'etinqox Government","Y",{"v":52.016983647,"d":"52.01698"},{"v":-123.176378748,"d":"-123.17638"},"http://www.google.com/maps/place/52.016983647,-123.176378748",50712,"Rural First Nations Secondary Reserve",341,128,"No","Yes","Yes","No ","Tl'etinqox Government*","FALSE","FALSE"]
[null,50713,"Canim Lake*","No","No","No","Cariboo Regional District","Cariboo",{"$nulls":8},"","","",null,0,0,null,null,{"$f":"IF(AB1202=\"Y\",COUNT(#REF!), \"\")","v":0},null,"Canim Lake","Y",{"v":51.777598471,"d":"51.77760"},{"v":-120.986436023,"d":"-120.98644"},"http://www.google.com/maps/place/51.777598471,-120.986436023",50713,"Rural First Nations Primary Reserve",109,46,"No","Yes","No","No ","Canim Lake*","FALSE","FALSE"]
[null,50714,"Xeni Gwet'in First Nations Government*","No","No","No","Cariboo Regional District","Cariboo",{"$nulls":8},"","","",null,0,0,null,null,{"$f":"IF(AB1203=\"Y\",COUNT(#REF!), \"\")","v":0},null,"Xeni Gwet'in First Nations Government","Y",{"v":51.415370332,"d":"51.41537"},{"v":-124.09563063,"d":"-124.09563"},"http://www.google.com/maps/place/51.415370332,-124.09563063",50714,"Rural First Nations Primary Reserve",50,23,"No","Yes","Yes","No ","Xeni Gwet'in First Nations Government*","FALSE","FALSE"]
[null,50715,"Red Bluff (Lhtako Dene Nation)*","Yes","Yes","Yes","Cariboo Regional District","Cariboo",{"$nulls":8},"","","",null,0,0,null,null,{"$f":"IF(AB1204=\"Y\",COUNT(#REF!), \"\")","v":0},null,"Red Bluff (Lhtako Dene Nation)","Y",{"v":52.954894358,"d":"52.95489"},{"v":-122.451089423,"d":"-122.45109"},"http://www.google.com/maps/place/52.954894358,-122.451089423",50715,"Rural First Nations Primary Reserve",3835,1670,"Yes","No","Yes","No ","Red Bluff (Lhtako Dene Nation)*","FALSE","FALSE"]
[null,50716,"Soda Creek*","Yes","Yes","Yes","Cariboo Regional District","Cariboo",{"$nulls":8},"","","",null,0,0,null,null,{"$f":"IF(AB1205=\"Y\",COUNT(#REF!), \"\")","v":0},null,"Soda Creek","Y",{"v":52.280448919,"d":"52.28045"},{"v":-122.144782114,"d":"-122.14478"},"http://www.google.com/maps/place/52.280448919,-122.144782114",50716,"Rural First Nations Primary Reserve",54,22,"No","No","Yes","No ","Soda Creek*","FALSE","FALSE"]
[null,50717,"Stone (Yunesit'in Government)*","Yes","Yes","No","Cariboo Regional District","Cariboo",{"$nulls":8},"","","",null,0,0,null,null,{"$f":"IF(AB1206=\"Y\",COUNT(#REF!), \"\")","v":0},null,"Stone (Yunesit'in Government)","Y",{"v":51.92319217,"d":"51.92319"},{"v":-123.135168595,"d":"-123.13517"},"http://www.google.com/maps/place/51.92319217,-123.135168595",50717,"Rural First Nations Primary Reserve",183,50,"No","Yes","No","No ","Stone (Yunesit'in Government)*","FALSE","FALSE"]
[null,50718,"Toosey*","Yes","Yes","No","Cariboo Regional District","Cariboo",{"$nulls":8},"","","",null,0,0,null,null,{"$f":"IF(AB1207=\"Y\",COUNT(#REF!), \"\")","v":0},null,"Toosey","Y",{"v":51.93181594,"d":"51.93182"},{"v":-122.502324215,"d":"-122.50232"},"http://www.google.com/maps/place/51.93181594,-122.502324215",50718,"Rural First Nations Primary Reserve",107,42,"No","Yes","Yes","No ","Toosey*","FALSE","FALSE"]
[null,50719,"Sugarcane (Williams Lake)*","Yes","Yes","Yes","Cariboo Regional District","Cariboo",{"$nulls":8},"","","",null,0,0,null,null,{"$f":"IF(AB1208=\"Y\",COUNT(#REF!), \"\")","v":0},null,"Sugarcane (Williams Lake)","Y",{"v":52.108297741,"d":"52.10830"},{"v":-121.993912319,"d":"-121.99391"},"http://www.google.com/maps/place/52.108297741,-121.993912319",50719,"Rural First Nations Primary Reserve",438,191,"No","Yes","No","No ","Sugarcane (Williams Lake)*","FALSE","FALSE"]
[null,50720,"Nazko First Nation*","No","No","No","Cariboo Regional District","Cariboo",{"$nulls":8},"","","",null,0,0,null,null,{"$f":"IF(AB1209=\"Y\",COUNT(#REF!), \"\")","v":0},null,"Nazko First Nation","Y",{"v":52.941256207,"d":"52.94126"},{"v":-123.580661728,"d":"-123.58066"},"http://www.google.com/maps/place/52.941256207,-123.580661728",50720,"Rural First Nations Primary Reserve",75,28,"No","Yes","No","No ","Nazko First Nation*","FALSE","FALSE"]
[null,50721,"Kluskus (Lhoosk'uz Dene Nation)*","No","No","No","Cariboo Regional District","Cariboo",{"$nulls":8},"","","",null,0,0,null,null,{"$f":"IF(AB1210=\"Y\",COUNT(#REF!), \"\")","v":0},null,"Kluskus (Lhoosk'uz Dene Nation)","Y",{"v":53.087346002,"d":"53.08735"},{"v":-124.490161267,"d":"-124.49016"},"http://www.google.com/maps/place/53.087346002,-124.490161267",50721,"Rural First Nations Primary Reserve",36,16,"No","Yes","Yes","No ","Kluskus (Lhoosk'uz Dene Nation)*","FALSE","FALSE"]
[null,50722,"Ulkatcho*","Yes","Yes","No","Cariboo Regional District","Cariboo",{"$nulls":8},"","","",null,0,0,null,null,{"$f":"IF(AB1211=\"Y\",COUNT(#REF!), \"\")","v":0},null,"Ulkatcho","Y",{"v":52.467285947,"d":"52.46729"},{"v":-125.306675676,"d":"-125.30668"},"http://www.google.com/maps/place/52.467285947,-125.306675676",50722,"Rural First Nations Primary Reserve",359,203,"No","Yes","Yes","No ","Ulkatcho*","FALSE","FALSE"]
[null,50723,"Canoe Creek (Stswecem'c Xgat'tem First Nation)*","Yes","Yes","No","Cariboo Regional District","Cariboo",{"$nulls":8},"","","",null,0,0,null,null,{"$f":"IF(AB1212=\"Y\",COUNT(#REF!), \"\")","v":0},null,"Canoe Creek (Stswecem'c Xgat'tem First Nation)","Y",{"v":51.588840213,"d":"51.58884"},{"v":-122.20895149,"d":"-122.20895"},"http://www.google.com/maps/place/51.588840213,-122.20895149",50723,"Rural First Nations Primary Reserve",89,38,"Yes","No","No","No ","Canoe Creek (Stswecem'c Xgat'tem First Nation)*","FALSE","FALSE"]
[null,50724,"Gwa'Sala-Nakwaxda'xw*","Yes","Yes","Yes","Regional District of Mount Waddington","Vancouver Island and Coast",{"$nulls":8},"","","",null,0,0,null,null,{"$f":"IF(AB1213=\"Y\",COUNT(#REF!), \"\")","v":0},null,"Gwa'Sala-Nakwaxda'xw","Y",{"v":50.734170408,"d":"50.73417"},{"v":-127.49641098,"d":"-127.49641"},"http://www.google.com/maps/place/50.734170408,-127.49641098",50724,"Rural First Nations Primary Reserve",3732,1807,"Yes","No","No","No ","Gwa'Sala-Nakwaxda'xw*","FALSE","FALSE"]
[null,50725,"Wet'suwet'en Village (Wet'suwet'en First Nation)*","Yes","Yes","Yes","Bulkley Nechako Regional District","Nechako",{"$nulls":8},"","","",null,0,0,null,null,{"$f":"IF(AB1214=\"Y\",COUNT(#REF!), \"\")","v":0},null,"Wet'suwet'en Village (Wet'suwet'en First Nation)","Y",{"v":54.330719398,"d":"54.33072"},{"v":-125.888229677,"d":"-125.88823"},"http://www.google.com/maps/place/54.330719398,-125.888229677",50725,"Rural First Nations Primary Reserve",192,71,"No","Yes","Yes","No ","Wet'suwet'en Village (Wet'suwet'en First Nation)*","FALSE","FALSE"]
[null,50726,"Nee-Tahi-Buhn*","No","No","No","Bulkley Nechako Regional District","Nechako",{"$nulls":8},"","","",null,0,0,null,null,{"$f":"IF(AB1215=\"Y\",COUNT(#REF!), \"\")","v":0},null,"Nee-Tahi-Buhn","Y",{"v":53.932956956,"d":"53.93296"},{"v":-125.66736571,"d":"-125.66737"},"http://www.google.com/maps/place/53.932956956,-125.66736571",50726,"Rural First Nations Primary Reserve",47,27,"No","Yes","No","No ","Nee-Tahi-Buhn*","FALSE","FALSE"]
[null,50728,"Yekooche First Nation*","No","No","No","Bulkley Nechako Regional District","Nechako",{"$nulls":8},"","","",null,0,0,null,null,{"$f":"IF(AB1216=\"Y\",COUNT(#REF!), \"\")","v":0},null,"Yekooche First Nation","Y",{"v":54.597878,"d":"54.59788"},{"v":-125.082199,"d":"-125.08220"},"http://www.google.com/maps/place/54.597878,-125.082199",50728,"Rural First Nations Primary Reserve",87,42,"No","Yes","Yes","No ","Yekooche First Nation*","FALSE","FALSE"]
[null,50729,"Skin Tyee*","Yes","Yes","No","Bulkley Nechako Regional District","Nechako",{"$nulls":8},"","","",null,0,0,null,null,{"$f":"IF(AB1217=\"Y\",COUNT(#REF!), \"\")","v":0},null,"Skin Tyee","Y",{"v":53.995206307,"d":"53.99521"},{"v":-125.882243431,"d":"-125.88224"},"http://www.google.com/maps/place/53.995206307,-125.882243431",50729,"Rural First Nations Primary Reserve",99,48,"No","Yes","Yes","No ","Skin Tyee*","FALSE","FALSE"]
[null,51635,"Tsatsisnukwomi (Da'naxda'xw First Nation)*","No","No","No","Regional District of Mount Waddington","Vancouver Island and Coast",{"$nulls":8},"","","",null,0,0,null,null,{"$f":"IF(AB1218=\"Y\",COUNT(#REF!), \"\")","v":0},null,"Tsatsisnukwomi (Da'naxda'xw First Nation)","Y",{"v":50.59666944,"d":"50.59667"},{"v":-126.59771111,"d":"-126.59771"},"http://www.google.com/maps/place/50.59666944,-126.59771111",51635,"Rural First Nations Primary Reserve",10,7,"No","Yes","Yes","No ","Tsatsisnukwomi (Da'naxda'xw First Nation)*","FALSE","FALSE"]
[null,51637,"Nenagwas (Tlowitsis Nation)*","No","No","Yes","Strathcona Regional District","Vancouver Island and Coast",{"$nulls":8},"","","",null,0,0,null,null,{"$f":"IF(AB1219=\"Y\",COUNT(#REF!), \"\")","v":0},null,"Nenagwas (Tlowitsis Nation)","Y",{"v":49.908593,"d":"49.90859"},{"v":-125.208974,"d":"-125.20897"},"http://www.google.com/maps/place/49.908593,-125.208974",51637,"Rural First Nations Secondary Reserve",3137,1385,"Yes","No","No","No ","Nenagwas (Tlowitsis Nation)*","FALSE","FALSE"]
[null,52635,"Keogh No.2 (Da'naxda'xw First Nation)*","No","No","No","Regional District of Mount Waddington","Vancouver Island and Coast",{"$nulls":8},"","","",null,0,0,null,null,{"$f":"IF(AB1220=\"Y\",COUNT(#REF!), \"\")","v":0},null,"Keogh No.2 (Da'naxda'xw First Nation)","Y",{"v":50.6664693,"d":"50.66647"},{"v":-125.7276757,"d":"-125.72768"},"http://www.google.com/maps/place/50.6664693,-125.7276757",52635,"Rural First Nations Secondary Reserve",null,null,"No","No","Yes","No ","Keogh No.2 (Da'naxda'xw First Nation)*","FALSE","FALSE"]
[null,100104,"Majestic Subdivision","No","Yes","Yes","Regional District of Central Kootenay","Kootenay",{"$nulls":8},"","","",null,0,0,null,null,{"$f":"IF(AB1221=\"Y\",COUNT(#REF!), \"\")","v":""},null,"Majestic Subdivision","N",{"v":49.026575,"d":"49.02658"},{"v":-116.1936556,"d":"-116.19366"},"http://www.google.com/maps/place/49.026575,-116.1936556",100104,"Rural",83,43,"No","Yes","No","No ","Majestic Subdivision","FALSE","FALSE"]
[null,100105,"Glenlily","No","Yes","Yes","Regional District of Central Kootenay","Kootenay",{"$nulls":8},"","","",null,0,0,null,null,{"$f":"IF(AB1222=\"Y\",COUNT(#REF!), \"\")","v":""},null,"Glenlily","N",{"v":49.05,"d":"49.05000"},-116.16667,"http://www.google.com/maps/place/49.05,-116.16667",100105,"Rural",83,43,"No","Yes","Yes","No ","Glenlily","FALSE","FALSE"]
[null,100106,"Halcyon Hot Springs","No","No","No","Regional District of Central Kootenay","Kootenay",{"$nulls":8},"","","",null,0,0,null,null,{"$f":"IF(AB1223=\"Y\",COUNT(#REF!), \"\")","v":""},null,"Halcyon Hot Springs","N",{"v":50.524723,"d":"50.52472"},{"v":-117.901389,"d":"-117.90139"},"http://www.google.com/maps/place/50.524723,-117.901389",100106,"Rural",25,15,"No","Yes","Yes","No ","Halcyon Hot Springs","FALSE","FALSE"]
[null,100107,"St. Leon Hot Springs","No","No","No","Regional District of Central Kootenay","Kootenay",{"$nulls":8},"","","",null,0,0,null,null,{"$f":"IF(AB1224=\"Y\",COUNT(#REF!), \"\")","v":""},null,"St. Leon Hot Springs","N",50.44242,-117.88455,"http://www.google.com/maps/place/50.44242,-117.88455",100107,"Rural",1,0,"No","Yes","No","No ","St. Leon Hot Springs","FALSE","FALSE"]
[null,100108,"Shelter Bay","No","No","No","Columbia-Shuswap Regional District","Thompson--Okanagan",{"$nulls":8},"","","",null,0,0,null,null,{"$f":"IF(AB1225=\"Y\",COUNT(#REF!), \"\")","v":""},null,"Shelter Bay","N",50.65839,-117.94079,"http://www.google.com/maps/place/50.65839,-117.94079",100108,"Rural",0,0,"No","Yes","Yes","No ","Shelter Bay","FALSE","FALSE"]
[null,100109,"Hall's Landing","No","No","No","Columbia-Shuswap Regional District","Thompson--Okanagan",{"$nulls":8},"","","",null,0,0,null,null,{"$f":"IF(AB1226=\"Y\",COUNT(#REF!), \"\")","v":""},null,"Hall's Landing","N",50.69527,-117.98157,"http://www.google.com/maps/place/50.69527,-117.98157",100109,"Rural",1,1,"No","Yes","Yes","No ","Hall's Landing","FALSE","FALSE"]
[null,100110,"West Creston","No","Yes","Yes","Regional District of Central Kootenay","Kootenay",{"$nulls":8},"","","",null,0,0,null,null,{"$f":"IF(AB1227=\"Y\",COUNT(#REF!), \"\")","v":""},null,"West Creston","N",{"v":49.09008333,"d":"49.09008"},{"v":-116.6196167,"d":"-116.61962"},"http://www.google.com/maps/place/49.09008333,-116.6196167",100110,"Rural",378,176,"No","Yes","Yes","No ","West Creston","FALSE","FALSE"]
[null,100111,"Arrow Creek","Yes","Yes","Yes","Regional District of Central Kootenay","Kootenay",{"$nulls":8},"","","",null,0,0,null,null,{"$f":"IF(AB1228=\"Y\",COUNT(#REF!), \"\")","v":""},null,"Arrow Creek","N",{"v":49.133333,"d":"49.13333"},{"v":-116.45,"d":"-116.45000"},"http://www.google.com/maps/place/49.133333,-116.45",100111,"Rural",536,249,"Yes","No","No","No ","Arrow Creek","FALSE","FALSE"]
[null,100112,"Emerald Lake","No","No","No","Columbia-Shuswap Regional District","Thompson--Okanagan",{"$nulls":8},"","","",null,0,0,null,null,{"$f":"IF(AB1229=\"Y\",COUNT(#REF!), \"\")","v":""},null,"Emerald Lake","N",{"v":51.44008333,"d":"51.44008"},{"v":-116.53985556,"d":"-116.53986"},"http://www.google.com/maps/place/51.44008333,-116.53985556",100112,"Rural",1,0,"No","Yes","Yes","No ","Emerald Lake","FALSE","FALSE"]
[null,100113,"Brisco","No","Yes","Yes","Regional District of East Kootenay","Kootenay",{"$nulls":8},"","","",null,0,0,null,null,{"$f":"IF(AB1230=\"Y\",COUNT(#REF!), \"\")","v":""},null,"Brisco","N",{"v":50.83842878,"d":"50.83843"},{"v":-116.32643741,"d":"-116.32644"},"http://www.google.com/maps/place/50.83842878,-116.32643741",100113,"Rural",12,7,"No","Yes","No","No ","Brisco","FALSE","FALSE"]
[null,100114,"Woodbury Creek","Yes","Yes","Yes","Regional District of Central Kootenay","Kootenay",{"$nulls":8},"","","",null,0,0,null,null,{"$f":"IF(AB1231=\"Y\",COUNT(#REF!), \"\")","v":""},null,"Woodbury Creek","N",{"v":49.7751128,"d":"49.77511"},{"v":-116.9059346,"d":"-116.90593"},"http://www.google.com/maps/place/49.7751128,-116.9059346",100114,"Rural",50,38,"No","Yes","Yes","No ","Woodbury Creek","FALSE","FALSE"]
[null,100115,"Walkers","No","Yes","Yes","Regional District of Central Kootenay","Kootenay",{"$nulls":8},"","","",null,0,0,null,null,{"$f":"IF(AB1232=\"Y\",COUNT(#REF!), \"\")","v":""},null,"Walkers","N",{"v":49.70837778,"d":"49.70838"},{"v":-116.86431389,"d":"-116.86431"},"http://www.google.com/maps/place/49.70837778,-116.86431389",100115,"Rural",294,207,"No","Yes","Yes","No ","Walkers","FALSE","FALSE"]
[null,100116,"Lemon Creek","No","Yes","No","Regional District of Central Kootenay","Kootenay",{"$nulls":8},"","","",null,0,0,null,null,{"$f":"IF(AB1233=\"Y\",COUNT(#REF!), \"\")","v":""},null,"Lemon Creek","N",{"v":49.7,"d":"49.70000"},-117.48333,"http://www.google.com/maps/place/49.7,-117.48333",100116,"Rural",145,82,"No","Yes","Yes","No ","Lemon Creek","FALSE","FALSE"]
[null,100117,"Perrys","No","Yes","No","Regional District of Central Kootenay","Kootenay",{"$nulls":8},"","","",null,0,0,null,null,{"$f":"IF(AB1234=\"Y\",COUNT(#REF!), \"\")","v":""},null,"Perrys","N",{"v":49.65833333,"d":"49.65833"},{"v":-117.5111111,"d":"-117.51111"},"http://www.google.com/maps/place/49.65833333,-117.5111111",100117,"Rural",341,184,"No","Yes","Yes","No ","Perrys","FALSE","FALSE"]
[null,100118,"Queens Bay","Yes","Yes","Yes","Regional District of Central Kootenay","Kootenay",{"$nulls":8},"","","",null,0,0,null,null,{"$f":"IF(AB1235=\"Y\",COUNT(#REF!), \"\")","v":""},null,"Queens Bay","N",{"v":49.65673889,"d":"49.65674"},{"v":-116.932875,"d":"-116.93288"},"http://www.google.com/maps/place/49.65673889,-116.932875",100118,"Rural",142,147,"No","No","No","No ","Queens Bay","FALSE","FALSE"]
[null,100119,"Appledale","No","Yes","No","Regional District of Central Kootenay","Kootenay",{"$nulls":8},"","","",null,0,0,null,null,{"$f":"IF(AB1236=\"Y\",COUNT(#REF!), \"\")","v":""},null,"Appledale","N",{"v":49.65,"d":"49.65000"},-117.53333,"http://www.google.com/maps/place/49.65,-117.53333",100119,"Rural",435,218,"No","Yes","No","No ","Appledale","FALSE","FALSE"]
[null,100120,"Lebahdo","No","Yes","No","Regional District of Central Kootenay","Kootenay",{"$nulls":8},"","","",null,0,0,null,null,{"$f":"IF(AB1237=\"Y\",COUNT(#REF!), \"\")","v":""},null,"Lebahdo","N",{"v":49.6,"d":"49.60000"},-117.58333,"http://www.google.com/maps/place/49.6,-117.58333",100120,"Rural",374,211,"No","Yes","Yes","No ","Lebahdo","FALSE","FALSE"]
[null,100121,"Vallican","No","Yes","No","Regional District of Central Kootenay","Kootenay",{"$nulls":8},"","","",null,0,0,null,null,{"$f":"IF(AB1238=\"Y\",COUNT(#REF!), \"\")","v":""},null,"Vallican","N",{"v":49.566667,"d":"49.56667"},{"v":-117.65,"d":"-117.65000"},"http://www.google.com/maps/place/49.566667,-117.65",100121,"Rural",119,65,"No","Yes","No","No ","Vallican","FALSE","FALSE"]
[null,100122,"Passmore","No","Yes","No","Regional District of Central Kootenay","Kootenay",{"$nulls":8},"","","",null,0,0,null,null,{"$f":"IF(AB1239=\"Y\",COUNT(#REF!), \"\")","v":""},null,"Passmore","N",{"v":49.533333,"d":"49.53333"},{"v":-117.65,"d":"-117.65000"},"http://www.google.com/maps/place/49.533333,-117.65",100122,"Rural",286,144,"No","Yes","Yes","No ","Passmore","FALSE","FALSE"]
[null,100123,"Slocan Park","No","Yes","No","Regional District of Central Kootenay","Kootenay",{"$nulls":8},"","","",null,0,0,null,null,{"$f":"IF(AB1240=\"Y\",COUNT(#REF!), \"\")","v":""},null,"Slocan Park","N",{"v":49.516667,"d":"49.51667"},-117.61667,"http://www.google.com/maps/place/49.516667,-117.61667",100123,"Rural",372,171,"No","Yes","No","No ","Slocan Park","FALSE","FALSE"]
[null,100124,"South Slocan","Yes","Yes","Yes","Regional District of Central Kootenay","Kootenay",{"$nulls":8},"","","",null,0,0,null,null,{"$f":"IF(AB1241=\"Y\",COUNT(#REF!), \"\")","v":""},null,"South Slocan","N",{"v":49.45762778,"d":"49.45763"},{"v":-117.52367222,"d":"-117.52367"},"http://www.google.com/maps/place/49.45762778,-117.52367222",100124,"Rural",920,389,"Yes","No","No","No ","South Slocan","FALSE","FALSE"]
[null,100125,"Playmor Junction","Yes","Yes","Yes","Regional District of Central Kootenay","Kootenay",{"$nulls":8},"","","",null,0,0,null,null,{"$f":"IF(AB1242=\"Y\",COUNT(#REF!), \"\")","v":""},null,"Playmor Junction","N",{"v":49.45,"d":"49.45000"},-117.53333,"http://www.google.com/maps/place/49.45,-117.53333",100125,"Rural",920,389,"Yes","No","Yes","No ","Playmor Junction","FALSE","FALSE"]
[null,100126,"Crescent Valley","Yes","Yes","Yes","Regional District of Central Kootenay","Kootenay",{"$nulls":8},"","","",null,0,0,null,null,{"$f":"IF(AB1243=\"Y\",COUNT(#REF!), \"\")","v":""},null,"Crescent Valley","N",{"v":49.44637222,"d":"49.44637"},{"v":-117.55776111,"d":"-117.55776"},"http://www.google.com/maps/place/49.44637222,-117.55776111",100126,"Rural",1520,723,"Yes","No","No","No ","Crescent Valley","FALSE","FALSE"]
[null,100128,"Kragmont","No","Yes","Yes","Regional District of East Kootenay","Kootenay",{"$nulls":8},"","","",null,0,0,null,null,{"$f":"IF(AB1244=\"Y\",COUNT(#REF!), \"\")","v":""},null,"Kragmont","N",{"v":49.175,"d":"49.17500"},-115.21667,"http://www.google.com/maps/place/49.175,-115.21667",100128,"Rural",168,104,"No","Yes","Yes","No ","Kragmont","FALSE","FALSE"]
[null,100129,"Sweetwater","No","Yes","Yes","Regional District of East Kootenay","Kootenay",{"$nulls":8},"","","",null,0,0,null,null,{"$f":"IF(AB1245=\"Y\",COUNT(#REF!), \"\")","v":""},null,"Sweetwater","N",{"v":49.17352733,"d":"49.17353"},{"v":-115.24347351,"d":"-115.24347"},"http://www.google.com/maps/place/49.17352733,-115.24347351",100129,"Rural",1,1,"No","Yes","Yes","No ","Sweetwater","FALSE","FALSE"]
[null,100130,"Koocanusa Marina","No","Yes","Yes","Regional District of East Kootenay","Kootenay",{"$nulls":8},"","","",null,0,0,null,null,{"$f":"IF(AB1246=\"Y\",COUNT(#REF!), \"\")","v":""},null,"Koocanusa Marina","N",{"v":49.26069302,"d":"49.26069"},{"v":-115.28458641,"d":"-115.28459"},"http://www.google.com/maps/place/49.26069302,-115.28458641",100130,"Rural",6,4,"No","Yes","Yes","No ","Koocanusa Marina","FALSE","FALSE"]
[null,100131,"Rosen Lake","No","Yes","Yes","Regional District of East Kootenay","Kootenay",{"$nulls":8},"","","",null,0,0,null,null,{"$f":"IF(AB1247=\"Y\",COUNT(#REF!), \"\")","v":""},null,"Rosen Lake","N",{"v":49.394167,"d":"49.39417"},{"v":-115.254167,"d":"-115.25417"},"http://www.google.com/maps/place/49.394167,-115.254167",100131,"Rural",788,550,"No","Yes","No","No ","Rosen Lake","FALSE","FALSE"]
[null,100132,"Tie Lake","No","Yes","Yes","Regional District of East Kootenay","Kootenay",{"$nulls":8},"","","",null,0,0,null,null,{"$f":"IF(AB1248=\"Y\",COUNT(#REF!), \"\")","v":""},null,"Tie Lake","N",{"v":49.42027913,"d":"49.42028"},{"v":-115.32317803,"d":"-115.32318"},"http://www.google.com/maps/place/49.42027913,-115.32317803",100132,"Rural",44,61,"No","Yes","Yes","No ","Tie Lake","FALSE","FALSE"]
[null,100133,"Spruceland and Wilks/Kahn","No","Yes","Yes","Regional District of East Kootenay","Kootenay",{"$nulls":8},"","","",null,0,0,null,null,{"$f":"IF(AB1249=\"Y\",COUNT(#REF!), \"\")","v":""},null,"Spruceland and Wilks/Kahn","N",{"v":49.54888977,"d":"49.54889"},{"v":-115.81790612,"d":"-115.81791"},"http://www.google.com/maps/place/49.54888977,-115.81790612",100133,"Rural",475,185,"No","No","No","No ","Spruceland and Wilks/Kahn","FALSE","FALSE"]
[null,100134,{"$f":"HYPERLINK(AE1250,AN1250)","v":"Booth Creek"},"No","No","Yes","Regional District of East Kootenay","Kootenay",{"$nulls":8},{"$f":"IF(L1250=\"\",\"\",\nIF(SUM((J1250*L1250)/M1250)<=N1250,\"Sufficient Capacity\",\nIF(SUM((J1250*L1250)/M1250)>N1250,\"Not Enough Capacity\",\"Error\")))","v":""},{"$f":"IF(OR(ISBLANK(J1250),ISBLANK(L1250),ISBLANK(M1250)), \"\",(J1250*L1250/M1250))","v":""},{"$f":"IF(AND(COUNT(N1250,R1250)=2, OR($O$10=\"Last-Mile\", $O$10=\"Transport & Last-Mile\")), N1250-R1250, \"\")","v":""},null,{"$f":"IF(AND(AB1250=\"Y\",I1250<>\"\"),1,0)","v":0},{"$f":"IF(AND(AB1250=\"Y\",I1250=\"Last-Mile & Transport\"),1,0)","v":0},null,null,{"$f":"IF(AB1250=\"Y\",COUNT(#REF!), \"\")","v":""},null,"Booth Creek","N",{"v":49.57624524,"d":"49.57625"},{"v":-115.85795687,"d":"-115.85796"},"http://www.google.com/maps/place/49.57624524,-115.85795687",100134,"Rural",396,158,"No","No","No","No ",{"$f":"IF(AB1250=\"Y\", CONCATENATE(AA1250,\"*\"), AA1250)","v":"Booth Creek"},{"$f":"IF(I1250=\"Last-Mile\",\"TRUE\",IF(I1250=\"Transport & Last-Mile\",\"TRUE\",\"FALSE\"))","v":"FALSE"},{"$f":"IF(I1250=\"Transport\",\"TRUE\",IF(I1250=\"Transport & Last-Mile\",\"TRUE\",\"FALSE\"))","v":"FALSE"}]
[null,100135,"Clearview","No","No","Yes","Regional District of East Kootenay","Kootenay",{"$nulls":8},"","","",null,0,0,null,null,{"$f":"IF(AB1251=\"Y\",COUNT(#REF!), \"\")","v":""},null,"Clearview","N",{"v":49.610329382,"d":"49.61033"},{"v":-115.80778883,"d":"-115.80779"},"http://www.google.com/maps/place/49.610329382,-115.80778883",100135,"Rural",271,127,"No","Yes","No","No ","Clearview","FALSE","FALSE"]
[null,100136,"St. Marys Lake","No","No","No","Regional District of East Kootenay","Kootenay",{"$nulls":8},"","","",null,0,0,null,null,{"$f":"IF(AB1252=\"Y\",COUNT(#REF!), \"\")","v":""},null,"St. Marys Lake","N",{"v":49.62398834,"d":"49.62399"},{"v":-116.10865758,"d":"-116.10866"},"http://www.google.com/maps/place/49.62398834,-116.10865758",100136,"Rural",22,14,"No","Yes","No","No ","St. Marys Lake","FALSE","FALSE"]
[null,100137,"Meadowbrook","No","Yes","Yes","Regional District of East Kootenay","Kootenay",{"$nulls":8},"","","",null,0,0,null,null,{"$f":"IF(AB1253=\"Y\",COUNT(#REF!), \"\")","v":""},null,"Meadowbrook","N",{"v":49.70805423,"d":"49.70805"},{"v":-115.90583966,"d":"-115.90584"},"http://www.google.com/maps/place/49.70805423,-115.90583966",100137,"Rural",265,121,"No","No","No","No ","Meadowbrook","FALSE","FALSE"]
[null,100138,"Lazy Lake","No","No","Yes","Regional District of East Kootenay","Kootenay",{"$nulls":8},"","","",null,0,0,null,null,{"$f":"IF(AB1254=\"Y\",COUNT(#REF!), \"\")","v":""},null,"Lazy Lake","N",{"v":49.81821791,"d":"49.81822"},{"v":-115.62731908,"d":"-115.62732"},"http://www.google.com/maps/place/49.81821791,-115.62731908",100138,"Rural",24,28,"No","Yes","Yes","No ","Lazy Lake","FALSE","FALSE"]
[null,100139,"North Premier Lake","No","No","Yes","Regional District of East Kootenay","Kootenay",{"$nulls":8},"","","",null,0,0,null,null,{"$f":"IF(AB1255=\"Y\",COUNT(#REF!), \"\")","v":""},null,"North Premier Lake","N",{"v":49.9749634,"d":"49.97496"},{"v":-115.6741719,"d":"-115.67417"},"http://www.google.com/maps/place/49.9749634,-115.6741719",100139,"Rural",53,33,"No","Yes","Yes","No ","North Premier Lake","FALSE","FALSE"]
[null,100140,"Grainger Road, Columbia Lake","Yes","Yes","Yes","Regional District of East Kootenay","Kootenay",{"$nulls":8},"","","",null,0,0,null,null,{"$f":"IF(AB1256=\"Y\",COUNT(#REF!), \"\")","v":""},null,"Grainger Road, Columbia Lake","N",{"v":50.18045893,"d":"50.18046"},{"v":-115.81673668,"d":"-115.81674"},"http://www.google.com/maps/place/50.18045893,-115.81673668",100140,"Rural",154,85,"Yes","No","Yes","No ","Grainger Road, Columbia Lake","FALSE","FALSE"]
[null,100141,"Edwards Lake*","No","No","Yes","Regional District of East Kootenay","Kootenay",{"$nulls":8},"","","",null,0,0,null,null,{"$f":"IF(AB1257=\"Y\",COUNT(#REF!), \"\")","v":0},null,"Edwards Lake","Y",{"v":49.09270519,"d":"49.09271"},{"v":-115.12525847,"d":"-115.12526"},"http://www.google.com/maps/place/49.09270519,-115.12525847",100141,"Rural First Nations Secondary Reserve",86,74,"No","Yes","No","No ","Edwards Lake*","FALSE","FALSE"]
[null,100142,"Moberly School Rd.","No","No","Yes","Columbia-Shuswap Regional District","Thompson--Okanagan",{"$nulls":8},"","","",null,0,0,null,null,{"$f":"IF(AB1258=\"Y\",COUNT(#REF!), \"\")","v":""},null,"Moberly School Rd.","N",{"v":51.41655396,"d":"51.41655"},{"v":-117.01264248,"d":"-117.01264"},"http://www.google.com/maps/place/51.41655396,-117.01264248",100142,"Rural",256,147,"No","Yes","No","No ","Moberly School Rd.","FALSE","FALSE"]
[null,100143,"Upper Donald","Yes","Yes","Yes","Columbia-Shuswap Regional District","Thompson--Okanagan",{"$nulls":8},"","","",null,0,0,null,null,{"$f":"IF(AB1259=\"Y\",COUNT(#REF!), \"\")","v":""},null,"Upper Donald","N",{"v":51.33664627,"d":"51.33665"},{"v":-116.95582257,"d":"-116.95582"},"http://www.google.com/maps/place/51.33664627,-116.95582257",100143,"Rural",1262,624,"No","Yes","No","No ","Upper Donald","FALSE","FALSE"]
[null,100144,"Norbury Lake","No","No","Yes","Regional District of East Kootenay","Kootenay",{"$nulls":8},"","","",null,0,0,null,null,{"$f":"IF(AB1260=\"Y\",COUNT(#REF!), \"\")","v":""},null,"Norbury Lake","N",{"v":49.53023111,"d":"49.53023"},{"v":-115.47897146,"d":"-115.47897"},"http://www.google.com/maps/place/49.53023111,-115.47897146",100144,"Rural",29,17,"No","Yes","Yes","No ","Norbury Lake","FALSE","FALSE"]
[null,100145,"Lewis Bay","No","Yes","Yes","Regional District of Central Kootenay","Kootenay",{"$nulls":8},"","","",null,0,0,null,null,{"$f":"IF(AB1261=\"Y\",COUNT(#REF!), \"\")","v":""},null,"Lewis Bay","N",49.46982,{"v":-116.7706,"d":"-116.77060"},"http://www.google.com/maps/place/49.46982,-116.7706",100145,"Rural",89,112,"No","Yes","Yes","No ","Lewis Bay","FALSE","FALSE"]
[null,100146,"Calder Road-Selkirk View","No","Yes","Yes","Regional District of Central Kootenay","Kootenay",{"$nulls":8},"","","",null,0,0,null,null,{"$f":"IF(AB1262=\"Y\",COUNT(#REF!), \"\")","v":""},null,"Calder Road-Selkirk View","N",49.87967,{"v":-118.171649,"d":"-118.17165"},"http://www.google.com/maps/place/49.87967,-118.171649",100146,"Rural",15,11,"No","Yes","No","No ","Calder Road-Selkirk View","FALSE","FALSE"]
[null,100147,"Whatshan Campground","No","Yes","Yes","Regional District of Central Kootenay","Kootenay",{"$nulls":8},"","","",null,0,0,null,null,{"$f":"IF(AB1263=\"Y\",COUNT(#REF!), \"\")","v":""},null,"Whatshan Campground","N",49.91492,{"v":-118.118202,"d":"-118.11820"},"http://www.google.com/maps/place/49.91492,-118.118202",100147,"Rural",9,6,"No","Yes","Yes","No ","Whatshan Campground","FALSE","FALSE"]
[null,100148,"Red Mountain Rd","No","Yes","Yes","Regional District of Central Kootenay","Kootenay",{"$nulls":8},"","","",null,0,0,null,null,{"$f":"IF(AB1264=\"Y\",COUNT(#REF!), \"\")","v":""},null,"Red Mountain Rd","N",{"v":49.90469722,"d":"49.90470"},{"v":-117.36173333,"d":"-117.36173"},"http://www.google.com/maps/place/49.90469722,-117.36173333",100148,"Rural",72,41,"No","Yes","Yes","No ","Red Mountain Rd","FALSE","FALSE"]
[null,100149,"Pass Creek","No","No","No","Regional District of East Kootenay","Kootenay",{"$nulls":8},"","","",null,0,0,null,null,{"$f":"IF(AB1265=\"Y\",COUNT(#REF!), \"\")","v":""},null,"Pass Creek","N",{"v":49.38848056,"d":"49.38848"},{"v":-114.679275,"d":"-114.67928"},"http://www.google.com/maps/place/49.38848056,-114.679275",100149,"Rural",0,0,"No","Yes","Yes","No ","Pass Creek","FALSE","FALSE"]
[null,100150,"Erris","No","No","No","Regional District of Okanagan-Similkameen","Thompson--Okanagan",{"$nulls":8},"","","",null,0,0,null,null,{"$f":"IF(AB1266=\"Y\",COUNT(#REF!), \"\")","v":""},null,"Erris","N",{"v":49.618459,"d":"49.61846"},{"v":-120.368922,"d":"-120.36892"},"http://www.google.com/maps/place/49.618459,-120.368922",100150,"Rural",13,13,"No","Yes","No","No ","Erris","FALSE","FALSE"]
[null,100151,"East Princeton","Yes","Yes","Yes","Regional District of Okanagan-Similkameen","Thompson--Okanagan",{"$nulls":8},"","","",null,0,0,null,null,{"$f":"IF(AB1267=\"Y\",COUNT(#REF!), \"\")","v":""},null,"East Princeton","N",{"v":49.461848,"d":"49.46185"},{"v":-120.449402,"d":"-120.44940"},"http://www.google.com/maps/place/49.461848,-120.449402",100151,"Rural",398,207,"Yes","No","Yes","No ","East Princeton","FALSE","FALSE"]
[null,100152,"Ashnola / Riverside*","No","No","Yes","Regional District of Okanagan-Similkameen","Thompson--Okanagan",{"$nulls":8},"","","",null,0,0,null,null,{"$f":"IF(AB1268=\"Y\",COUNT(#REF!), \"\")","v":0},null,"Ashnola / Riverside","Y",49.22308,{"v":-119.970223,"d":"-119.97022"},"http://www.google.com/maps/place/49.22308,-119.970223",100152,"Rural First Nations Secondary Reserve",100,41,"No","Yes","No","No ","Ashnola / Riverside*","FALSE","FALSE"]
[null,100153,"Twin Lakes","No","No","Yes","Regional District of Okanagan-Similkameen","Thompson--Okanagan",{"$nulls":8},"","","",null,0,0,null,null,{"$f":"IF(AB1269=\"Y\",COUNT(#REF!), \"\")","v":""},null,"Twin Lakes","N",{"v":49.342021,"d":"49.34202"},{"v":-119.718643,"d":"-119.71864"},"http://www.google.com/maps/place/49.342021,-119.718643",100153,"Rural",331,201,"No","Yes","No","No ","Twin Lakes","FALSE","FALSE"]
[null,100154,"Nursery","Yes","Yes","Yes","Regional District of Kootenay Boundary","Kootenay",{"$nulls":8},"","","",null,0,0,null,null,{"$f":"IF(AB1270=\"Y\",COUNT(#REF!), \"\")","v":""},null,"Nursery","N",{"v":49.016667,"d":"49.01667"},{"v":-118.4,"d":"-118.40000"},"http://www.google.com/maps/place/49.016667,-118.4",100154,"Rural",1280,642,"Yes","No","No","No ","Nursery","FALSE","FALSE"]
[null,100353,"Westham Island","No","Yes","Yes","Metro Vancouver Regional District","Lower Mainland--Southwest",{"$nulls":8},"","","",null,0,0,null,null,{"$f":"IF(AB1271=\"Y\",COUNT(#REF!), \"\")","v":""},null,"Westham Island","N",49.09045,{"v":-123.16043056,"d":"-123.16043"},"http://www.google.com/maps/place/49.09045,-123.16043056",100353,"Rural",4068,2049,"Yes","No","Yes","No ","Westham Island","FALSE","FALSE"]
[null,100359,"Aspen Grove","No","No","Yes","Thompson-Nicola Regional District","Thompson--Okanagan",{"$nulls":8},"","","",null,0,0,null,null,{"$f":"IF(AB1272=\"Y\",COUNT(#REF!), \"\")","v":""},null,"Aspen Grove","N",{"v":49.93842778,"d":"49.93843"},{"v":-120.62920278,"d":"-120.62920"},"http://www.google.com/maps/place/49.93842778,-120.62920278",100359,"Rural",6,5,"No","Yes","No","No ","Aspen Grove","FALSE","FALSE"]
[null,100360,"Quilchena*","No","Yes","Yes","Thompson-Nicola Regional District","Thompson--Okanagan",{"$nulls":8},"","","",null,0,0,null,null,{"$f":"IF(AB1273=\"Y\",COUNT(#REF!), \"\")","v":0},null,"Quilchena","Y",{"v":50.16623333,"d":"50.16623"},{"v":-120.49958333,"d":"-120.49958"},"http://www.google.com/maps/place/50.16623333,-120.49958333",100360,"Rural First Nations Secondary Reserve",104,106,"No","No","Yes","No ","Quilchena*","FALSE","FALSE"]
[null,100587,"Miller Creek","Yes","Yes","No","North Coast Regional District","North Coast",{"$nulls":8},"","","",null,0,0,null,null,{"$f":"IF(AB1274=\"Y\",COUNT(#REF!), \"\")","v":""},null,"Miller Creek","N",{"v":53.327952,"d":"53.32795"},{"v":-131.953695,"d":"-131.95370"},"http://www.google.com/maps/place/53.327952,-131.953695",100587,"Rural",4,3,"No","Yes","No","No ","Miller Creek","FALSE","FALSE"]
[null,100588,"Tow Hill","Yes","Yes","Yes","North Coast Regional District","North Coast",{"$nulls":8},"","","",null,0,0,null,null,{"$f":"IF(AB1275=\"Y\",COUNT(#REF!), \"\")","v":""},null,"Tow Hill","N",{"v":54.026145,"d":"54.02615"},{"v":-132.008433,"d":"-132.00843"},"http://www.google.com/maps/place/54.026145,-132.008433",100588,"Rural",12,7,"No","Yes","Yes","No ","Tow Hill","FALSE","FALSE"]

{"sheet":"Locales","index":2,"n_rows":58,"n_cols":15,"rows_kept":58,"merged":[[1,1,1,14],[2,1,2,13],[3,1,5,14],[6,1,6,10],[6,11,6,14],[7,1,22,10],[8,12,8,14],[9,12,9,14],[12,12,12,13],[13,12,13,13],[16,12,16,13],[17,12,17,13],[18,12,18,13],[19,12,19,13],[23,1,23,14],[24,1,24,14],[26,1,26,5],[26,7,26,10],[26,11,26,14]]}
[]
[null,"Connecting British Columbia Program: UBF Core Intake"]
[null,"                              LOCALES",{"$nulls":12},"Published January 7, 2021 – Ver. 1.0"]
[null,"Use this template to identify the locales/communities that will benefit from the proposed project; only if your community is not available in the Named Communities sheet."]
[]
[]
[null,"INSTRUCTIONS",{"$nulls":9},"SUMMARY (Auto-Populated)"]
[null,"Step 1: Enter the locales/communities for proposed project using the cells in column B.\n\nStep 2: Enter the latitude and longitude of the locale/community.\n\nStep 3: Using the drop-downs, select the Regional District & Economic Region in which the location resides. \n\nStep 4: Using the drop-down in column G, indicate the proposed solution for each community. \n\t\t\t\t\t\t\t\t\t\t\t\t\nStep 5: Filter out the blank rows.  Click on the filter button in cell G28 and remove the check mark beside (Blanks).  To undue this select the filter button and select the check mark beside (Blanks).\n\t\t\t\t\t\t\t\t\t\t\t\t\nStep 6: For each project community, provide information for columns H-N.\n\nNotes:\n1 Contention ratio or over subscription ratio is the number of users sharing the same data capacity. For example a 50:1 contention ratio means that up to 50 broadband customers are sharing the same bandwidth at any one time."]
[{"$nulls":11},"Project Name:",{"$f":"IF(ISBLANK('INSTRUCTIONS - Project Info'!E25), \"Auto-Populated from the INSTRUCTIONS Sheet\", 'INSTRUCTIONS - Project Info'!E25)","v":"Auto-Populated from the INSTRUCTIONS Sheet"}]
[{"$nulls":11},"Project Type:",{"$f":"IF(ISBLANK('INSTRUCTIONS - Project Info'!E27), \"Auto-Populated from the INSTRUCTIONS Sheet\", 'INSTRUCTIONS - Project Info'!E27)","v":"Auto-Populated from the INSTRUCTIONS Sheet"}]
[]
[{"$nulls":12},"Last-Mile:"]
[{"$nulls":12},"Total Number of Locales",null,{"$f":"COUNTIFS(Table16[Identify Solution for \nProposed Project \n(use drop-down in each cell)],\"*\"&\"Last-Mile\"&\"*\",Table16[Locale Name],\"*\")","v":0}]
[{"$nulls":12},"Total Number of Households",null,{"$f":"SUMIFS(Table16[Number of Households proposed to be served?],Table16[Identify Solution for \nProposed Project \n(use drop-down in each cell)],\"*\"&\"Last-Mile\"&\"*\",Table16[Locale Name],\"*\")","v":0}]
[]
[{"$nulls":12},"Transport:"]
[{"$nulls":12},"Total Number of Locales",null,{"$f":"COUNTIFS(Table16[Identify Solution for \nProposed Project \n(use drop-down in each cell)],\"*\"&\"Transport\"&\"*\",Table16[Locale Name],\"*\")","v":0}]
[]
[]
[]
[]
[]
[]
[null,"LOCALE INFORMATION"]
[]
[null,"Step 1","Step 2","Step 2","Step 3","Step 3","Step 4 & 5","Step 6","Step 6","Step 6","Step 6","Step 6","Step 6","Step 6"]
[null,"Location",{"$nulls":5},"Broadband",{"$nulls":3},"Network"]
[null,"Locale Name","Latitude","Longitude","Regional District","Economic Region","Identify Solution for \nProposed Project \n(use drop-down in each cell)","Number of Households proposed to be served?","Proposed Broadband Solution\n(use drop-down in each cell)","Speeds proposed for households\n(Mbps)","Contention Ratio1 \n(X:1) - enter value\nfor only X below","Existing Transport Capacity \n(Mbps)","Name of Existing\nWholesale Transport Provider\n(if applicable; leave blank for none)","Wholesale Transport Cost (if applicable)\n($ monthly)","Network\nCapacity\nCheck\n(Auto-populated)"]
[{"$nulls":14},{"$f":"IF(Table16[[#This Row],[Proposed Broadband Solution\n(use drop-down in each cell)]]=\"\",\"\",\nIF(Table16[[#This Row],[Speeds proposed for households\n(Mbps)]]=\"Other\",\"N/A\",\nIF(((Table16[[#This Row],[Number of Households proposed to be served?]]*\nIF(Table16[[#This Row],[Proposed Broadband Solution\n(use drop-down in each cell)]]=\"Minimum 50/10\",50,25))/Table16[[#This Row],[Contention Ratio1 \n(X:1) - enter value\nfor only X below]])\n<=Table16[[#This Row],[Existing Transport Capacity \n(Mbps)]],\"Sufficient Capacity\",\nIF(((Table16[[#This Row],[Number of Households proposed to be served?]]*\nIF(Table16[[#This Row],[Speeds proposed for households\n(Mbps)]]=\"Minimum 50/10\",50,25))/Table16[[#This Row],[Contention Ratio1 \n(X:1) - enter value\nfor only X below]])\n>Table16[[#This Row],[Existing Transport Capacity \n(Mbps)]],\"Not Enough Capacity\",\"Error\"))))","v":""}]
[{"$nulls":14},{"$f":"IF(Table16[[#This Row],[Proposed Broadband Solution\n(use drop-down in each cell)]]=\"\",\"\",\nIF(Table16[[#This Row],[Speeds proposed for households\n(Mbps)]]=\"Other\",\"N/A\",\nIF(((Table16[[#This Row],[Number of Households proposed to be served?]]*\nIF(Table16[[#This Row],[Proposed Broadband Solution\n(use drop-down in each cell)]]=\"Minimum 50/10\",50,25))/Table16[[#This Row],[Contention Ratio1 \n(X:1) - enter value\nfor only X below]])\n<=Table16[[#This Row],[Existing Transport Capacity \n(Mbps)]],\"Sufficient Capacity\",\nIF(((Table16[[#This Row],[Number of Households proposed to be served?]]*\nIF(Table16[[#This Row],[Speeds proposed for households\n(Mbps)]]=\"Minimum 50/10\",50,25))/Table16[[#This Row],[Contention Ratio1 \n(X:1) - enter value\nfor only X below]])\n>Table16[[#This Row],[Existing Transport Capacity \n(Mbps)]],\"Not Enough Capacity\",\"Error\"))))","v":""}]
[{"$nulls":14},{"$f":"IF(Table16[[#This Row],[Proposed Broadband Solution\n(use drop-down in each cell)]]=\"\",\"\",\nIF(Table16[[#This Row],[Speeds proposed for households\n(Mbps)]]=\"Other\",\"N/A\",\nIF(((Table16[[#This Row],[Number of Households proposed to be served?]]*\nIF(Table16[[#This Row],[Proposed Broadband Solution\n(use drop-down in each cell)]]=\"Minimum 50/10\",50,25))/Table16[[#This Row],[Contention Ratio1 \n(X:1) - enter value\nfor only X below]])\n<=Table16[[#This Row],[Existing Transport Capacity \n(Mbps)]],\"Sufficient Capacity\",\nIF(((Table16[[#This Row],[Number of Households proposed to be served?]]*\nIF(Table16[[#This Row],[Speeds proposed for households\n(Mbps)]]=\"Minimum 50/10\",50,25))/Table16[[#This Row],[Contention Ratio1 \n(X:1) - enter value\nfor only X below]])\n>Table16[[#This Row],[Existing Transport Capacity \n(Mbps)]],\"Not Enough Capacity\",\"Error\"))))","v":""}]
[{"$nulls":14},{"$f":"IF(Table16[[#This Row],[Proposed Broadband Solution\n(use drop-down in each cell)]]=\"\",\"\",\nIF(Table16[[#This Row],[Speeds proposed for households\n(Mbps)]]=\"Other\",\"N/A\",\nIF(((Table16[[#This Row],[Number of Households proposed to be served?]]*\nIF(Table16[[#This Row],[Proposed Broadband Solution\n(use drop-down in each cell)]]=\"Minimum 50/10\",50,25))/Table16[[#This Row],[Contention Ratio1 \n(X:1) - enter value\nfor only X below]])\n<=Table16[[#This Row],[Existing Transport Capacity \n(Mbps)]],\"Sufficient Capacity\",\nIF(((Table16[[#This Row],[Number of Households proposed to be served?]]*\nIF(Table16[[#This Row],[Speeds proposed for households\n(Mbps)]]=\"Minimum 50/10\",50,25))/Table16[[#This Row],[Contention Ratio1 \n(X:1) - enter value\nfor only X below]])\n>Table16[[#This Row],[Existing Transport Capacity \n(Mbps)]],\"Not Enough Capacity\",\"Error\"))))","v":""}]
[{"$nulls":14},{"$f":"IF(Table16[[#This Row],[Proposed Broadband Solution\n(use drop-down in each cell)]]=\"\",\"\",\nIF(Table16[[#This Row],[Speeds proposed for households\n(Mbps)]]=\"Other\",\"N/A\",\nIF(((Table16[[#This Row],[Number of Households proposed to be served?]]*\nIF(Table16[[#This Row],[Proposed Broadband Solution\n(use drop-down in each cell)]]=\"Minimum 50/10\",50,25))/Table16[[#This Row],[Contention Ratio1 \n(X:1) - enter value\nfor only X below]])\n<=Table16[[#This Row],[Existing Transport Capacity \n(Mbps)]],\"Sufficient Capacity\",\nIF(((Table16[[#This Row],[Number of Households proposed to be served?]]*\nIF(Table16[[#This Row],[Speeds proposed for households\n(Mbps)]]=\"Minimum 50/10\",50,25))/Table16[[#This Row],[Contention Ratio1 \n(X:1) - enter value\nfor only X below]])\n>Table16[[#This Row],[Existing Transport Capacity \n(Mbps)]],\"Not Enough Capacity\",\"Error\"))))","v":""}]
[{"$nulls":14},{"$f":"IF(Table16[[#This Row],[Proposed Broadband Solution\n(use drop-down in each cell)]]=\"\",\"\",\nIF(Table16[[#This Row],[Speeds proposed for households\n(Mbps)]]=\"Other\",\"N/A\",\nIF(((Table16[[#This Row],[Number of Households proposed to be served?]]*\nIF(Table16[[#This Row],[Proposed Broadband Solution\n(use drop-down in each cell)]]=\"Minimum 50/10\",50,25))/Table16[[#This Row],[Contention Ratio1 \n(X:1) - enter value\nfor only X below]])\n<=Table16[[#This Row],[Existing Transport Capacity \n(Mbps)]],\"Sufficient Capacity\",\nIF(((Table16[[#This Row],[Number of Households proposed to be served?]]*\nIF(Table16[[#This Row],[Speeds proposed for households\n(Mbps)]]=\"Minimum 50/10\",50,25))/Table16[[#This Row],[Contention Ratio1 \n(X:1) - enter value\nfor only X below]])\n>Table16[[#This Row],[Existing Transport Capacity \n(Mbps)]],\"Not Enough Capacity\",\"Error\"))))","v":""}]
[{"$nulls":14},{"$f":"IF(Table16[[#This Row],[Proposed Broadband Solution\n(use drop-down in each cell)]]=\"\",\"\",\nIF(Table16[[#This Row],[Speeds proposed for households\n(Mbps)]]=\"Other\",\"N/A\",\nIF(((Table16[[#This Row],[Number of Households proposed to be served?]]*\nIF(Table16[[#This Row],[Proposed Broadband Solution\n(use drop-down in each cell)]]=\"Minimum 50/10\",50,25))/Table16[[#This Row],[Contention Ratio1 \n(X:1) - enter value\nfor only X below]])\n<=Table16[[#This Row],[Existing Transport Capacity \n(Mbps)]],\"Sufficient Capacity\",\nIF(((Table16[[#This Row],[Number of Households proposed to be served?]]*\nIF(Table16[[#This Row],[Speeds proposed for households\n(Mbps)]]=\"Minimum 50/10\",50,25))/Table16[[#This Row],[Contention Ratio1 \n(X:1) - enter value\nfor only X below]])\n>Table16[[#This Row],[Existing Transport Capacity \n(Mbps)]],\"Not Enough Capacity\",\"Error\"))))","v":""}]
[{"$nulls":14},{"$f":"IF(Table16[[#This Row],[Proposed Broadband Solution\n(use drop-down in each cell)]]=\"\",\"\",\nIF(Table16[[#This Row],[Speeds proposed for households\n(Mbps)]]=\"Other\",\"N/A\",\nIF(((Table16[[#This Row],[Number of Households proposed to be served?]]*\nIF(Table16[[#This Row],[Proposed Broadband Solution\n(use drop-down in each cell)]]=\"Minimum 50/10\",50,25))/Table16[[#This Row],[Contention Ratio1 \n(X:1) - enter value\nfor only X below]])\n<=Table16[[#This Row],[Existing Transport Capacity \n(Mbps)]],\"Sufficient Capacity\",\nIF(((Table16[[#This Row],[Number of Households proposed to be served?]]*\nIF(Table16[[#This Row],[Speeds proposed for households\n(Mbps)]]=\"Minimum 50/10\",50,25))/Table16[[#This Row],[Contention Ratio1 \n(X:1) - enter value\nfor only X below]])\n>Table16[[#This Row],[Existing Transport Capacity \n(Mbps)]],\"Not Enough Capacity\",\"Error\"))))","v":""}]
[{"$nulls":14},{"$f":"IF(Table16[[#This Row],[Proposed Broadband Solution\n(use drop-down in each cell)]]=\"\",\"\",\nIF(Table16[[#This Row],[Speeds proposed for households\n(Mbps)]]=\"Other\",\"N/A\",\nIF(((Table16[[#This Row],[Number of Households proposed to be served?]]*\nIF(Table16[[#This Row],[Proposed Broadband Solution\n(use drop-down in each cell)]]=\"Minimum 50/10\",50,25))/Table16[[#This Row],[Contention Ratio1 \n(X:1) - enter value\nfor only X below]])\n<=Table16[[#This Row],[Existing Transport Capacity \n(Mbps)]],\"Sufficient Capacity\",\nIF(((Table16[[#This Row],[Number of Households proposed to be served?]]*\nIF(Table16[[#This Row],[Speeds proposed for households\n(Mbps)]]=\"Minimum 50/10\",50,25))/Table16[[#This Row],[Contention Ratio1 \n(X:1) - enter value\nfor only X below]])\n>Table16[[#This Row],[Existing Transport Capacity \n(Mbps)]],\"Not Enough Capacity\",\"Error\"))))","v":""}]
[{"$nulls":14},{"$f":"IF(Table16[[#This Row],[Proposed Broadband Solution\n(use drop-down in each cell)]]=\"\",\"\",\nIF(Table16[[#This Row],[Speeds proposed for households\n(Mbps)]]=\"Other\",\"N/A\",\nIF(((Table16[[#This Row],[Number of Households proposed to be served?]]*\nIF(Table16[[#This Row],[Proposed Broadband Solution\n(use drop-down in each cell)]]=\"Minimum 50/10\",50,25))/Table16[[#This Row],[Contention Ratio1 \n(X:1) - enter value\nfor only X below]])\n<=Table16[[#This Row],[Existing Transport Capacity \n(Mbps)]],\"Sufficient Capacity\",\nIF(((Table16[[#This Row],[Number of Households proposed to be served?]]*\nIF(Table16[[#This Row],[Speeds proposed for households\n(Mbps)]]=\"Minimum 50/10\",50,25))/Table16[[#This Row],[Contention Ratio1 \n(X:1) - enter value\nfor only X below]])\n>Table16[[#This Row],[Existing Transport Capacity \n(Mbps)]],\"Not Enough Capacity\",\"Error\"))))","v":""}]
[{"$nulls":14},{"$f":"IF(Table16[[#This Row],[Proposed Broadband Solution\n(use drop-down in each cell)]]=\"\",\"\",\nIF(Table16[[#This Row],[Speeds proposed for households\n(Mbps)]]=\"Other\",\"N/A\",\nIF(((Table16[[#This Row],[Number of Households proposed to be served?]]*\nIF(Table16[[#This Row],[Proposed Broadband Solution\n(use drop-down in each cell)]]=\"Minimum 50/10\",50,25))/Table16[[#This Row],[Contention Ratio1 \n(X:1) - enter value\nfor only X below]])\n<=Table16[[#This Row],[Existing Transport Capacity \n(Mbps)]],\"Sufficient Capacity\",\nIF(((Table16[[#This Row],[Number of Households proposed to be served?]]*\nIF(Table16[[#This Row],[Speeds proposed for households\n(Mbps)]]=\"Minimum 50/10\",50,25))/Table16[[#This Row],[Contention Ratio1 \n(X:1) - enter value\nfor only X below]])\n>Table16[[#This Row],[Existing Transport Capacity \n(Mbps)]],\"Not Enough Capacity\",\"Error\"))))","v":""}]
[{"$nulls":14},{"$f":"IF(Table16[[#This Row],[Proposed Broadband Solution\n(use drop-down in each cell)]]=\"\",\"\",\nIF(Table16[[#This Row],[Speeds proposed for households\n(Mbps)]]=\"Other\",\"N/A\",\nIF(((Table16[[#This Row],[Number of Households proposed to be served?]]*\nIF(Table16[[#This Row],[Proposed Broadband Solution\n(use drop-down in each cell)]]=\"Minimum 50/10\",50,25))/Table16[[#This Row],[Contention Ratio1 \n(X:1) - enter value\nfor only X below]])\n<=Table16[[#This Row],[Existing Transport Capacity \n(Mbps)]],\"Sufficient Capacity\",\nIF(((Table16[[#This Row],[Number of Households proposed to be served?]]*\nIF(Table16[[#This Row],[Speeds proposed for households\n(Mbps)]]=\"Minimum 50/10\",50,25))/Table16[[#This Row],[Contention Ratio1 \n(X:1) - enter value\nfor only X below]])\n>Table16[[#This Row],[Existing Transport Capacity \n(Mbps)]],\"Not Enough Capacity\",\"Error\"))))","v":""}]
[{"$nulls":14},{"$f":"IF(Table16[[#This Row],[Proposed Broadband Solution\n(use drop-down in each cell)]]=\"\",\"\",\nIF(Table16[[#This Row],[Speeds proposed for households\n(Mbps)]]=\"Other\",\"N/A\",\nIF(((Table16[[#This Row],[Number of Households proposed to be served?]]*\nIF(Table16[[#This Row],[Proposed Broadband Solution\n(use drop-down in each cell)]]=\"Minimum 50/10\",50,25))/Table16[[#This Row],[Contention Ratio1 \n(X:1) - enter value\nfor only X below]])\n<=Table16[[#This Row],[Existing Transport Capacity \n(Mbps)]],\"Sufficient Capacity\",\nIF(((Table16[[#This Row],[Number of Households proposed to be served?]]*\nIF(Table16[[#This Row],[Speeds proposed for households\n(Mbps)]]=\"Minimum 50/10\",50,25))/Table16[[#This Row],[Contention Ratio1 \n(X:1) - enter value\nfor only X below]])\n>Table16[[#This Row],[Existing Transport Capacity \n(Mbps)]],\"Not Enough Capacity\",\"Error\"))))","v":""}]
[{"$nulls":14},{"$f":"IF(Table16[[#This Row],[Proposed Broadband Solution\n(use drop-down in each cell)]]=\"\",\"\",\nIF(Table16[[#This Row],[Speeds proposed for households\n(Mbps)]]=\"Other\",\"N/A\",\nIF(((Table16[[#This Row],[Number of Households proposed to be served?]]*\nIF(Table16[[#This Row],[Proposed Broadband Solution\n(use drop-down in each cell)]]=\"Minimum 50/10\",50,25))/Table16[[#This Row],[Contention Ratio1 \n(X:1) - enter value\nfor only X below]])\n<=Table16[[#This Row],[Existing Transport Capacity \n(Mbps)]],\"Sufficient Capacity\",\nIF(((Table16[[#This Row],[Number of Households proposed to be served?]]*\nIF(Table16[[#This Row],[Speeds proposed for households\n(Mbps)]]=\"Minimum 50/10\",50,25))/Table16[[#This Row],[Contention Ratio1 \n(X:1) - enter value\nfor only X below]])\n>Table16[[#This Row],[Existing Transport Capacity \n(Mbps)]],\"Not Enough Capacity\",\"Error\"))))","v":""}]
[{"$nulls":14},{"$f":"IF(Table16[[#This Row],[Proposed Broadband Solution\n(use drop-down in each cell)]]=\"\",\"\",\nIF(Table16[[#This Row],[Speeds proposed for households\n(Mbps)]]=\"Other\",\"N/A\",\nIF(((Table16[[#This Row],[Number of Households proposed to be served?]]*\nIF(Table16[[#This Row],[Proposed Broadband Solution\n(use drop-down in each cell)]]=\"Minimum 50/10\",50,25))/Table16[[#This Row],[Contention Ratio1 \n(X:1) - enter value\nfor only X below]])\n<=Table16[[#This Row],[Existing Transport Capacity \n(Mbps)]],\"Sufficient Capacity\",\nIF(((Table16[[#This Row],[Number of Households proposed to be served?]]*\nIF(Table16[[#This Row],[Speeds proposed for households\n(Mbps)]]=\"Minimum 50/10\",50,25))/Table16[[#This Row],[Contention Ratio1 \n(X:1) - enter value\nfor only X below]])\n>Table16[[#This Row],[Existing Transport Capacity \n(Mbps)]],\"Not Enough Capacity\",\"Error\"))))","v":""}]
[{"$nulls":14},{"$f":"IF(Table16[[#This Row],[Proposed Broadband Solution\n(use drop-down in each cell)]]=\"\",\"\",\nIF(Table16[[#This Row],[Speeds proposed for households\n(Mbps)]]=\"Other\",\"N/A\",\nIF(((Table16[[#This Row],[Number of Households proposed to be served?]]*\nIF(Table16[[#This Row],[Proposed Broadband Solution\n(use drop-down in each cell)]]=\"Minimum 50/10\",50,25))/Table16[[#This Row],[Contention Ratio1 \n(X:1) - enter value\nfor only X below]])\n<=Table16[[#This Row],[Existing Transport Capacity \n(Mbps)]],\"Sufficient Capacity\",\nIF(((Table16[[#This Row],[Number of Households proposed to be served?]]*\nIF(Table16[[#This Row],[Speeds proposed for households\n(Mbps)]]=\"Minimum 50/10\",50,25))/Table16[[#This Row],[Contention Ratio1 \n(X:1) - enter value\nfor only X below]])\n>Table16[[#This Row],[Existing Transport Capacity \n(Mbps)]],\"Not Enough Capacity\",\"Error\"))))","v":""}]
[{"$nulls":14},{"$f":"IF(Table16[[#This Row],[Proposed Broadband Solution\n(use drop-down in each cell)]]=\"\",\"\",\nIF(Table16[[#This Row],[Speeds proposed for households\n(Mbps)]]=\"Other\",\"N/A\",\nIF(((Table16[[#This Row],[Number of Households proposed to be served?]]*\nIF(Table16[[#This Row],[Proposed Broadband Solution\n(use drop-down in each cell)]]=\"Minimum 50/10\",50,25))/Table16[[#This Row],[Contention Ratio1 \n(X:1) - enter value\nfor only X below]])\n<=Table16[[#This Row],[Existing Transport Capacity \n(Mbps)]],\"Sufficient Capacity\",\nIF(((Table16[[#This Row],[Number of Households proposed to be served?]]*\nIF(Table16[[#This Row],[Speeds proposed for households\n(Mbps)]]=\"Minimum 50/10\",50,25))/Table16[[#This Row],[Contention Ratio1 \n(X:1) - enter value\nfor only X below]])\n>Table16[[#This Row],[Existing Transport Capacity \n(Mbps)]],\"Not Enough Capacity\",\"Error\"))))","v":""}]
[{"$nulls":14},{"$f":"IF(Table16[[#This Row],[Proposed Broadband Solution\n(use drop-down in each cell)]]=\"\",\"\",\nIF(Table16[[#This Row],[Speeds proposed for households\n(Mbps)]]=\"Other\",\"N/A\",\nIF(((Table16[[#This Row],[Number of Households proposed to be served?]]*\nIF(Table16[[#This Row],[Proposed Broadband Solution\n(use drop-down in each cell)]]=\"Minimum 50/10\",50,25))/Table16[[#This Row],[Contention Ratio1 \n(X:1) - enter value\nfor only X below]])\n<=Table16[[#This Row],[Existing Transport Capacity \n(Mbps)]],\"Sufficient Capacity\",\nIF(((Table16[[#This Row],[Number of Households proposed to be served?]]*\nIF(Table16[[#This Row],[Speeds proposed for households\n(Mbps)]]=\"Minimum 50/10\",50,25))/Table16[[#This Row],[Contention Ratio1 \n(X:1) - enter value\nfor only X below]])\n>Table16[[#This Row],[Existing Transport Capacity \n(Mbps)]],\"Not Enough Capacity\",\"Error\"))))","v":""}]
[{"$nulls":14},{"$f":"IF(Table16[[#This Row],[Proposed Broadband Solution\n(use drop-down in each cell)]]=\"\",\"\",\nIF(Table16[[#This Row],[Speeds proposed for households\n(Mbps)]]=\"Other\",\"N/A\",\nIF(((Table16[[#This Row],[Number of Households proposed to be served?]]*\nIF(Table16[[#This Row],[Proposed Broadband Solution\n(use drop-down in each cell)]]=\"Minimum 50/10\",50,25))/Table16[[#This Row],[Contention Ratio1 \n(X:1) - enter value\nfor only X below]])\n<=Table16[[#This Row],[Existing Transport Capacity \n(Mbps)]],\"Sufficient Capacity\",\nIF(((Table16[[#This Row],[Number of Households proposed to be served?]]*\nIF(Table16[[#This Row],[Speeds proposed for households\n(Mbps)]]=\"Minimum 50/10\",50,25))/Table16[[#This Row],[Contention Ratio1 \n(X:1) - enter value\nfor only X below]])\n>Table16[[#This Row],[Existing Transport Capacity \n(Mbps)]],\"Not Enough Capacity\",\"Error\"))))","v":""}]
[{"$nulls":14},{"$f":"IF(Table16[[#This Row],[Proposed Broadband Solution\n(use drop-down in each cell)]]=\"\",\"\",\nIF(Table16[[#This Row],[Speeds proposed for households\n(Mbps)]]=\"Other\",\"N/A\",\nIF(((Table16[[#This Row],[Number of Households proposed to be served?]]*\nIF(Table16[[#This Row],[Proposed Broadband Solution\n(use drop-down in each cell)]]=\"Minimum 50/10\",50,25))/Table16[[#This Row],[Contention Ratio1 \n(X:1) - enter value\nfor only X below]])\n<=Table16[[#This Row],[Existing Transport Capacity \n(Mbps)]],\"Sufficient Capacity\",\nIF(((Table16[[#This Row],[Number of Households proposed to be served?]]*\nIF(Table16[[#This Row],[Speeds proposed for households\n(Mbps)]]=\"Minimum 50/10\",50,25))/Table16[[#This Row],[Contention Ratio1 \n(X:1) - enter value\nfor only X below]])\n>Table16[[#This Row],[Existing Transport Capacity \n(Mbps)]],\"Not Enough Capacity\",\"Error\"))))","v":""}]
[{"$nulls":14},{"$f":"IF(Table16[[#This Row],[Proposed Broadband Solution\n(use drop-down in each cell)]]=\"\",\"\",\nIF(Table16[[#This Row],[Speeds proposed for households\n(Mbps)]]=\"Other\",\"N/A\",\nIF(((Table16[[#This Row],[Number of Households proposed to be served?]]*\nIF(Table16[[#This Row],[Proposed Broadband Solution\n(use drop-down in each cell)]]=\"Minimum 50/10\",50,25))/Table16[[#This Row],[Contention Ratio1 \n(X:1) - enter value\nfor only X below]])\n<=Table16[[#This Row],[Existing Transport Capacity \n(Mbps)]],\"Sufficient Capacity\",\nIF(((Table16[[#This Row],[Number of Households proposed to be served?]]*\nIF(Table16[[#This Row],[Speeds proposed for households\n(Mbps)]]=\"Minimum 50/10\",50,25))/Table16[[#This Row],[Contention Ratio1 \n(X:1) - enter value\nfor only X below]])\n>Table16[[#This Row],[Existing Transport Capacity \n(Mbps)]],\"Not Enough Capacity\",\"Error\"))))","v":""}]
[{"$nulls":14},{"$f":"IF(Table16[[#This Row],[Proposed Broadband Solution\n(use drop-down in each cell)]]=\"\",\"\",\nIF(Table16[[#This Row],[Speeds proposed for households\n(Mbps)]]=\"Other\",\"N/A\",\nIF(((Table16[[#This Row],[Number of Households proposed to be served?]]*\nIF(Table16[[#This Row],[Proposed Broadband Solution\n(use drop-down in each cell)]]=\"Minimum 50/10\",50,25))/Table16[[#This Row],[Contention Ratio1 \n(X:1) - enter value\nfor only X below]])\n<=Table16[[#This Row],[Existing Transport Capacity \n(Mbps)]],\"Sufficient Capacity\",\nIF(((Table16[[#This Row],[Number of Households proposed to be served?]]*\nIF(Table16[[#This Row],[Speeds proposed for households\n(Mbps)]]=\"Minimum 50/10\",50,25))/Table16[[#This Row],[Contention Ratio1 \n(X:1) - enter value\nfor only X below]])\n>Table16[[#This Row],[Existing Transport Capacity \n(Mbps)]],\"Not Enough Capacity\",\"Error\"))))","v":""}]
[{"$nulls":14},{"$f":"IF(Table16[[#This Row],[Proposed Broadband Solution\n(use drop-down in each cell)]]=\"\",\"\",\nIF(Table16[[#This Row],[Speeds proposed for households\n(Mbps)]]=\"Other\",\"N/A\",\nIF(((Table16[[#This Row],[Number of Households proposed to be served?]]*\nIF(Table16[[#This Row],[Proposed Broadband Solution\n(use drop-down in each cell)]]=\"Minimum 50/10\",50,25))/Table16[[#This Row],[Contention Ratio1 \n(X:1) - enter value\nfor only X below]])\n<=Table16[[#This Row],[Existing Transport Capacity \n(Mbps)]],\"Sufficient Capacity\",\nIF(((Table16[[#This Row],[Number of Households proposed to be served?]]*\nIF(Table16[[#This Row],[Speeds proposed for households\n(Mbps)]]=\"Minimum 50/10\",50,25))/Table16[[#This Row],[Contention Ratio1 \n(X:1) - enter value\nfor only X below]])\n>Table16[[#This Row],[Existing Transport Capacity \n(Mbps)]],\"Not Enough Capacity\",\"Error\"))))","v":""}]
[{"$nulls":14},{"$f":"IF(Table16[[#This Row],[Proposed Broadband Solution\n(use drop-down in each cell)]]=\"\",\"\",\nIF(Table16[[#This Row],[Speeds proposed for households\n(Mbps)]]=\"Other\",\"N/A\",\nIF(((Table16[[#This Row],[Number of Households proposed to be served?]]*\nIF(Table16[[#This Row],[Proposed Broadband Solution\n(use drop-down in each cell)]]=\"Minimum 50/10\",50,25))/Table16[[#This Row],[Contention Ratio1 \n(X:1) - enter value\nfor only X below]])\n<=Table16[[#This Row],[Existing Transport Capacity \n(Mbps)]],\"Sufficient Capacity\",\nIF(((Table16[[#This Row],[Number of Households proposed to be served?]]*\nIF(Table16[[#This Row],[Speeds proposed for households\n(Mbps)]]=\"Minimum 50/10\",50,25))/Table16[[#This Row],[Contention Ratio1 \n(X:1) - enter value\nfor only X below]])\n>Table16[[#This Row],[Existing Transport Capacity \n(Mbps)]],\"Not Enough Capacity\",\"Error\"))))","v":""}]
[{"$nulls":14},{"$f":"IF(Table16[[#This Row],[Proposed Broadband Solution\n(use drop-down in each cell)]]=\"\",\"\",\nIF(Table16[[#This Row],[Speeds proposed for households\n(Mbps)]]=\"Other\",\"N/A\",\nIF(((Table16[[#This Row],[Number of Households proposed to be served?]]*\nIF(Table16[[#This Row],[Proposed Broadband Solution\n(use drop-down in each cell)]]=\"Minimum 50/10\",50,25))/Table16[[#This Row],[Contention Ratio1 \n(X:1) - enter value\nfor only X below]])\n<=Table16[[#This Row],[Existing Transport Capacity \n(Mbps)]],\"Sufficient Capacity\",\nIF(((Table16[[#This Row],[Number of Households proposed to be served?]]*\nIF(Table16[[#This Row],[Speeds proposed for households\n(Mbps)]]=\"Minimum 50/10\",50,25))/Table16[[#This Row],[Contention Ratio1 \n(X:1) - enter value\nfor only X below]])\n>Table16[[#This Row],[Existing Transport Capacity \n(Mbps)]],\"Not Enough Capacity\",\"Error\"))))","v":""}]
[{"$nulls":14},{"$f":"IF(Table16[[#This Row],[Proposed Broadband Solution\n(use drop-down in each cell)]]=\"\",\"\",\nIF(Table16[[#This Row],[Speeds proposed for households\n(Mbps)]]=\"Other\",\"N/A\",\nIF(((Table16[[#This Row],[Number of Households proposed to be served?]]*\nIF(Table16[[#This Row],[Proposed Broadband Solution\n(use drop-down in each cell)]]=\"Minimum 50/10\",50,25))/Table16[[#This Row],[Contention Ratio1 \n(X:1) - enter value\nfor only X below]])\n<=Table16[[#This Row],[Existing Transport Capacity \n(Mbps)]],\"Sufficient Capacity\",\nIF(((Table16[[#This Row],[Number of Households proposed to be served?]]*\nIF(Table16[[#This Row],[Speeds proposed for households\n(Mbps)]]=\"Minimum 50/10\",50,25))/Table16[[#This Row],[Contention Ratio1 \n(X:1) - enter value\nfor only X below]])\n>Table16[[#This Row],[Existing Transport Capacity \n(Mbps)]],\"Not Enough Capacity\",\"Error\"))))","v":""}]
[]
[{"$nulls":14},{"$f":"IF(Table16[[#This Row],[Proposed Broadband Solution\n(use drop-down in each cell)]]=\"\",\"\",\nIF(Table16[[#This Row],[Speeds proposed for households\n(Mbps)]]=\"Other\",\"N/A\",\nIF(((Table16[[#This Row],[Number of Households proposed to be served?]]*\nIF(Table16[[#This Row],[Proposed Broadband Solution\n(use drop-down in each cell)]]=\"Minimum 50/10\",50,25))/Table16[[#This Row],[Contention Ratio1 \n(X:1) - enter value\nfor only X below]])\n<=Table16[[#This Row],[Existing Transport Capacity \n(Mbps)]],\"Sufficient Capacity\",\nIF(((Table16[[#This Row],[Number of Households proposed to be served?]]*\nIF(Table16[[#This Row],[Speeds proposed for households\n(Mbps)]]=\"Minimum 50/10\",50,25))/Table16[[#This Row],[Contention Ratio1 \n(X:1) - enter value\nfor only X below]])\n>Table16[[#This Row],[Existing Transport Capacity \n(Mbps)]],\"Not Enough Capacity\",\"Error\"))))","v":""}]
[{"$nulls":14},{"$f":"IF(Table16[[#This Row],[Proposed Broadband Solution\n(use drop-down in each cell)]]=\"\",\"\",\nIF(Table16[[#This Row],[Speeds proposed for households\n(Mbps)]]=\"Other\",\"N/A\",\nIF(((Table16[[#This Row],[Number of Households proposed to be served?]]*\nIF(Table16[[#This Row],[Proposed Broadband Solution\n(use drop-down in each cell)]]=\"Minimum 50/10\",50,25))/Table16[[#This Row],[Contention Ratio1 \n(X:1) - enter value\nfor only X below]])\n<=Table16[[#This Row],[Existing Transport Capacity \n(Mbps)]],\"Sufficient Capacity\",\nIF(((Table16[[#This Row],[Number of Households proposed to be served?]]*\nIF(Table16[[#This Row],[Speeds proposed for households\n(Mbps)]]=\"Minimum 50/10\",50,25))/Table16[[#This Row],[Contention Ratio1 \n(X:1) - enter value\nfor only X below]])\n>Table16[[#This Row],[Existing Transport Capacity \n(Mbps)]],\"Not Enough Capacity\",\"Error\"))))","v":""}]
[{"$nulls":14},{"$f":"IF(Table16[[#This Row],[Proposed Broadband Solution\n(use drop-down in each cell)]]=\"\",\"\",\nIF(Table16[[#This Row],[Speeds proposed for households\n(Mbps)]]=\"Other\",\"N/A\",\nIF(((Table16[[#This Row],[Number of Households proposed to be served?]]*\nIF(Table16[[#This Row],[Proposed Broadband Solution\n(use drop-down in each cell)]]=\"Minimum 50/10\",50,25))/Table16[[#This Row],[Contention Ratio1 \n(X:1) - enter value\nfor only X below]])\n<=Table16[[#This Row],[Existing Transport Capacity \n(Mbps)]],\"Sufficient Capacity\",\nIF(((Table16[[#This Row],[Number of Households proposed to be served?]]*\nIF(Table16[[#This Row],[Speeds proposed for households\n(Mbps)]]=\"Minimum 50/10\",50,25))/Table16[[#This Row],[Contention Ratio1 \n(X:1) - enter value\nfor only X below]])\n>Table16[[#This Row],[Existing Transport Capacity \n(Mbps)]],\"Not Enough Capacity\",\"Error\"))))","v":""}]

{"sheet":"Detailed Budget","index":3,"n_rows":149,"n_cols":9,"rows_kept":149,"merged":[[1,1,1,8],[2,1,2,7],[3,1,5,8],[6,4,6,8],[8,1,11,3],[8,5,8,8],[9,5,9,6],[12,1,14,3],[16,1,19,2],[16,5,16,7],[17,5,17,6],[18,5,18,6],[19,5,19,6],[20,5,20,6],[21,5,21,6],[25,1,25,8],[27,1,27,2],[27,4,27,5],[27,6,27,7],[28,1,28,2],[29,1,29,2],[29,4,29,5],[29,6,29,7],[30,1,30,2],[30,4,30,5],[30,6,30,7],[31,1,31,2],[31,4,31,5],[31,6,31,7],[32,1,32,2],[32,4,32,5],[32,6,32,7],[33,1,33,2],[33,4,33,5],[33,6,33,7],[34,1,34,2],[34,4,34,5],[34,6,34,7],[35,1,35,2],[35,4,35,5],[35,6,35,7],[36,1,36,2],[37,1,37,2],[37,4,37,5],[37,6,37,7],[38,1,38,2],[38,4,38,5],[38,6,38,7],[39,1,39,2],[39,4,39,5],[39,6,39,7],[40,1,40,2],[40,4,40,5],[40,6,40,7],[41,1,41,2],[41,4,41,5],[41,6,41,7],[42,1,42,2],[42,4,42,5],[42,6,42,7],[43,1,43,2],[43,4,43,5],[43,6,43,7],[44,1,44,2],[44,4,44,5],[44,6,44,7],[45,1,45,2],[46,1,46,2],[46,4,46,5],[46,6,46,7],[47,1,47,2],[47,4,47,5],[47,6,47,7],[48,1,48,2],[48,4,48,5],[48,6,48,7],[49,1,49,2],[49,4,49,5],[49,6,49,7],[50,1,50,2],[50,4,50,5],[50,6,50,7],[51,1,51,2],[51,4,51,5],[51,6,51,7],[52,1,52,2],[52,4,52,5],[52,6,52,7],[53,1,53,2],[53,4,53,5],[53,6,53,7],[54,1,54,2],[54,4,54,5],[54,6,54,7],[55,1,55,2],[55,4,55,5],[55,6,55,7],[56,1,56,2],[56,4,56,5],[56,6,56,7],[57,1,57,2],[57,4,57,5],[57,6,57,7],[58,1,58,2],[58,4,58,5],[58,6,58,7],[59,1,59,2],[59,4,59,5],[59,6,59,7],[60,1,60,2],[60,4,60,5],[60,6,60,7],[61,1,61,2],[61,4,61,5],[61,6,61,7],[62,1,62,2],[62,4,62,5],[62,6,62,7],[63,1,63,2],[64,1,64,2],[64,4,64,5],[64,6,64,7],[65,1,65,2],[65,4,65,5],[65,6,65,7],[66,1,66,2],[66,4,66,5],[66,6,66,7],[67,1,67,2],[67,4,67,5],[67,6,67,7],[68,1,68,2],[68,4,68,5],[68,6,68,7],[69,1,69,2],[69,4,69,5],[69,6,69,7],[70,1,70,2],[70,4,70,5],[70,6,70,7],[71,1,71,2],[71,4,71,5],[71,6,71,7],[72,1,72,2],[73,1,73,2],[73,4,73,5],[73,6,73,7],[74,1,74,2],[74,4,74,5],[74,6,74,7],[75,1,75,2],[75,4,75,5],[75,6,75,7],[76,1,76,2],[76,4,76,5],[76,6,76,7],[77,1,77,2],[77,4,77,5],[77,6,77,7],[78,1,78,2],[78,4,78,5],[78,6,78,7],[79,1,79,2],[79,4,79,5],[79,6,79,7],[80,1,80,2],[80,4,80,5],[80,6,80,7],[81,1,81,2],[81,4,81,5],[81,6,81,7],[82,1,82,2],[82,4,82,5],[82,6,82,7],[83,1,83,2],[83,4,83,5],[83,6,83,7],[84,1,84,2],[84,4,84,5],[84,6,84,7],[85,1,85,3],[85,4,85,5],[85,6,85,7],[87,1,87,2],[87,4,87,5],[87,6,87,7],[88,1,88,2],[89,1,89,2],[89,4,89,5],[89,6,89,7],[90,1,90,2],[90,4,90,5],[90,6,90,7],[91,1,91,2],[91,4,91,5],[91,6,91,7],[92,1,92,2],[92,4,92,5],[92,6,92,7],[93,1,93,2],[93,4,93,5],[93,6,93,7],[94,1,94,2],[94,4,94,5],[94,6,94,7],[95,1,95,2],[96,1,96,2],[96,4,96,5],[96,6,96,7],[97,1,97,2],[97,4,97,5],[97,6,97,7],[98,1,98,2],[98,4,98,5],[98,6,98,7],[99,1,99,2],[99,4,99,5],[99,6,99,7],[100,1,100,2],[100,4,100,5],[100,6,100,7],[101,1,101,2],[101,4,101,5],[101,6,101,7],[102,1,102,2],[103,1,103,2],[103,4,103,5],[103,6,103,7],[104,1,104,2],[104,4,104,5],[104,6,104,7],[105,1,105,2],[105,4,105,5],[105,6,105,7],[106,1,106,2],[106,4,106,5],[106,6,106,7],[107,1,107,2],[107,4,107,5],[107,6,107,7],[108,1,108,2],[108,4,108,5],[108,6,108,7],[109,1,109,2],[109,4,109,5],[109,6,109,7],[110,1,110,2],[110,4,110,5],[110,6,110,7],[111,1,111,2],[111,4,111,5],[111,6,111,7],[112,1,112,2],[112,4,112,5],[112,6,112,7],[113,1,113,2],[114,1,114,2],[114,4,114,5],[114,6,114,7],[115,1,115,2],[115,4,115,5],[115,6,115,7],[116,1,116,2],[116,4,116,5],[116,6,116,7],[117,1,117,2],[117,4,117,5],[117,6,117,7],[118,1,118,2],[118,4,118,5],[118,6,118,7],[119,1,119,2],[119,4,119,5],[119,6,119,7],[120,1,120,2],[121,1,121,2],[121,4,121,5],[121,6,121,7],[122,1,122,2],[122,4,122,5],[122,6,122,7],[123,1,123,2],[123,4,123,5],[123,6,123,7],[124,1,124,2],[124,4,124,5],[124,6,124,7],[125,1,125,2],[125,4,125,5],[125,6,125,7],[126,1,126,2],[126,4,126,5],[126,6,126,7],[127,1,127,2],[127,4,127,5],[127,6,127,7],[128,1,128,2],[128,4,128,5],[128,6,128,7],[129,1,129,3],[129,4,129,5],[129,6,129,7],[131,1,131,8],[133,2,133,3],[134,2,134,3],[135,2,135,3],[136,2,136,3],[138,2,138,4],[139,2,139,3],[139,5,139,6],[140,2,140,3],[140,5,140,6],[141,2,141,3],[141,6,141,7],[142,2,142,3],[143,2,143,3],[144,2,144,3],[145,2,145,3],[146,2,146,3]]}
[]
[null,"Connecting British Columbia Program: UBF Core Intake"]
[null,"                                    DETAILED BUDGET",{"$nulls":6},"Published January 7, 2021 – Ver. 1.0"]
[null,"Use this template to identify the proposed project costs."]
[]
[]
[null,null,"INSTRUCTIONS",null,"SUMMARY (Auto-Populated)"]
[]
[null,"Step 1: Complete the Detailed Project Budget table below using the appropriate categories and sub-categories. Use \"other\" for items not listed.  Ensure that last-mile and transport costs are separated where applicable.  ",null,null,"Project Name:",{"$f":"IF(ISBLANK('INSTRUCTIONS - Project Info'!E25), \"Auto-Populated from the INSTRUCTIONS Sheet\", 'INSTRUCTIONS - Project Info'!E25)","v":"Auto-Populated from the INSTRUCTIONS Sheet"}]
[{"$nulls":4},"Project Type:",{"$f":"IF(ISBLANK('INSTRUCTIONS - Project Info'!E27), \"Auto-Populated from the INSTRUCTIONS Sheet\", 'INSTRUCTIONS - Project Info'!E27)","v":"Auto-Populated from the INSTRUCTIONS Sheet"}]
[]
[{"$nulls":4},"Project Budget"]
[null,"Step 2: Verify that the totals add up correctly and fill in the project funding information in the lower table.  ",{"$nulls":3},"Last-Mile","Transport (Backbone)","Total"]
[{"$nulls":4},"Eligible Costs",{"$f":"E135","v":0},0,0]
[{"$nulls":4},"Ineligible Costs",0,0,0]
[{"$nulls":4},"Total Costs",0,0,0]
[{"$nulls":4},"Project Funding",{"$nulls":3},"% of Eligible Costs:"]
[{"$nulls":5},"Connecting British Columbia Amount Requested",null,{"$f":"E140","v":0},{"$f":"H18/H14","v":{"$error":"#DIV/0!"}}]
[{"$nulls":5},"UBF Core Response Amount Requested",null,{"$f":"E141","v":0}]
[{"$nulls":5},"Applicant Contribution",null,{"$f":"E142","v":0}]
[{"$nulls":5},"Other Funding Sources",null,{"$f":"SUM(E143:E146)","v":0}]
[{"$nulls":5},"Total Funding",null,{"$f":"E147","v":0}]
[]
[{"$nulls":6},"Budget/Funding Error",{"$f":"H16-H22","v":0}]
[]
[null,"Step 1  - DETAILED BUDGET INFORMATION"]
[]
[null,"ELIGIBLE COSTS",null,"Total Number of Units                           \n(if applicable)\n(please specify)","Last-Mile: Eligible Cost",null,"Transport (Backbone): Eligible Cost",null,"Total Allocation\nEligible Costs ($)\n(Auto-Populated)"]
[null,"Direct Labour (enter hours or days)"]
[null,"Project Management",{"$nulls":6},{"$f":"SUM(E30:H30)","v":0}]
[null,"Engineering Design",{"$nulls":6},{"$f":"SUM(E31:H31)","v":0}]
[null,"Other (please specify)",{"$nulls":6},{"$f":"SUM(E32:H32)","v":0}]
[null,"Other (please specify)",{"$nulls":6},0]
[null,"Other (please specify)",{"$nulls":6},0]
[null,"Other (please specify)",{"$nulls":6},0]
[null,"Other (please specify)",{"$nulls":6},0]
[null,"Direct Materials"]
[null,"Conduits",{"$nulls":6},0]
[null,"Vaults",{"$nulls":6},0]
[null,"Other (please specify)",{"$nulls":6},0]
[null,"Other (please specify)",{"$nulls":6},0]
[null,"Other (please specify)",{"$nulls":6},0]
[null,"Other (please specify)",{"$nulls":6},0]
[null,"Other (please specify)",{"$nulls":6},0]
[null,"Other (please specify)",{"$nulls":6},0]
[null,"Equipment"]
[null,"Radios",{"$nulls":6},0]
[null,"Routers",{"$nulls":6},0]
[null,"Dishes",{"$nulls":6},0]
[null,"Antennas",{"$nulls":6},0]
[null,"Switches",{"$nulls":6},0]
[null,"Servers",{"$nulls":6},0]
[null,"Splices",{"$nulls":6},0]
[null,"Power Systems (Generators, batteries, solar cells, etc.)",{"$nulls":6},0]
[null,"Fibre/Cable",{"$nulls":6},0]
[null,"Monitoring Systems ",{"$nulls":6},0]
[null,"Miscellaneous",{"$nulls":6},0]
[null,"Other (please specify)",{"$nulls":6},0]
[null,"Other (please specify)",{"$nulls":6},{"$f":"SUM(E59:H59)","v":0}]
[null,"Other (please specify)",{"$nulls":6},0]
[null,"Other (please specify)",{"$nulls":6},0]
[null,"Other (please specify)",{"$nulls":6},0]
[null,"Other (please specify)",{"$nulls":6},0]
[null,"Direct Travel"]
[null,"Flights",{"$nulls":6},0]
[null,"Vehicle rental",{"$nulls":6},0]
[null,"Accommodations",{"$nulls":6},0]
[null,"Other (please specify)",{"$nulls":6},0]
[null,"Other (please specify)",{"$nulls":6},0]
[null,"Other (please specify)",{"$nulls":6},0]
[null,"Other (please specify)",{"$nulls":6},0]
[null,"Other (please specify)",{"$nulls":6},0]
[null,"Other"]
[null,"Site Preparation",{"$nulls":6},0]
[null,"Hydro Connection",{"$nulls":6},0]
[null,"Make-ready",{"$nulls":6},{"$f":"SUM(E76:H76)","v":0}]
[null,"Testing - Network elements",{"$nulls":6},0]
[null,"Testing - Power Systems ",{"$nulls":6},0]
[null,"Testing - Monitoring Systems",{"$nulls":6},0]
[null,"Software (please specify)",{"$nulls":6},0]
[null,"Other (please specify)",{"$nulls":6},{"$f":"SUM(E81:H81)","v":0}]
[null,"Other (please specify)",{"$nulls":6},{"$f":"SUM(E82:H82)","v":0}]
[null,"Other (please specify)",{"$nulls":6},0]
[null,"Other (please specify)",{"$nulls":6},0]
[null,"Other (please specify)",{"$nulls":6},0]
[null,"Total Eligible Costs",null,null,{"$f":"SUM(E29:F85)","v":0},null,{"$f":"SUM(G29:H85)","v":0},null,{"$f":"SUM(E86:H86)","v":0}]
[]
[null,"INELIGIBLE COSTS",null,"Total Number of Units                           \n(if applicable)\n(specify units)","Last-Mile: Ineligible Cost",null,"Transport (Backbone): Ineligible Cost",null,"Total Allocation \nIneligible Costs ($)\n(Auto-Populated)"]
[null,"General"]
[null,"Billing Support Systems",{"$nulls":6},{"$f":"SUM(E90:H90)","v":0}]
[null,"Customer Care Systems",{"$nulls":6},{"$f":"SUM(E91:H91)","v":0}]
[null,"Licenses",{"$nulls":6},0]
[null,"General Liability Insurance",{"$nulls":6},0]
[null,"Testing – User Devices",{"$nulls":6},0]
[null,"Testing – Support Systems",{"$nulls":6},0]
[null,"CPE"]
[null,"Modems",{"$nulls":6},0]
[null,"Set Top Boxes",{"$nulls":6},0]
[null,"Inside Wiring",{"$nulls":6},0]
[null,"Other (please specify)",{"$nulls":6},0]
[null,"Other (please specify)",{"$nulls":6},0]
[null,"Other (please specify)",{"$nulls":6},0]
[null,"Direct Satellite Capacity"]
[null,"Satellite Related Labour",{"$nulls":6},0]
[null,"Satellite Related Equipment",{"$nulls":6},0]
[null,"Satellite Transponder Equipment",{"$nulls":6},{"$f":"SUM(E106:H106)","v":0}]
[null,"Contract",{"$nulls":6},0]
[null,"Other Consulting Services (please specify)",{"$nulls":6},0]
[null,"Other Consulting Services (please specify)",{"$nulls":6},{"$f":"SUM(E109:H109)","v":0}]
[null,"Other Consulting Services (please specify)",{"$nulls":6},0]
[null,"Other Consulting Services (please specify)",{"$nulls":6},0]
[null,"Other Consulting Services (please specify)",{"$nulls":6},0]
[null,"Other Consulting Services (please specify)",{"$nulls":6},0]
[null,"Cellular / Mobile Wireless"]
[null,"Equipment",{"$nulls":6},0]
[null,"Software",{"$nulls":6},0]
[null,"Labour",{"$nulls":6},0]
[null,"Other (please specify)",{"$nulls":6},0]
[null,"Other (please specify)",{"$nulls":6},0]
[null,"Other (please specify)",{"$nulls":6},0]
[null,"Other"]
[null,"Other (please specify)",{"$nulls":6},0]
[null,"Other (please specify)",{"$nulls":6},0]
[null,"Other (please specify)",{"$nulls":6},{"$f":"SUM(E124:H124)","v":0}]
[null,"Other (please specify)",{"$nulls":6},0]
[null,"Other (please specify)",{"$nulls":6},0]
[null,"Other (please specify)",{"$nulls":6},0]
[null,"Other (please specify)",{"$nulls":6},0]
[null,"Other (please specify)",{"$nulls":6},0]
[null,"Total Ineligible Costs",null,null,{"$f":"SUM(E90:F129)","v":0},null,{"$f":"SUM(G90:H129)","v":0},null,{"$f":"SUM(E130:H130)","v":0}]
[]
[null,"Step 2  - SUMMARY PROJECT BUDGET"]
[]
[null,null,"Project Budget (Auto-Populated)",null,"Last-Mile","Transport (Backbone)","Total"]
[null,null,"Total Eligible Costs",null,{"$f":"SUM(E86:F86)","v":0},{"$f":"SUM(G86:H86)","v":0},{"$f":"DetailedTotalSum","v":0}]
[null,null,"Total Ineligible Costs",null,{"$f":"SUM(E130:F130)","v":0},{"$f":"SUM(G130:H130)","v":0},{"$f":"DetailedIneligibleTotal","v":0}]
[null,null,"Total Costs",null,{"$f":"SUM(E135:E136)","v":0},{"$f":"SUM(F135:F136)","v":0},{"$f":"SUM(G135:G136)","v":0}]
[]
[null,null,"Project Funding (Please Complete)"]
[null,"Value should not exceed\n50% of eligible costs","Connecting British Columbia Amount Requested"]
[null,null,"UBF Core Response Amount Requested",null,null,"  For Other Funding Sources, please identify:"]
[null,null,"Applicant Contribution",null,null,"Funding approved?","If No, enter date decision is expected:"]
[null,null,"Funding from Canada Infrastructure Bank"]
[null,null,"Other Funding Source (please specify)"]
[null,null,"Other Funding Source (please specify)"]
[null,null,"Other Funding Source (please specify)"]
[null,null,"Total Funding",null,{"$f":"SUM(E140:E146)","v":0}]
[]
[{"$nulls":3},"Budget/Funding Error",{"$f":"G137-E147","v":0}]

{"sheet":"Permitting","index":4,"n_rows":24,"n_cols":12,"rows_kept":24,"merged":[[1,1,1,11],[2,1,2,9],[2,10,2,11],[3,1,5,11],[6,1,6,9],[8,1,18,6],[20,1,20,9],[21,1,21,11],[22,5,22,9]]}
[]
[null,"Connecting British Columbia Program: UBF Core Intake"]
[null,"PERMITTING",{"$nulls":8},"Published January 7, 2021 – Ver. 1.0"]
[null,"Please identify all permits required for the successful completion of your project. Also indicate the progress that has been made thus far."]
[]
[]
[null,"DEFINITIONS"]
[]
[null,"Assest Required: Refers to the non-electrical elements needed for network deployment. This includes the telephone and hydro poles, ducts, towers, private buildings, street furniture (e.g., lampposts), and rights-of-way along routes such as highways, railways and pipelines.\n\nAsset Owner: Is the owner of the asset, usually telecommunications carriers, electrical utilities, municipalities and private owners.\n\nType of Permit required: A broad category used to describe the application or process that an internet service provider must apply for gain access to the permit. For example: Municipal Letter of Concurrence, Crown land permits, Right-of-ways permits\n\nPermitting Authority: Refers to the regulator and has oversight through the administration of Acts.  For example, the British Columbia Utilities Commission is the regulator of BC Hydro and Fortis BC, which own assets such as poles.",{"$nulls":5},"Project Name:",{"$f":"IF(ISBLANK('INSTRUCTIONS - Project Info'!E25), \"Auto-Populated from the INSTRUCTIONS Sheet\", 'INSTRUCTIONS - Project Info'!E25)","v":"Auto-Populated from the INSTRUCTIONS Sheet"}]
[{"$nulls":7},"Project Type:",{"$f":"IF(ISBLANK('INSTRUCTIONS - Project Info'!E27), \"Auto-Populated from the INSTRUCTIONS Sheet\", 'INSTRUCTIONS - Project Info'!E27)","v":"Auto-Populated from the INSTRUCTIONS Sheet"}]
{"$rows_empty":10}
[null,"PERMITTING INFORMATION"]
[null,"    Insert additional rows below if needed."]
[{"$nulls":5},"CURRENTLY ENGAGED WITH"]
[null,"ASSET REQUIRED","ASSET OWNER","TYPE OF PERMIT REQUIRED","PERMITTING AUTHORITY","ORGANIZATION NAME","CONTACT NAME\n(first name, last name)","POSITION/TITLE","PHONE NUMBER","E-MAIL ADDRESS","STATUS\n(use drop-down)","DATE PERMIT\nIS REQUIRED"]

{"sheet":"Employment","index":5,"n_rows":27,"n_cols":8,"rows_kept":27,"merged":[[1,1,1,7],[2,1,2,6],[3,1,5,7],[6,1,6,7],[8,1,16,4],[18,1,18,7],[20,2,20,3],[22,1,22,7]]}
[]
[null,"Connecting British Columbia Program: UBF Core Intake"]
[null,"EMPLOYMENT",{"$nulls":5},"Published January 7, 2021 – Ver. 1.0"]
[null,"Please identify groups and organizations that require consultation in order to successfully complete your project. Also indicate the progress that has been made thus far."]
[]
[]
[null,"INSTRUCTIONS"]
[]
[null,"Step 1: Enter the number of individuals currently employed by your organization.\n\nStep 2: Enter the number of estimated direct employees and estimated contracted labour that will work on the project.\n\nStep 3: Enter the average number of hours of employment each individual will preform per week.\n\nStep 4: Enter the total months of employment that will be created for each individual.\n\n*Full-time equivalent (FTE) job creation is aggregated from information provided above. 1.0 FTE is equal to 1 new position working 35 hours/week for 12 months/year.",{"$nulls":3},"Project Name:",{"$f":"IF(ISBLANK('INSTRUCTIONS - Project Info'!E25), \"Auto-Populated from the INSTRUCTIONS Sheet\", 'INSTRUCTIONS - Project Info'!E25)","v":"Auto-Populated from the INSTRUCTIONS Sheet"}]
[{"$nulls":5},"Project Type:",{"$f":"IF(ISBLANK('INSTRUCTIONS - Project Info'!E27), \"Auto-Populated from the INSTRUCTIONS Sheet\", 'INSTRUCTIONS - Project Info'!E27)","v":"Auto-Populated from the INSTRUCTIONS Sheet"}]
{"$rows_empty":8}
[null,"CURRENT EMPLOYMENT INFORMATION"]
[{"$nulls":4},"Step 1"]
[null,null,"Total number of people employed by the organization:"]
[]
[null,"ESTIMATED PROJECT EMPLOYMENT"]
[{"$nulls":3},"Step 2","Step 3","Step 4"]
[{"$nulls":3},"NUMBER OF PEOPLE TO WORK ON THE PROJECT","HOURS OF EMPLOYMENT PER WEEK\n(average)","TOTAL PERSON MONTHS OF EMPLOYMENT TO BE CREATED\n(average)","TOTAL ESTIMATED FULL-TIME EQUIVALENT (FTE) JOB CREATION*\n(auto-generated)"]
[null,null,"Estimated direct employees:",{"$nulls":3},{"$f":"SUM((D26*(E26)/35)*(F26/12))","v":{"v":0,"d":"0.0"}}]
[null,null,"Estimated contracted labour:",{"$nulls":3},{"$f":"SUM((D27*(E27)/35)*(F27/12))","v":{"v":0,"d":"0.0"}}]

{"sheet":"SUMMARY","index":6,"n_rows":26,"n_cols":17,"rows_kept":26,"merged":[[1,1,1,10],[2,1,2,8],[2,9,2,10],[4,3,4,10],[6,3,6,7],[8,1,8,10],[11,12,11,15],[12,12,12,15],[13,12,13,15],[18,1,18,10],[19,10,20,10],[20,1,20,2],[21,7,21,8],[22,7,22,8],[23,7,23,8],[24,7,24,8],[25,7,25,8]]}
[]
[null,"Connecting British Columbia Program: UBF Core Intake"]
[null,"                                                SUMMARY (Auto-Populated)",{"$nulls":7},"Published January 7, 2021 – Ver. 1.0"]
[]
[null,null,"Project Name:",{"$f":"IF(ISBLANK('INSTRUCTIONS - Project Info'!E25), \"Auto-Populated from the INSTRUCTIONS Sheet\", 'INSTRUCTIONS - Project Info'!E25)","v":"Auto-Populated from the INSTRUCTIONS Sheet"}]
[]
[null,null,"Project Type:",{"$f":"IF(ISBLANK('INSTRUCTIONS - Project Info'!E27), \"Auto-Populated from the INSTRUCTIONS Sheet\", 'INSTRUCTIONS - Project Info'!E27)","v":"Auto-Populated from the INSTRUCTIONS Sheet"}]
[]
[null,"PROJECT COMMUNITIES (Auto-Populated)",{"$nulls":10},"Eligible Costs"]
[]
[{"$nulls":3},"Last-Mile:",{"$nulls":3},"Transport:"]
[{"$nulls":3},"Total Number of Communities",{"$f":"'Named Communities'!$Q$13","v":0},null,null,"Total Number of Communities",{"$f":"'Named Communities'!$Q$19","v":0},{"$nulls":3},"Last Mile Eligible Costs per Community",{"$nulls":3},{"$f":"D23/E12","v":{"$error":"#DIV/0!"}}]
[{"$nulls":3},"Indigenous Communities",{"$f":"'Named Communities'!$Q$14","v":"0"},null,null,"Indigenous Communities",{"$f":"'Named Communities'!$Q$20","v":"0"},{"$nulls":3},"Last Mile Eligible Costs per Household",{"$nulls":3},{"$f":"D23/E14","v":{"$error":"#DIV/0!"}}]
[{"$nulls":3},"Total Number of Households",{"$f":"SUM('Named Communities'!$Q$15+Locales!O14)","v":0},{"$nulls":7},"Eligible Transport Costs per km",{"$nulls":3},{"$f":"D23/'Detailed Budget'!D48","v":{"$error":"#DIV/0!"}}]
[{"$nulls":3},"Number of Indigenous Households",{"$f":"'Named Communities'!$Q$16","v":0}]
[{"$nulls":3},"Number of Locales",{"$f":"Locales!$O$13","v":0}]
[]
[]
[null,"PROJECT BUDGET (Auto-Populated)"]
[{"$nulls":10},"% of\nEligible Costs:"]
[null,"Project Budget",{"$nulls":4},"Project Funding"]
[{"$nulls":3},"Last-Mile","Transport","Total",null,"Connecting British Columbia Amount Requested",null,{"$f":"'Detailed Budget'!H18","v":0},{"$f":"J22/F23","v":{"$error":"#DIV/0!"}}]
[null,null,"Eligible Costs",{"$f":"'Detailed Budget'!F14","v":0},{"$f":"'Detailed Budget'!G14","v":0},{"$f":"'Detailed Budget'!H14","v":0},null,"UBF Core Amount Requested",null,{"$f":"'Detailed Budget'!$E$141","v":0}]
[null,null,"Ineligible Costs",{"$f":"'Detailed Budget'!F15","v":0},{"$f":"'Detailed Budget'!G15","v":0},{"$f":"'Detailed Budget'!H15","v":0},null,"Applicant Contribution",null,{"$f":"'Detailed Budget'!H20","v":0}]
[null,null,"Total Costs",{"$f":"'Detailed Budget'!F16","v":0},{"$f":"'Detailed Budget'!G16","v":0},{"$f":"'Detailed Budget'!H16","v":0},null,"Other Funding Sources",null,{"$f":"'Detailed Budget'!H21","v":0}]
[{"$nulls":7},"Total Funding",null,{"$f":"'Detailed Budget'!H22","v":0}]

{"sheet":"Lists-HIdden","index":7,"n_rows":31,"n_cols":11,"rows_kept":31,"hidden":true}
[]
[null,"Project Types","Community Deployment","Broadband Solutions","Proposed Speeds",null,"Status",null,"Regional Districts",null,"Economic Regions"]
[null,"Last-Mile","Broadband","Fibre","Minimum 50/10",null,"Not Started",null,"Alberni-Clayoquot",null,"Cariboo Region"]
[null,"Last-Mile & Transport","Cellular","Cable","Minimum 25/5",null,"In Progress",null,"Bulkley-Nechako",null,"Kootenay Region"]
[null,null,"Public Wi-Fi Hotspot","DSL","Other",null,"On Hold",null,"Capital",null,"Mainland / Southwest"]
[null,null,"Broadband & Cellular","Fixed Wireless",null,null,"Completed",null,"Cariboo",null,"North Coast and Nechako"]
[null,null,"Satellite",{"$nulls":5},"Central Coast",null,"Northeast"]
[{"$nulls":8},"Central Kootenay",null,"Thompson-Okanagan"]
[{"$nulls":8},"Central Okanagan",null,"Vancouver Island / Coast"]
[{"$nulls":8},"Columbia-Shuswap"]
[{"$nulls":8},"Comox Valley"]
[{"$nulls":8},"Cowichan Valley"]
[{"$nulls":8},"East Kootenay"]
[{"$nulls":8},"Fraser Valley"]
[null,"Site Type","Site Status","Power Status","HWY Site Type",{"$nulls":3},"Fraser-Fort George"]
[null,"Cellular","New","Has Utility Access","Road Segment",{"$nulls":3},"Kitimat-Stikine"]
[null,"Public Wi-Fi Hotspot","Existing","Requires Utility Access","Rest Area",{"$nulls":3},"Kootenay Boundary"]
[null,"Emergency Call Box",null,null,"Highway Pullout",{"$nulls":3},"Metro Vancouver"]
[null,"Other",null,null,"Inland Ferry",{"$nulls":3},"Mount Waddington"]
[{"$nulls":4},"Other",{"$nulls":3},"Nanaimo"]
[{"$nulls":8},"North Coast"]
[null,"Cellular Solutions",{"$nulls":6},"North Okanagan"]
[null,"Cellular",{"$nulls":6},"Northern Rockies"]
[null,"Fixed Wireless (broadband)",{"$nulls":6},"Okanagan-Similkameen"]
[null,"Both",{"$nulls":6},"Peace River"]
[{"$nulls":8},"qathet"]
[{"$nulls":8},"Squamish-Lillooet"]
[{"$nulls":8},"Stikine Region"]
[{"$nulls":8},"Strathcona"]
[{"$nulls":8},"Sunshine Coast"]
[{"$nulls":8},"Thompson-Nicola"]