{"text_format":"3","workbook":"xlsx","n_sheets":8,"sheets":["INSTRUCTIONS - Project Info","Named Communities","Locales","Detailed Budget","Permitting","Employment","SUMMARY","Lists-HIdden"],"not_rendered":{"defined_names":32},"read":"whole","date_system":"1900"}

{"sheet":"INSTRUCTIONS - Project Info","index":0,"n_rows":34,"n_cols":13,"rows_kept":34,"merged":[[1,1,1,13],[2,1,2,11],[2,12,2,13],[3,1,5,13],[15,1,17,13],[20,1,20,11],[22,1,23,13],[24,2,24,3],[24,4,24,9],[26,2,26,3],[26,4,26,5],[27,4,27,5],[28,1,29,13],[30,2,30,3],[30,4,30,10],[32,2,32,3],[32,4,32,6],[32,7,32,10],[33,4,33,6],[33,7,33,10]]}
[]
[null,"Connecting British Columbia Program: UBF Core Intake"]
[null,"WORKBOOK INSTRUCTIONS",{"$nulls":10},"Published January 7, 2021 – Ver. 1.0"]
[null,"Applicants to the Connecting British Columbia Program are required to complete this workbook with detailed information about the proposed project.\nIt is the responsibility of the applicant to ensure the information entered is accurate and that totals and costs add up correctly.  "]
[]
[]
[null,"This workbook consists of 7 sheets: "]
[null,null,"INSTRUCTIONS - Project Information"]
[null,null,"Named Communities"]
[null,null,"Locales"]
[null,null,"Detailed Budget"]
[null,null,"Permitting"]
[null,null,"Employment"]
[null,null,"SUMMARY (Auto-Populated)"]
[]
[null,"Applicants should not enter formulas, add or remove columns and rows or make other changes to the format of the workbook. If you are pasting data from one spreadsheet to another, paste values only, not formulas or formatting. Any change to the format of the spreadsheet may prevent your data from being assessed for funding. "]
[]
[]
[null,"Once the workbook is completed verify all information entered is correct. The SUMMARY sheet will auto-populated a reference table to summarize the information provided.  "]
[]
{"$rows_left_out":15}
{"sheet":"Named Communities","index":1,"n_rows":1275,"n_cols":42,"rows_kept":1275,"merged":[[1,1,1,16],[2,1,2,15],[3,1,5,16],[6,1,6,12],[6,13,6,16],[8,1,26,12],[8,14,8,16],[9,14,9,16],[12,14,12,15],[13,14,13,15],[14,14,14,15],[15,14,15,15],[18,14,18,15],[19,14,19,15],[20,14,20,15],[28,1,28,16],[28,35,31,35],[29,1,29,16],[31,1,31,7],[31,9,31,12],[31,13,31,16],[31,40,31,41]]}
[]
[null,"Connecting British Columbia Program: UBF Core Intake"]
[null,"                     NAMED COMMUNITIES",{"$nulls":14},"Published January 7, 2021 – Ver. 1.0","Drop Down Lists"]
[null,"Use this template to identify the Named Communities that will benefit from the proposed project.  The list below contains the communities or placenames in B.C. that are classified as cities, towns, villages, districts, municipalities, or indigenous communities.  \nWhile every effort is made to ensure all communities are on this list it is possible that a local place name or neighborhood is not included.  Those communities not shown on the list below can be identified on the Locales sheet in this workbook."]
[]
[{"$nulls":17},"Transport",null,"Fibre"]
[null,"INSTRUCTIONS",{"$nulls":11},"SUMMARY (Auto-Populated)",{"$nulls":3},"Last-Mile",null,"Microwave"]
[{"$nulls":17},"Transport & Last-Mile",null,"Other"]
[null,"Step 1: Identify communities for proposed project using the drop-down list in column C.  If your community is not available within the list below please select the Locales tab, then enter your community/locale and populate the required columns.\n\nStep 2: For each community indicate the proposed solution. \n\t\t\t\t\t\t\t\t\t\t\t\t\nStep 3: Filter out the blank rows.  Click on the filter button in cell I33 and remove the check mark beside (Blanks).  To undue this select the filter button and select the check mark beside (Blanks).\t\n\t\t\t\t\t\t\t\t\t\t\t\t\nStep 4: For each project community, provide information for columns J-P.\t\t\t\t\t\t\n\nNotes:\t\t\t\t\t\t\t\t\t\t\t\t\n1 Verify selected place names as multiples do exist.  A map link is provided in column C.  For more information refer to the data source found here:\nhttps://open.canada.ca/data/en/dataset/fe945388-1dd9-4a4a-9a1e-5c552579a28c\t\t\t\t\t\t\t\t\t\t\t\n\t\t\t\t\t\t\t\t\t\t\t\t\n2 \"Column D indicates whether a selected community has access to 50/10 Mbps internet based on data from Innovation, Science and Economic Development Canada.\nFor community projects the Connecting British Columbia Program provides funding for communities that do not have access to 50/10 Mbps internet.  Refer to section 3.1 in the Application Guide for more information.\n\n3 Contention ratio or over subscription ratio is the number of users sharing the same data capacity. For example a 50:1 contention ratio means that up to 50 broadband customers are sharing the same bandwidth at any one time.",{"$nulls":11},"Project Name:",{"$f":"IF(ISBLANK('INSTRUCTIONS - Project Info'!E25), \"Auto-Populated from the INSTRUCTIONS Sheet\", 'INSTRUCTIONS - Project Info'!E25)","v":"Auto-Populated from the INSTRUCTIONS Sheet"}]
[{"$nulls":13},"Project Type:",{"$f":"IF(ISBLANK('INSTRUCTIONS - Project Info'!E27), \"Auto-Populated from the INSTRUCTIONS Sheet\", 'INSTRUCTIONS - Project Info'!E27)","v":"Auto-Populated from the INSTRUCTIONS Sheet"}]
[]
[{"$nulls":14},"Last-Mile:"]
[{"$nulls":14},"Total Number of Communities",null,{"$f":"COUNTIF(Table11[Identify Solution for \nProposed Project\n(use drop-down in each cell)],\"*\")","v":0}]
[{"$nulls":14},"Indigenous Communities",null,{"$f":"IF(U29=0,\"0\",U29)","v":"0"}]
[{"$nulls":14},"Total Number of Households",null,{"$f":"SUM(Table11[Number of Households proposed to be served?])","v":0}]
[{"$nulls":14},"Number of Indigenous Households",null,{"$f":"SUMIFS(Table11[Number of Households proposed to be served?],Table11[Identify Solution for \nProposed Project\n(use drop-down in each cell)],\"*\",Table11[First Nations],\"Y\")","v":0}]
[]
[{"$nulls":14},"Transport:"]
[{"$nulls":14},"Total Number of Communities",null,{"$f":"COUNTIF(Table11[Identify Solution for \nProposed Project\n(use drop-down in each cell)],\"*\"&\"Transport\"&\"*\")","v":0}]
[{"$nulls":14},"Indigenous Communities",null,{"$f":"IF(V29=0,\"0\",V29)","v":"0"}]
{"$rows_left_out":1256}
{"sheet":"Locales","index":2,"n_rows":58,"n_cols":15,"rows_kept":58,"merged":[[1,1,1,14],[2,1,2,13],[3,1,5,14],[6,1,6,10],[6,11,6,14],[7,1,22,10],[8,12,8,14],[9,12,9,14],[12,12,12,13],[13,12,13,13],[16,12,16,13],[17,12,17,13],[18,12,18,13],[19,12,19,13],[23,1,23,14],[24,1,24,14],[26,1,26,5],[26,7,26,10],[26,11,26,14]]}
[]
[null,"Connecting British Columbia Program: UBF Core Intake"]
[null,"                              LOCALES",{"$nulls":12},"Published January 7, 2021 – Ver. 1.0"]
[null,"Use this template to identify the locales/communities that will benefit from the proposed project; only if your community is not available in the Named Communities sheet."]
[]
[]
[null,"INSTRUCTIONS",{"$nulls":9},"SUMMARY (Auto-Populated)"]
[null,"Step 1: Enter the locales/communities for proposed project using the cells in column B.\n\nStep 2: Enter the latitude and longitude of the locale/community.\n\nStep 3: Using the drop-downs, select the Regional District & Economic Region in which the location resides. \n\nStep 4: Using the drop-down in column G, indicate the proposed solution for each community. \n\t\t\t\t\t\t\t\t\t\t\t\t\nStep 5: Filter out the blank rows.  Click on the filter button in cell G28 and remove the check mark beside (Blanks).  To undue this select the filter button and select the check mark beside (Blanks).\n\t\t\t\t\t\t\t\t\t\t\t\t\nStep 6: For each project community, provide information for columns H-N.\n\nNotes:\n1 Contention ratio or over subscription ratio is the number of users sharing the same data capacity. For example a 50:1 contention ratio means that up to 50 broadband customers are sharing the same bandwidth at any one time."]
[{"$nulls":11},"Project Name:",{"$f":"IF(ISBLANK('INSTRUCTIONS - Project Info'!E25), \"Auto-Populated from the INSTRUCTIONS Sheet\", 'INSTRUCTIONS - Project Info'!E25)","v":"Auto-Populated from the INSTRUCTIONS Sheet"}]
[{"$nulls":11},"Project Type:",{"$f":"IF(ISBLANK('INSTRUCTIONS - Project Info'!E27), \"Auto-Populated from the INSTRUCTIONS Sheet\", 'INSTRUCTIONS - Project Info'!E27)","v":"Auto-Populated from the INSTRUCTIONS Sheet"}]
[]
[{"$nulls":12},"Last-Mile:"]
[{"$nulls":12},"Total Number of Locales",null,{"$f":"COUNTIFS(Table16[Identify Solution for \nProposed Project \n(use drop-down in each cell)],\"*\"&\"Last-Mile\"&\"*\",Table16[Locale Name],\"*\")","v":0}]
[{"$nulls":12},"Total Number of Households",null,{"$f":"SUMIFS(Table16[Number of Households proposed to be served?],Table16[Identify Solution for \nProposed Project \n(use drop-down in each cell)],\"*\"&\"Last-Mile\"&\"*\",Table16[Locale Name],\"*\")","v":0}]
[]
[{"$nulls":12},"Transport:"]
[{"$nulls":12},"Total Number of Locales",null,{"$f":"COUNTIFS(Table16[Identify Solution for \nProposed Project \n(use drop-down in each cell)],\"*\"&\"Transport\"&\"*\",Table16[Locale Name],\"*\")","v":0}]
[]
[]
[]
{"$rows_left_out":39}
{"sheet":"Detailed Budget","index":3,"n_rows":149,"n_cols":9,"rows_kept":149,"merged":[[1,1,1,8],[2,1,2,7],[3,1,5,8],[6,4,6,8],[8,1,11,3],[8,5,8,8],[9,5,9,6],[12,1,14,3],[16,1,19,2],[16,5,16,7],[17,5,17,6],[18,5,18,6],[19,5,19,6],[20,5,20,6],[21,5,21,6],[25,1,25,8],[27,1,27,2],[27,4,27,5],[27,6,27,7],[28,1,28,2],[29,1,29,2],[29,4,29,5],[29,6,29,7],[30,1,30,2],[30,4,30,5],[30,6,30,7],[31,1,31,2],[31,4,31,5],[31,6,31,7],[32,1,32,2],[32,4,32,5],[32,6,32,7],[33,1,33,2],[33,4,33,5],[33,6,33,7],[34,1,34,2],[34,4,34,5],[34,6,34,7],[35,1,35,2],[35,4,35,5],[35,6,35,7],[36,1,36,2],[37,1,37,2],[37,4,37,5],[37,6,37,7],[38,1,38,2],[38,4,38,5],[38,6,38,7],[39,1,39,2],[39,4,39,5],[39,6,39,7],[40,1,40,2],[40,4,40,5],[40,6,40,7],[41,1,41,2],[41,4,41,5],[41,6,41,7],[42,1,42,2],[42,4,42,5],[42,6,42,7],[43,1,43,2],[43,4,43,5],[43,6,43,7],[44,1,44,2],[44,4,44,5],[44,6,44,7],[45,1,45,2],[46,1,46,2],[46,4,46,5],[46,6,46,7],[47,1,47,2],[47,4,47,5],[47,6,47,7],[48,1,48,2],[48,4,48,5],[48,6,48,7],[49,1,49,2],[49,4,49,5],[49,6,49,7],[50,1,50,2],[50,4,50,5],[50,6,50,7],[51,1,51,2],[51,4,51,5],[51,6,51,7],[52,1,52,2],[52,4,52,5],[52,6,52,7],[53,1,53,2],[53,4,53,5],[53,6,53,7],[54,1,54,2],[54,4,54,5],[54,6,54,7],[55,1,55,2],[55,4,55,5],[55,6,55,7],[56,1,56,2],[56,4,56,5],[56,6,56,7],[57,1,57,2],[57,4,57,5],[57,6,57,7],[58,1,58,2],[58,4,58,5],[58,6,58,7],[59,1,59,2],[59,4,59,5],[59,6,59,7],[60,1,60,2],[60,4,60,5],[60,6,60,7],[61,1,61,2],[61,4,61,5],[61,6,61,7],[62,1,62,2],[62,4,62,5],[62,6,62,7],[63,1,63,2],[64,1,64,2],[64,4,64,5],[64,6,64,7],[65,1,65,2],[65,4,65,5],[65,6,65,7],[66,1,66,2],[66,4,66,5],[66,6,66,7],[67,1,67,2],[67,4,67,5],[67,6,67,7],[68,1,68,2],[68,4,68,5],[68,6,68,7],[69,1,69,2],[69,4,69,5],[69,6,69,7],[70,1,70,2],[70,4,70,5],[70,6,70,7],[71,1,71,2],[71,4,71,5],[71,6,71,7],[72,1,72,2],[73,1,73,2],[73,4,73,5],[73,6,73,7],[74,1,74,2],[74,4,74,5],[74,6,74,7],[75,1,75,2],[75,4,75,5],[75,6,75,7],[76,1,76,2],[76,4,76,5],[76,6,76,7],[77,1,77,2],[77,4,77,5],[77,6,77,7],[78,1,78,2],[78,4,78,5],[78,6,78,7],[79,1,79,2],[79,4,79,5],[79,6,79,7],[80,1,80,2],[80,4,80,5],[80,6,80,7],[81,1,81,2],[81,4,81,5],[81,6,81,7],[82,1,82,2],[82,4,82,5],[82,6,82,7],[83,1,83,2],[83,4,83,5],[83,6,83,7],[84,1,84,2],[84,4,84,5],[84,6,84,7],[85,1,85,3],[85,4,85,5],[85,6,85,7],[87,1,87,2],[87,4,87,5],[87,6,87,7],[88,1,88,2],[89,1,89,2],[89,4,89,5],[89,6,89,7],[90,1,90,2],[90,4,90,5],[90,6,90,7],[91,1,91,2],[91,4,91,5],[91,6,91,7],[92,1,92,2],[92,4,92,5],[92,6,92,7],[93,1,93,2],[93,4,93,5],[93,6,93,7],[94,1,94,2],[94,4,94,5],[94,6,94,7],[95,1,95,2],[96,1,96,2],[96,4,96,5],[96,6,96,7],[97,1,97,2],[97,4,97,5],[97,6,97,7],[98,1,98,2],[98,4,98,5],[98,6,98,7],[99,1,99,2],[99,4,99,5],[99,6,99,7],[100,1,100,2],[100,4,100,5],[100,6,100,7],[101,1,101,2],[101,4,101,5],[101,6,101,7],[102,1,102,2],[103,1,103,2],[103,4,103,5],[103,6,103,7],[104,1,104,2],[104,4,104,5],[104,6,104,7],[105,1,105,2],[105,4,105,5],[105,6,105,7],[106,1,106,2],[106,4,106,5],[106,6,106,7],[107,1,107,2],[107,4,107,5],[107,6,107,7],[108,1,108,2],[108,4,108,5],[108,6,108,7],[109,1,109,2],[109,4,109,5],[109,6,109,7],[110,1,110,2],[110,4,110,5],[110,6,110,7],[111,1,111,2],[111,4,111,5],[111,6,111,7],[112,1,112,2],[112,4,112,5],[112,6,112,7],[113,1,113,2],[114,1,114,2],[114,4,114,5],[114,6,114,7],[115,1,115,2],[115,4,115,5],[115,6,115,7],[116,1,116,2],[116,4,116,5],[116,6,116,7],[117,1,117,2],[117,4,117,5],[117,6,117,7],[118,1,118,2],[118,4,118,5],[118,6,118,7],[119,1,119,2],[119,4,119,5],[119,6,119,7],[120,1,120,2],[121,1,121,2],[121,4,121,5],[121,6,121,7],[122,1,122,2],[122,4,122,5],[122,6,122,7],[123,1,123,2],[123,4,123,5],[123,6,123,7],[124,1,124,2],[124,4,124,5],[124,6,124,7],[125,1,125,2],[125,4,125,5],[125,6,125,7],[126,1,126,2],[126,4,126,5],[126,6,126,7],[127,1,127,2],[127,4,127,5],[127,6,127,7],[128,1,128,2],[128,4,128,5],[128,6,128,7],[129,1,129,3],[129,4,129,5],[129,6,129,7],[131,1,131,8],[133,2,133,3],[134,2,134,3],[135,2,135,3],[136,2,136,3],[138,2,138,4],[139,2,139,3],[139,5,139,6],[140,2,140,3],[140,5,140,6],[141,2,141,3],[141,6,141,7],[142,2,142,3],[143,2,143,3],[144,2,144,3],[145,2,145,3],[146,2,146,3]]}
[]
[null,"Connecting British Columbia Program: UBF Core Intake"]
[null,"                                    DETAILED BUDGET",{"$nulls":6},"Published January 7, 2021 – Ver. 1.0"]
[null,"Use this template to identify the proposed project costs."]
[]
[]
[null,null,"INSTRUCTIONS",null,"SUMMARY (Auto-Populated)"]
[]
[null,"Step 1: Complete the Detailed Project Budget table below using the appropriate categories and sub-categories. Use \"other\" for items not listed.  Ensure that last-mile and transport costs are separated where applicable.  ",null,null,"Project Name:",{"$f":"IF(ISBLANK('INSTRUCTIONS - Project Info'!E25), \"Auto-Populated from the INSTRUCTIONS Sheet\", 'INSTRUCTIONS - Project Info'!E25)","v":"Auto-Populated from the INSTRUCTIONS Sheet"}]
[{"$nulls":4},"Project Type:",{"$f":"IF(ISBLANK('INSTRUCTIONS - Project Info'!E27), \"Auto-Populated from the INSTRUCTIONS Sheet\", 'INSTRUCTIONS - Project Info'!E27)","v":"Auto-Populated from the INSTRUCTIONS Sheet"}]
[]
[{"$nulls":4},"Project Budget"]
[null,"Step 2: Verify that the totals add up correctly and fill in the project funding information in the lower table.  ",{"$nulls":3},"Last-Mile","Transport (Backbone)","Total"]
[{"$nulls":4},"Eligible Costs",{"$f":"E135","v":0},0,0]
[{"$nulls":4},"Ineligible Costs",0,0,0]
[{"$nulls":4},"Total Costs",0,0,0]
[{"$nulls":4},"Project Funding",{"$nulls":3},"% of Eligible Costs:"]
[{"$nulls":5},"Connecting British Columbia Amount Requested",null,{"$f":"E140","v":0},{"$f":"H18/H14","v":{"$error":"#DIV/0!"}}]
[{"$nulls":5},"UBF Core Response Amount Requested",null,{"$f":"E141","v":0}]
[{"$nulls":5},"Applicant Contribution",null,{"$f":"E142","v":0}]
{"$rows_left_out":130}
{"sheet":"Permitting","index":4,"n_rows":24,"n_cols":12,"rows_kept":24,"merged":[[1,1,1,11],[2,1,2,9],[2,10,2,11],[3,1,5,11],[6,1,6,9],[8,1,18,6],[20,1,20,9],[21,1,21,11],[22,5,22,9]]}
[]
[null,"Connecting British Columbia Program: UBF Core Intake"]
[null,"PERMITTING",{"$nulls":8},"Published January 7, 2021 – Ver. 1.0"]
[null,"Please identify all permits required for the successful completion of your project. Also indicate the progress that has been made thus far."]
[]
[]
[null,"DEFINITIONS"]
[]
[null,"Assest Required: Refers to the non-electrical elements needed for network deployment. This includes the telephone and hydro poles, ducts, towers, private buildings, street furniture (e.g., lampposts), and rights-of-way along routes such as highways, railways and pipelines.\n\nAsset Owner: Is the owner of the asset, usually telecommunications carriers, electrical utilities, municipalities and private owners.\n\nType of Permit required: A broad category used to describe the application or process that an internet service provider must apply for gain access to the permit. For example: Municipal Letter of Concurrence, Crown land permits, Right-of-ways permits\n\nPermitting Authority: Refers to the regulator and has oversight through the administration of Acts.  For example, the British Columbia Utilities Commission is the regulator of BC Hydro and Fortis BC, which own assets such as poles.",{"$nulls":5},"Project Name:",{"$f":"IF(ISBLANK('INSTRUCTIONS - Project Info'!E25), \"Auto-Populated from the INSTRUCTIONS Sheet\", 'INSTRUCTIONS - Project Info'!E25)","v":"Auto-Populated from the INSTRUCTIONS Sheet"}]
[{"$nulls":7},"Project Type:",{"$f":"IF(ISBLANK('INSTRUCTIONS - Project Info'!E27), \"Auto-Populated from the INSTRUCTIONS Sheet\", 'INSTRUCTIONS - Project Info'!E27)","v":"Auto-Populated from the INSTRUCTIONS Sheet"}]
{"$rows_empty":10}
[null,"PERMITTING INFORMATION"]
[null,"    Insert additional rows below if needed."]
[{"$nulls":5},"CURRENTLY ENGAGED WITH"]
[null,"ASSET REQUIRED","ASSET OWNER","TYPE OF PERMIT REQUIRED","PERMITTING AUTHORITY","ORGANIZATION NAME","CONTACT NAME\n(first name, last name)","POSITION/TITLE","PHONE NUMBER","E-MAIL ADDRESS","STATUS\n(use drop-down)","DATE PERMIT\nIS REQUIRED"]

{"sheet":"Employment","index":5,"n_rows":27,"n_cols":8,"rows_kept":27,"merged":[[1,1,1,7],[2,1,2,6],[3,1,5,7],[6,1,6,7],[8,1,16,4],[18,1,18,7],[20,2,20,3],[22,1,22,7]]}
[]
[null,"Connecting British Columbia Program: UBF Core Intake"]
[null,"EMPLOYMENT",{"$nulls":5},"Published January 7, 2021 – Ver. 1.0"]
[null,"Please identify groups and organizations that require consultation in order to successfully complete your project. Also indicate the progress that has been made thus far."]
[]
[]
[null,"INSTRUCTIONS"]
[]
[null,"Step 1: Enter the number of individuals currently employed by your organization.\n\nStep 2: Enter the number of estimated direct employees and estimated contracted labour that will work on the project.\n\nStep 3: Enter the average number of hours of employment each individual will preform per week.\n\nStep 4: Enter the total months of employment that will be created for each individual.\n\n*Full-time equivalent (FTE) job creation is aggregated from information provided above. 1.0 FTE is equal to 1 new position working 35 hours/week for 12 months/year.",{"$nulls":3},"Project Name:",{"$f":"IF(ISBLANK('INSTRUCTIONS - Project Info'!E25), \"Auto-Populated from the INSTRUCTIONS Sheet\", 'INSTRUCTIONS - Project Info'!E25)","v":"Auto-Populated from the INSTRUCTIONS Sheet"}]
[{"$nulls":5},"Project Type:",{"$f":"IF(ISBLANK('INSTRUCTIONS - Project Info'!E27), \"Auto-Populated from the INSTRUCTIONS Sheet\", 'INSTRUCTIONS - Project Info'!E27)","v":"Auto-Populated from the INSTRUCTIONS Sheet"}]
{"$rows_empty":8}
[null,"CURRENT EMPLOYMENT INFORMATION"]
[{"$nulls":4},"Step 1"]
[null,null,"Total number of people employed by the organization:"]
[]
[null,"ESTIMATED PROJECT EMPLOYMENT"]
[{"$nulls":3},"Step 2","Step 3","Step 4"]
[{"$nulls":3},"NUMBER OF PEOPLE TO WORK ON THE PROJECT","HOURS OF EMPLOYMENT PER WEEK\n(average)","TOTAL PERSON MONTHS OF EMPLOYMENT TO BE CREATED\n(average)","TOTAL ESTIMATED FULL-TIME EQUIVALENT (FTE) JOB CREATION*\n(auto-generated)"]
[null,null,"Estimated direct employees:",{"$nulls":3},{"$f":"SUM((D26*(E26)/35)*(F26/12))","v":{"v":0,"d":"0.0"}}]
[null,null,"Estimated contracted labour:",{"$nulls":3},{"$f":"SUM((D27*(E27)/35)*(F27/12))","v":{"v":0,"d":"0.0"}}]
{"$rows_left_out":1}
{"sheet":"SUMMARY","index":6,"n_rows":26,"n_cols":17,"rows_kept":26,"merged":[[1,1,1,10],[2,1,2,8],[2,9,2,10],[4,3,4,10],[6,3,6,7],[8,1,8,10],[11,12,11,15],[12,12,12,15],[13,12,13,15],[18,1,18,10],[19,10,20,10],[20,1,20,2],[21,7,21,8],[22,7,22,8],[23,7,23,8],[24,7,24,8],[25,7,25,8]]}
[]
[null,"Connecting British Columbia Program: UBF Core Intake"]
[null,"                                                SUMMARY (Auto-Populated)",{"$nulls":7},"Published January 7, 2021 – Ver. 1.0"]
[]
[null,null,"Project Name:",{"$f":"IF(ISBLANK('INSTRUCTIONS - Project Info'!E25), \"Auto-Populated from the INSTRUCTIONS Sheet\", 'INSTRUCTIONS - Project Info'!E25)","v":"Auto-Populated from the INSTRUCTIONS Sheet"}]
[]
[null,null,"Project Type:",{"$f":"IF(ISBLANK('INSTRUCTIONS - Project Info'!E27), \"Auto-Populated from the INSTRUCTIONS Sheet\", 'INSTRUCTIONS - Project Info'!E27)","v":"Auto-Populated from the INSTRUCTIONS Sheet"}]
[]
[null,"PROJECT COMMUNITIES (Auto-Populated)",{"$nulls":10},"Eligible Costs"]
[]
[{"$nulls":3},"Last-Mile:",{"$nulls":3},"Transport:"]
[{"$nulls":3},"Total Number of Communities",{"$f":"'Named Communities'!$Q$13","v":0},null,null,"Total Number of Communities",{"$f":"'Named Communities'!$Q$19","v":0},{"$nulls":3},"Last Mile Eligible Costs per Community",{"$nulls":3},{"$f":"D23/E12","v":{"$error":"#DIV/0!"}}]
[{"$nulls":3},"Indigenous Communities",{"$f":"'Named Communities'!$Q$14","v":"0"},null,null,"Indigenous Communities",{"$f":"'Named Communities'!$Q$20","v":"0"},{"$nulls":3},"Last Mile Eligible Costs per Household",{"$nulls":3},{"$f":"D23/E14","v":{"$error":"#DIV/0!"}}]
[{"$nulls":3},"Total Number of Households",{"$f":"SUM('Named Communities'!$Q$15+Locales!O14)","v":0},{"$nulls":7},"Eligible Transport Costs per km",{"$nulls":3},{"$f":"D23/'Detailed Budget'!D48","v":{"$error":"#DIV/0!"}}]
[{"$nulls":3},"Number of Indigenous Households",{"$f":"'Named Communities'!$Q$16","v":0}]
[{"$nulls":3},"Number of Locales",{"$f":"Locales!$O$13","v":0}]
[]
[]
[null,"PROJECT BUDGET (Auto-Populated)"]
[{"$nulls":10},"% of\nEligible Costs:"]
{"$rows_left_out":7}
{"sheet":"Lists-HIdden","index":7,"n_rows":31,"n_cols":11,"rows_kept":31,"hidden":true}
[]
[null,"Project Types","Community Deployment","Broadband Solutions","Proposed Speeds",null,"Status",null,"Regional Districts",null,"Economic Regions"]
[null,"Last-Mile","Broadband","Fibre","Minimum 50/10",null,"Not Started",null,"Alberni-Clayoquot",null,"Cariboo Region"]
[null,"Last-Mile & Transport","Cellular","Cable","Minimum 25/5",null,"In Progress",null,"Bulkley-Nechako",null,"Kootenay Region"]
[null,null,"Public Wi-Fi Hotspot","DSL","Other",null,"On Hold",null,"Capital",null,"Mainland / Southwest"]
[null,null,"Broadband & Cellular","Fixed Wireless",null,null,"Completed",null,"Cariboo",null,"North Coast and Nechako"]
[null,null,"Satellite",{"$nulls":5},"Central Coast",null,"Northeast"]
[{"$nulls":8},"Central Kootenay",null,"Thompson-Okanagan"]
[{"$nulls":8},"Central Okanagan",null,"Vancouver Island / Coast"]
[{"$nulls":8},"Columbia-Shuswap"]
[{"$nulls":8},"Comox Valley"]
[{"$nulls":8},"Cowichan Valley"]
[{"$nulls":8},"East Kootenay"]
[{"$nulls":8},"Fraser Valley"]
[null,"Site Type","Site Status","Power Status","HWY Site Type",{"$nulls":3},"Fraser-Fort George"]
[null,"Cellular","New","Has Utility Access","Road Segment",{"$nulls":3},"Kitimat-Stikine"]
[null,"Public Wi-Fi Hotspot","Existing","Requires Utility Access","Rest Area",{"$nulls":3},"Kootenay Boundary"]
[null,"Emergency Call Box",null,null,"Highway Pullout",{"$nulls":3},"Metro Vancouver"]
[null,"Other",null,null,"Inland Ferry",{"$nulls":3},"Mount Waddington"]
[{"$nulls":4},"Other",{"$nulls":3},"Nanaimo"]
{"$rows_left_out":11}