{"text_format":"3","workbook":"xlsx","n_sheets":6,"sheets":["INSTRUCTIONS - Project Info","Communities","Detailed Budget","Equipment Details","Financial Operating Plan","SUMMARY"],"not_rendered":{"defined_names":39},"read":"whole","date_system":"1900"}

{"sheet":"INSTRUCTIONS - Project Info","index":0,"n_rows":36,"n_cols":19,"rows_kept":36,"merged":[[1,1,1,13],[2,1,2,13],[3,1,5,13],[14,1,16,13],[17,1,19,13],[22,1,22,13],[24,1,25,13],[26,2,26,3],[26,4,26,9],[28,2,28,3],[28,4,28,5],[29,4,29,5],[30,1,31,13],[32,2,32,3],[32,4,32,10],[34,2,34,3],[34,4,34,6],[34,7,34,10],[35,4,35,6],[35,7,35,10]]}
[]
[null,"Connecting British Columbia Program Phase 3"]
[null,"WORKBOOK INSTRUCTIONS"]
[null,"Applicants to the Connecting British Columbia Program are required to complete this workbook to provide the program area with detailed information about the proposed project. It is the responsibility of the applicant to ensure the information entered is accurate and that totals and costs add up correctly.  "]
[]
[]
[null,"This workbook consists of 6 sheets: "]
[null,null,"INSTRUCTIONS - Project Information"]
[null,null,"Communities"]
[null,null,"Detailed Budget"]
[null,null,"Equipment Details"]
[null,null,"Financial Operating Plan"]
[null,null,"SUMMARY (Auto-Populated)"]
[]
[null,"To simplify the templates some fields will automatically be greyed out depending on the project type selected.  For example, if an applicant selects a Transport project type, all last-mile fields will be greyed out.  Do not enter data into greyed out fields as errors could occur.  "]
[]
[]
[null,"Applicants should not enter formulas, add or remove columns and rows or make other changes to the format of the workbook. If you are pasting data from one spreadsheet to another, paste values only, not formulas or formatting. Any change to the format of the spreadsheet may prevent your data from being assessed for funding. "]
[]
[]
[null,"Once the workbook is completed verify all information entered is correct.  The SUMMARY sheet will auto-populated a reference table to summarize the information provided.  "]
[]
[null,"PROJECT INFORMATION"]
[]
[null,"Indicate the project name and select the project type (Last-Mile, Transport, or Transport & Last-Mile ) using the drop-down menu."]
[]
[null,null,"Project Name:"]
[]
[null,null,"Project Type:"]
[{"$nulls":4},"Use drop-down"]
[null,"Indicate the applicant organization and a primary contact for information entered into this workbook."]
[]
[null,null,"Applicant Organization:",{"$nulls":15},"Drop-Down List"]
[{"$nulls":18},"Transport"]
[null,null,"Primary Contact:",{"$nulls":15},"Last-Mile"]
[{"$nulls":4},"Name",null,null,"Email",{"$nulls":10},"Transport & Last-Mile"]

{"sheet":"Communities","index":1,"n_rows":1274,"n_cols":44,"rows_kept":1274,"merged":[[1,1,1,19],[2,1,2,18],[3,1,5,19],[6,1,6,9],[6,10,6,19],[8,1,10,9],[8,10,8,11],[8,12,8,17],[9,10,9,11],[9,12,9,13],[11,1,13,9],[14,1,16,9],[18,2,18,9],[19,2,19,4],[21,2,23,9],[24,2,26,9],[27,1,27,19],[27,37,30,37],[28,1,28,19],[29,17,29,19],[30,1,30,5],[30,7,30,12],[30,14,30,19],[30,42,30,43]]}
[]
[null,"Connecting British Columbia Program Phase 3"]
[null,"                           COMMUNITIES",{"$nulls":17},"Published Nov 2019 – Ver. 1.1","Drop Down Lists"]
[null,"Use this template to identify the communities that will benefit from the proposed project.  The list below contains the communities or placenames in B.C. that are classified as cities, towns, villages, districts, municipalities, or indigenous communities.  \nWhile every effort is made to ensure all communities are on this list it is possible that a local place name or neighborhood is not included.  Those communities not shown on the list below can be identified on the map provided with the application."]
[]
[{"$nulls":20},"Transport",null,"Fibre"]
[null,"INSTRUCTIONS",{"$nulls":8},"SUMMARY (Auto-Populated)",{"$nulls":9},"Last-Mile",null,"Microwave"]
[{"$nulls":20},"Transport & Last-Mile",null,"Other"]
[null,"Step 1: Identify communities for proposed project1 using the drop-down list in column G.  For each community indicate whether the project will provide Last-Mile, Transport, or Last-Mile and Tranport.",{"$nulls":8},"Project Name:",null,{"$f":"IF(ISBLANK('INSTRUCTIONS - Project Info'!E27), \"Auto-Populated from the INSTRUCTIONS Sheet\", 'INSTRUCTIONS - Project Info'!E27)","v":"Auto-Populated from the INSTRUCTIONS Sheet"}]
[{"$nulls":10},"Project Type:",null,{"$f":"IF(ISBLANK('INSTRUCTIONS - Project Info'!E29), \"Auto-Populated from the INSTRUCTIONS Sheet\", 'INSTRUCTIONS - Project Info'!E29)","v":"Auto-Populated from the INSTRUCTIONS Sheet"}]
[]
[null,"Step 2: Filter out the blank rows.  Click on the filter button in cell G32 and remove the check mark beside (Blanks).  To undue this select the filter button and select the check mark beside (Blanks).",{"$nulls":9},"Last-Mile"]
[{"$nulls":12},"Total Number of Communities",{"$f":"IF(W33=0,\"\",W33)","v":""}]
[{"$nulls":12},"First Nations Communities",{"$f":"IF(X28=0,\"\",X28)","v":""}]
[null,"Step 3: For each project community, provide information for columns H-M for last-mile projects, if applicable, and or columns O-T for transport projects, if applicable. ",{"$nulls":10},"Total Number of Households",{"$f":"IF(Y33=0,\"\",Y33)","v":""}]
[]
[]
[null,"Notes:",{"$nulls":9},"Transport","Total Number of Communities",{"$f":"IF(Z33=0,\"\",Z33)","v":""}]
[null,1,"Verify selected place names as multiples do exist.  A map link is provided in column C.  For more information refer to the data source found here:",{"$nulls":9},"First Nations Communities",{"$f":"IF(AA28=0,\"\",AA28)","v":""}]
[null,null," https://open.canada.ca/data/en/dataset/fe945388-1dd9-4a4a-9a1e-5c552579a28c",{"$nulls":9},"Total Number of PoPs",{"$f":"IF(AB33=0,\"\",AB33)","v":""}]
[]
[null,2,"Column D indicates whether a selected community has access to 50/10 Mbps internet based on data from Innovation, Science and Economic Development Canada. For last-mile projects the Connecting British Columbia Program provides funding for communities that do not have access to 50/10 Mbps internet.  Refer to section 3.1 in the Application Guide for more information."]
[]
[]
[null,3,"Contention ratio or over subscription ratio is the number of users sharing the same data capacity. For example a 50:1 contention ratio means that up to 50 broadband customers are sharing the same bandwidth at any one time."]
[{"$nulls":23},"Sum of FN Communities:",null,null,"Sum of FN Transport Communitiers:"]
[]
[null,"COMMUNITY INFORMATION",{"$nulls":21},{"$f":"SUM(X33:X1274)","v":0},null,null,{"$f":"SUM(AA33:AA1268)","v":0},{"$nulls":10},"Based on threshold fo 75% HHs in a HEX having access to 50/10"]
[]
[{"$nulls":6},"Step 1","Step 3"]
[null,"Reference List",{"$nulls":5}," Last-Mile Project",{"$nulls":6},"Transport Project",{"$nulls":5},"Last-Mile Stats Calculations",{"$nulls":4},"Transport Calculations",null,null,"Reference List ",{"$nulls":9},"CRTC Broadband Fund Criteria",{"$nulls":3},"Not Used Currently"]
[null,"Place ID\n","Place Name1 \n(*denotes an indigenous community)","Served with\n50/10 Mbps\nInternet2\n(Yes or No)","Regional District","Economic Region","\nIdentify Communities for \nProposed Project \n(use drop-down in each cell)\n                                \n                  Step 2","Number of Households proposed to be served?","Broadband Speeds proposed for households\n(Mbps)","Contention Ratio3 \n(X:1) - enter value\nfor only X below","Proposed Last-Mile Retail Pricing\n(minimum 50/10 Mbps service with unlimited data)","Existing Transport Capacity \n(Mbps)","Name of Existing Transport Provider\n(leave blank for none)","Network\nCapacity\nCheck\n(Auto-populated)","Transport Technology \n(use drop-down)","Transport Capacity \n(Mbps)","Number of Points-of-Presence (PoPs) ","Number of Breakouts ","Proposed Transport Wholesale Pricing (1000 Mbps)","Proposed Transport Wholesale Pricing (10000 Mbps)","Check Calculation 1 (Household Capacity Required)","Check Calculation 2 (Difference with Available Transport)","Total Number of Communities Calculation","Total number of First Nations & Indigenous Communities Calculation","Total number of HHs Calculation","Total Number of Transport Communities","Total number of First Nations & Indigenous Communities Calculation","Total Number of PoPs","Place Name","First Nations","Latitude","Longitude","Map Links","Place ID","Place Type","HEX POPULATION","HEX TOTAL_DWELLINGS","Broadband 50/10 Mbps Access (Yes/No)","Eligible for CRTC Last-Mile Funding (Yes/No)","CRTC Transport Eligible","CRTC Satellite Dependant","Placename with Asterix for First Nations","Condition for Last-Mile Community Names","Condition for Transport "]
[null,50604,{"$f":"HYPERLINK(AG33,AP33)","v":"?Akisq'nuk First Nation*"},"No","Regional District of East Kootenay","Kootenay",{"$nulls":7},{"$f":"IF(COUNT(V33)=0, \"\", IF(V33>=0,\"Sufficient Capacity\", IF(V33<0,\"Not Enough Capacity\")))","v":""},{"$nulls":6},{"$f":"IF(OR(ISBLANK(H33),ISBLANK(I33),ISBLANK(J33)), \"\",(H33*I33/J33))","v":""},{"$f":"IF(AND(COUNT(L33,U33)=2, OR($M$10=\"Last-Mile\", $M$10=\"Transport & Last-Mile\")), L33-U33, \"\")","v":""},{"$f":"COUNTA(H33:H1274)","v":0},{"$f":"IF(AD33=\"Y\",COUNT(H33), \"\")","v":0},{"$f":"SUM(H33:H1274)","v":0},{"$f":"COUNTA(P33:P1274)","v":0},{"$f":"IF(AD33=\"Y\",COUNT(P33), \"\")","v":0},{"$f":"SUM(Q33:Q1274)","v":0},"?Akisq'nuk First Nation","Y",{"v":50.411307768,"d":"50.41131"},{"v":-115.908159529,"d":"-115.90816"},"http://www.google.com/maps/place/50.411307768,-115.908159529",50604,"Rural First Nations Primary Reserve",61,50,"No","Yes","Yes","No ",{"$f":"IF(AD33=\"Y\", CONCATENATE(AC33,\"*\"), AC33)","v":"?Akisq'nuk First Nation*"},{"$f":"IF(G33=\"Last-Mile\",\"TRUE\",IF(G33=\"Transport & Last-Mile\",\"TRUE\",\"FALSE\"))","v":"FALSE"},{"$f":"IF(G33=\"Transport\",\"TRUE\",IF(G33=\"Transport & Last-Mile\",\"TRUE\",\"FALSE\"))","v":"FALSE"}]
[null,8013,"?Akisq'nuk*","No","Regional District of East Kootenay","Kootenay",{"$nulls":14},"","",null,0,null,null,0,null,"?Akisq'nuk","Y",{"v":50.451202,"d":"50.45120"},{"v":-115.959718,"d":"-115.95972"},"http://www.google.com/maps/place/50.451202,-115.959718",8013,"Rural First Nations Secondary Reserve",105,58,"No","No","Yes","No ","?Akisq'nuk*","FALSE","FALSE"]
[null,50602,"?aqam*","No","Regional District of East Kootenay","Kootenay",{"$nulls":14},"","",null,0,null,null,0,null,"?aqam","Y",{"v":49.583492611,"d":"49.58349"},{"v":-115.754511788,"d":"-115.75451"},"http://www.google.com/maps/place/49.583492611,-115.754511788",50602,"Rural First Nations Secondary Reserve",105,38,"No","No","Yes","No ","?aqam*","FALSE","FALSE"]
[null,50709,"?Esdilagh First Nation*","No","Cariboo Regional District","Cariboo",{"$nulls":7},"",{"$nulls":6},"","",null,0,null,null,0,null,"?Esdilagh First Nation","Y",{"v":52.562844921,"d":"52.56284"},{"v":-122.496775954,"d":"-122.49678"},"http://www.google.com/maps/place/52.562844921,-122.496775954",50709,"Rural First Nations Primary Reserve",24,13,"No","Yes","No","No ","?Esdilagh First Nation*","FALSE","FALSE"]
[null,8482,"100 Mile House","Yes","Cariboo Regional District","Cariboo",{"$nulls":7},"",{"$nulls":6},"","",null,"",null,null,"",null,"100 Mile House","N",{"v":51.639147,"d":"51.63915"},{"v":-121.294483,"d":"-121.29448"},"http://www.google.com/maps/place/51.639147,-121.294483",8482,"Rural",1979,937,"Yes","No","No","No ","100 Mile House","FALSE","FALSE"]
[null,8481,"103 Mile","Yes","Cariboo Regional District","Cariboo",{"$nulls":7},"",{"$nulls":6},"","",null,"",null,null,"",null,"103 Mile","N",{"v":51.688988,"d":"51.68899"},{"v":-121.313539,"d":"-121.31354"},"http://www.google.com/maps/place/51.688988,-121.313539",8481,"Rural",936,422,"Yes","No","No","No ","103 Mile","FALSE","FALSE"]
[null,8480,"105 Mile House","Yes","Cariboo Regional District","Cariboo",{"$nulls":7},"",{"$nulls":6},"","",null,"",null,null,"",null,"105 Mile House","N",{"v":51.706944,"d":"51.70694"},{"v":-121.331114,"d":"-121.33111"},"http://www.google.com/maps/place/51.706944,-121.331114",8480,"Rural",936,422,"Yes","No","No","No ","105 Mile House","FALSE","FALSE"]
[null,8479,"108 Mile Ranch","Yes","Cariboo Regional District","Cariboo",{"$nulls":7},"",{"$nulls":6},"","",null,"",null,null,"",null,"108 Mile Ranch","N",{"v":51.728096,"d":"51.72810"},{"v":-121.350512,"d":"-121.35051"},"http://www.google.com/maps/place/51.728096,-121.350512",8479,"Rural",2305,1057,"Yes","No","No","No ","108 Mile Ranch","FALSE","FALSE"]
{"$rows_left_out":1235}
{"sheet":"Detailed Budget","index":2,"n_rows":155,"n_cols":9,"rows_kept":155,"merged":[[1,1,1,8],[2,1,2,7],[3,1,5,8],[6,4,6,8],[8,1,11,3],[8,5,8,8],[9,5,9,6],[12,1,14,3],[16,1,18,2],[16,5,16,7],[17,5,17,6],[18,5,18,6],[19,5,19,6],[20,5,20,6],[24,1,24,8],[26,4,26,5],[26,6,26,7],[27,1,27,2],[28,1,28,8],[29,1,29,2],[30,1,30,2],[31,1,31,2],[32,1,32,2],[33,1,33,2],[34,1,34,2],[35,1,35,2],[36,1,36,2],[37,1,37,2],[38,1,38,2],[39,1,39,8],[40,1,40,2],[41,1,41,2],[42,1,42,2],[43,1,43,2],[44,1,44,2],[45,1,45,2],[46,1,46,2],[47,1,47,2],[48,1,48,2],[49,1,49,2],[50,1,50,2],[51,1,51,2],[52,1,52,2],[53,1,53,2],[54,1,54,2],[55,1,55,2],[56,1,56,2],[57,1,57,2],[58,1,58,2],[59,1,59,2],[60,1,60,2],[61,1,61,8],[62,1,62,2],[63,1,63,2],[64,1,64,2],[65,1,65,2],[66,1,66,2],[67,1,67,2],[68,1,68,2],[69,1,69,2],[70,1,70,2],[71,1,71,2],[72,1,72,2],[73,1,73,2],[74,1,74,2],[75,1,75,2],[76,1,76,2],[77,1,77,2],[78,1,78,8],[79,1,79,2],[80,1,80,2],[81,1,81,2],[82,1,82,2],[83,1,83,2],[84,1,84,2],[85,1,85,2],[86,1,86,2],[87,1,87,2],[88,1,88,2],[89,1,89,2],[90,1,90,2],[91,1,91,2],[92,1,92,2],[93,1,93,8],[94,1,94,2],[95,1,95,2],[96,1,96,2],[97,1,97,2],[98,1,98,2],[99,1,99,2],[100,1,100,2],[101,1,101,2],[102,1,102,2],[103,1,103,8],[104,1,104,2],[105,1,105,2],[106,1,106,2],[107,1,107,2],[108,1,108,2],[109,1,109,2],[110,1,110,2],[111,1,111,2],[112,1,112,2],[113,1,113,2],[114,1,114,2],[115,1,115,2],[116,1,116,2],[117,1,117,2],[118,1,118,3],[120,4,120,5],[120,6,120,7],[121,1,121,2],[122,1,122,2],[123,1,123,2],[124,1,124,2],[125,1,125,2],[126,1,126,2],[127,1,127,2],[128,1,128,2],[129,1,129,2],[130,1,130,2],[131,1,131,2],[132,1,132,2],[133,1,133,2],[134,1,134,2],[135,1,135,2],[136,1,136,2],[137,1,137,3],[139,1,139,8],[141,2,141,3],[142,2,142,3],[143,2,143,3],[144,2,144,3],[146,2,146,4],[147,2,147,3],[147,5,147,6],[148,2,148,3],[148,6,148,7],[149,2,149,3],[150,2,150,3],[151,2,151,3],[152,2,152,3]]}
[]
[null,"Connecting British Columbia Program Phase 3"]
[null,"                                    DETAILED BUDGET",{"$nulls":6},"Published Nov 2019 – Ver. 1.1"]
[null,"Use this template to identify the proposed project costs. Refer to section 5.4 in the Connecting British Columbia Program Phase 3 Application Guide for a list of Eligible and Ineligible costs.  "]
[]
[]
[null,null,"INSTRUCTIONS",null,"SUMMARY (Auto-Populated)"]
[]
[null,"Step 1: Complete the Detailed Project Budget table below using the appropriate categories and sub-categories. Use \"other\" for items not listed.  Ensure that transport and last-mile costs are separated where applicable.  ",null,null,"Project Name:",{"$f":"IF(ISBLANK('INSTRUCTIONS - Project Info'!E27), \"Auto-Populated from the INSTRUCTIONS Sheet\", 'INSTRUCTIONS - Project Info'!E27)","v":"Auto-Populated from the INSTRUCTIONS Sheet"}]
[{"$nulls":4},"Project Type:",{"$f":"IF(ISBLANK('INSTRUCTIONS - Project Info'!E29), \"Auto-Populated from the INSTRUCTIONS Sheet\", 'INSTRUCTIONS - Project Info'!E29)","v":"Auto-Populated from the INSTRUCTIONS Sheet"}]
[]
[{"$nulls":4},"Project Budget"]
[null,"Step 2: Verify that the totals add up correctly and fill in the project funding information in the lower table.  ",{"$nulls":3},"Last-Mile","Transport","Total"]
[{"$nulls":4},"Eligible Costs",{"$f":"E143","v":0},0,0]
[{"$nulls":4},"Ineligible Costs",0,0,0]
[{"$nulls":4},"Total Costs",0,0,0]
[{"$nulls":4},"Project Funding",{"$nulls":3},"% of Eligible Costs:"]
[{"$nulls":5},"Connecting British Columbia Amount Requested",null,{"$f":"E148","v":0},{"$f":"H18/H14","v":{"$error":"#DIV/0!"}}]
[{"$nulls":5},"Applicant Contribution",null,{"$f":"E149","v":0}]
[{"$nulls":5},"Other Funding Sources",null,{"$f":"SUM(E150:E152)","v":0}]
[{"$nulls":5},"Total Funding",null,{"$f":"E153","v":0}]
[]
[{"$nulls":6},"Budget/Funding Error",{"$f":"H16-H21","v":0}]
[]
[null,"Step 1  - DETAILED BUDGET INFORMATION"]
[]
[{"$nulls":4},"Last-Mile Allocation",null,"Transport Allocation"]
[null,"Eligible Costs ",null,"Total Number of Units                           \n(if applicable)\n(please specify)","Equipment/Parts Costs","Labour Costs","Equipment/Parts Costs","Labour Costs","Total Allocation\nEligible Costs ($)\n(Auto-Populated)"]
[null,"Site Survey, Engineering and Project Management"]
[null,"Site Surveying",{"$nulls":6},{"$f":"SUM(E30:H30)","v":0}]
[null,"Engineering Design",{"$nulls":6},{"$f":"SUM(E31:H31)","v":0}]
[null,"Project Management",{"$nulls":6},0]
[null,"Pole Make Ready Costs ",{"$nulls":6},0]
[null,"Third Party Project Validation",{"$nulls":6},0]
[null,"Other (please specify)",{"$nulls":6},0]
[null,"Other (please specify)",{"$nulls":6},0]
[null,"Other (please specify)",{"$nulls":6},0]
[null,"Other (please specify)",{"$nulls":6},0]
[{"$nulls":8},0]
[null,"Networking"]
{"$rows_left_out":116}
{"sheet":"Equipment Details","index":3,"n_rows":26,"n_cols":13,"rows_kept":26,"merged":[[1,1,1,8],[2,1,2,7],[3,1,4,8],[5,1,5,8],[6,2,6,5],[7,2,7,5],[8,1,8,8],[9,1,9,8]]}
[]
[null,"Connecting British Columbia Program Phase 3"]
[null,"                                  EQUIPMENT DETAILS",{"$nulls":6},"Published Nov 2019 – Ver. 1.1"]
[null,"Use this template to identify the equipment used for the proposed project.  Equipment listed should match the logical network diagram and mapping data provided with the application.   "]
[]
[]
[null,"Project Name:",{"$f":"IF(ISBLANK('INSTRUCTIONS - Project Info'!E27), \"Auto-Populated from the INSTRUCTIONS Sheet\", 'INSTRUCTIONS - Project Info'!E27)","v":"Auto-Populated from the INSTRUCTIONS Sheet"}]
[null,"Project Type:",{"$f":"IF(ISBLANK('INSTRUCTIONS - Project Info'!E29), \"Auto-Populated from the INSTRUCTIONS Sheet\", 'INSTRUCTIONS - Project Info'!E29)","v":"Auto-Populated from the INSTRUCTIONS Sheet"}]
[]
[null,"EQUIPMENT INFORMATION"]
[]
[null,"Network Identifier\n(should match with the logical network diagram and project mapping data)","Indicate Last-Mile or Transport Component\n(use drop-down)","Network Category                         \n(use drop-down)","Equipment Description","Proposed Throughput \n(Mbps)","Wireless Transmitter Frequency \n(if applicable in MHz)","Wireless Transmitter Bandwidth\n(if applicable MHz)","Licencing Status\n(use drop-down)",{"$nulls":3},"Drop-Down Lists"]
[{"$nulls":12},"Transport"]
[{"$nulls":12},"Last-Mile"]
[]
[]
[{"$nulls":12},"Fibre Optic"]
[{"$nulls":12},"Point-to-Point Wireless"]
[{"$nulls":12},"Routing and Switching"]
[{"$nulls":12},"Satellite Related"]
[{"$nulls":12},"Wireline Last-Mile"]
[]
[{"$nulls":12},"Not required"]
[{"$nulls":12},"Acquired"]
[{"$nulls":12},"Pending"]
[{"$nulls":12},"Not yet initiated"]

{"sheet":"Financial Operating Plan","index":4,"n_rows":55,"n_cols":38,"rows_kept":55,"merged":[[1,2,1,8],[2,2,2,8],[2,36,2,37],[4,2,4,10],[5,2,5,5],[7,2,7,13],[7,14,7,25],[7,26,7,37],[9,1,9,37],[14,1,14,37],[24,1,24,37]]}
[]
[null,null,"Connecting British Columbia Program Phase 3"]
[null," ","FINANCIAL OPERATING PLAN",{"$nulls":33},"Published Feb 2020 – Ver. 1.2"]
[]
[null,"Project Name:",{"$f":"IF(ISBLANK('INSTRUCTIONS - Project Info'!E27), \"Auto-Populated from the INSTRUCTIONS Sheet\", 'INSTRUCTIONS - Project Info'!E27)","v":"Auto-Populated from the INSTRUCTIONS Sheet"}]
[null,"Project Type:",{"$f":"IF(ISBLANK('INSTRUCTIONS - Project Info'!E29), \"Auto-Populated from the INSTRUCTIONS Sheet\", 'INSTRUCTIONS - Project Info'!E29)","v":"Auto-Populated from the INSTRUCTIONS Sheet"}]
[]
[null,null,"Year 1",{"$nulls":11},"Year 2",{"$nulls":11},"Year 3"]
[null,null,"Month 1","Month 2","Month 3","Month 4","Month 5","Month 6","Month 7","Month 8","Month 9","Month 10","Month 11","Month 12","Month 13","Month 14","Month 15","Month 16","Month 17","Month 18","Month 19","Month 20","Month 21","Month 22","Month 23","Month 24","Month 25","Month 26","Month 27","Month 28","Month 29","Month 30","Month 31","Month 32","Month 33","Month 34","Month 35","Month 36"]
[null,"Subscribers (Last-Mile Projects Only)"]
[null,"Number of Residential Customers"]
[null,"Number of Business Customers"]
[null,"Total Subscribers",{"$f":"SUM(C11:C12)","v":0},{"$f":"SUM(D11:D12)","v":0},0,0,0,0,0,0,0,0,0,0,0,0,0,0,0,0,0,0,0,0,0,0,0,0,0,0,0,0,0,0,0,0,0,0]
[]
[null,"Revenue"]
[null,"Transport Retail Data"]
[null,"Transport Wholesale Data"]
[null,"Other Transport Revenue (please specifiy)"]
[null,"Residential Client Revenue"]
[null,"Business Client Revenue"]
[null,"CPE Installation"]
[null,"Other Revenue (please specify)"]
[null,"Gross Revenue",{"$f":"SUM(C16:C22)","v":0},{"$f":"SUM(D16:D22)","v":0},0,0,0,0,0,0,0,0,0,0,0,0,0,0,0,0,0,0,0,0,0,0,0,0,0,0,0,0,0,0,0,0,0,0]
[]
[null,"Expenses"]
[null,"Residential Customer Installation Cost"]
[null,"Business Customer Installation Cost"]
[null,"Repair & Maintenance"]
[null,"Wages & Salaries"]
[null,"Gateway"]
[null,"Utilities "]
[null,"Network renewal"]
[null,"Sales/Marketing"]
[null,"G & A Expenses"]
[null,"Professional Fees (Legal/Accounting)"]
[null,"Vehicle Expenses"]
[null,"Insurance"]
[null,"Travel"]
[null,"Other (please specify)"]
[null,"Other (please specify)"]
{"$rows_left_out":16}
{"sheet":"SUMMARY","index":5,"n_rows":22,"n_cols":17,"rows_kept":22,"merged":[[1,1,1,10],[2,1,2,10],[4,3,4,10],[6,3,6,7],[8,1,8,10],[10,1,10,2],[11,12,11,15],[12,12,12,15],[13,12,13,15],[15,1,15,10],[16,10,17,10],[17,1,17,2],[18,7,18,8],[19,7,19,8],[20,7,20,8],[21,7,21,8]]}
[]
[null,"Connecting British Columbia Program Phase 3"]
[null,"SUMMARY (Auto-Populated)"]
[]
[null,null,"Project Name:",{"$f":"IF(ISBLANK('INSTRUCTIONS - Project Info'!E27), \"Auto-Populated from the INSTRUCTIONS Sheet\", 'INSTRUCTIONS - Project Info'!E27)","v":"Auto-Populated from the INSTRUCTIONS Sheet"}]
[]
[null,null,"Project Type:",{"$f":"IF(ISBLANK('INSTRUCTIONS - Project Info'!E29), \"Auto-Populated from the INSTRUCTIONS Sheet\", 'INSTRUCTIONS - Project Info'!E29)","v":"Auto-Populated from the INSTRUCTIONS Sheet"}]
[]
[null,"PROJECT COMMUNITIES (Auto-Populated)",{"$nulls":10},"Eligible Costs"]
[]
[null,"Last-Mile ",{"$nulls":4},"Transport"]
[{"$nulls":3},"Total Number of Communities",{"$f":"Communities!N13","v":""},null,null,"Total Number of Communities",{"$f":"Communities!N18","v":""},{"$nulls":3},"Last Mile Eligible Costs per Community",{"$nulls":3},{"$f":"D20/E12","v":{"$error":"#VALUE!"}}]
[{"$nulls":3},"First Nations Communities",{"$f":"Communities!N14","v":""},null,null,"First Nations Communities",{"$f":"Communities!N19","v":""},{"$nulls":3},"Last Mile Eligible Costs per Household",{"$nulls":3},{"$f":"D20/E14","v":{"$error":"#VALUE!"}}]
[{"$nulls":3},"Total Number of Households",{"$f":"Communities!N15","v":""},null,null,"Total Number of PoPs",{"$f":"Communities!N20","v":""},{"$nulls":3},"Eligible Transport Costs per km",{"$nulls":3},{"$f":"D20/'Detailed Budget'!D64","v":{"$error":"#DIV/0!"}}]
[]
[null,"PROJECT BUDGET (Auto-Populated)"]
[{"$nulls":10},"% of\nEligible Costs:"]
[null,"Project Budget",{"$nulls":4},"Project Funding"]
[{"$nulls":3},"Last-Mile","Transport","Total",null,"Connecting British Columbia Amount Requested",null,{"$f":"'Detailed Budget'!H18","v":0},{"$f":"J19/F20","v":{"$error":"#DIV/0!"}}]
[null,null,"Eligible Costs",{"$f":"'Detailed Budget'!F14","v":0},{"$f":"'Detailed Budget'!G14","v":0},{"$f":"'Detailed Budget'!H14","v":0},null,"Applicant Contribution",null,{"$f":"'Detailed Budget'!H19","v":0}]
[null,null,"Ineligible Costs",{"$f":"'Detailed Budget'!F15","v":0},{"$f":"'Detailed Budget'!G15","v":0},{"$f":"'Detailed Budget'!H15","v":0},null,"Other Funding Sources",null,{"$f":"'Detailed Budget'!H20","v":0}]
[null,null,"Total Costs",{"$f":"'Detailed Budget'!F16","v":0},{"$f":"'Detailed Budget'!G16","v":0},{"$f":"'Detailed Budget'!H16","v":0},null,"Total Funding",null,{"$f":"'Detailed Budget'!H21","v":0}]