{"text_format":"3","workbook":"xlsx","n_sheets":6,"sheets":["INSTRUCTIONS - Project Info","Communities","Detailed Budget","Equipment Details","Financial Operating Plan","SUMMARY"],"not_rendered":{"defined_names":39},"read":"whole","date_system":"1900"}

{"sheet":"INSTRUCTIONS - Project Info","index":0,"n_rows":36,"n_cols":19,"rows_kept":36,"merged":[[1,1,1,13],[2,1,2,13],[3,1,5,13],[14,1,16,13],[17,1,19,13],[22,1,22,13],[24,1,25,13],[26,2,26,3],[26,4,26,9],[28,2,28,3],[28,4,28,5],[29,4,29,5],[30,1,31,13],[32,2,32,3],[32,4,32,10],[34,2,34,3],[34,4,34,6],[34,7,34,10],[35,4,35,6],[35,7,35,10]]}
[]
[null,"Connecting British Columbia Program Phase 3"]
[null,"WORKBOOK INSTRUCTIONS"]
[null,"Applicants to the Connecting British Columbia Program are required to complete this workbook to provide the program area with detailed information about the proposed project. It is the responsibility of the applicant to ensure the information entered is accurate and that totals and costs add up correctly.  "]
[]
[]
[null,"This workbook consists of 6 sheets: "]
[null,null,"INSTRUCTIONS - Project Information"]
[null,null,"Communities"]
[null,null,"Detailed Budget"]
[null,null,"Equipment Details"]
[null,null,"Financial Operating Plan"]
[null,null,"SUMMARY (Auto-Populated)"]
[]
[null,"To simplify the templates some fields will automatically be greyed out depending on the project type selected.  For example, if an applicant selects a Transport project type, all last-mile fields will be greyed out.  Do not enter data into greyed out fields as errors could occur.  "]
[]
[]
[null,"Applicants should not enter formulas, add or remove columns and rows or make other changes to the format of the workbook. If you are pasting data from one spreadsheet to another, paste values only, not formulas or formatting. Any change to the format of the spreadsheet may prevent your data from being assessed for funding. "]
[]
[]
[null,"Once the workbook is completed verify all information entered is correct.  The SUMMARY sheet will auto-populated a reference table to summarize the information provided.  "]
[]
[null,"PROJECT INFORMATION"]
[]
[null,"Indicate the project name and select the project type (Last-Mile, Transport, or Transport & Last-Mile ) using the drop-down menu."]
[]
[null,null,"Project Name:"]
[]
[null,null,"Project Type:"]
[{"$nulls":4},"Use drop-down"]
[null,"Indicate the applicant organization and a primary contact for information entered into this workbook."]
[]
[null,null,"Applicant Organization:",{"$nulls":15},"Drop-Down List"]
[{"$nulls":18},"Transport"]
[null,null,"Primary Contact:",{"$nulls":15},"Last-Mile"]
[{"$nulls":4},"Name",null,null,"Email",{"$nulls":10},"Transport & Last-Mile"]

{"sheet":"Communities","index":1,"n_rows":1274,"n_cols":44,"rows_kept":1274,"merged":[[1,1,1,19],[2,1,2,18],[3,1,5,19],[6,1,6,9],[6,10,6,19],[8,1,10,9],[8,10,8,11],[8,12,8,17],[9,10,9,11],[9,12,9,13],[11,1,13,9],[14,1,16,9],[18,2,18,9],[19,2,19,4],[21,2,23,9],[24,2,26,9],[27,1,27,19],[27,37,30,37],[28,1,28,19],[29,17,29,19],[30,1,30,5],[30,7,30,12],[30,14,30,19],[30,42,30,43]]}
[]
[null,"Connecting British Columbia Program Phase 3"]
[null,"                           COMMUNITIES",{"$nulls":17},"Published Nov 2019 – Ver. 1.1","Drop Down Lists"]
[null,"Use this template to identify the communities that will benefit from the proposed project.  The list below contains the communities or placenames in B.C. that are classified as cities, towns, villages, districts, municipalities, or indigenous communities.  \nWhile every effort is made to ensure all communities are on this list it is possible that a local place name or neighborhood is not included.  Those communities not shown on the list below can be identified on the map provided with the application."]
[]
[{"$nulls":20},"Transport",null,"Fibre"]
[null,"INSTRUCTIONS",{"$nulls":8},"SUMMARY (Auto-Populated)",{"$nulls":9},"Last-Mile",null,"Microwave"]
[{"$nulls":20},"Transport & Last-Mile",null,"Other"]
[null,"Step 1: Identify communities for proposed project1 using the drop-down list in column G.  For each community indicate whether the project will provide Last-Mile, Transport, or Last-Mile and Tranport.",{"$nulls":8},"Project Name:",null,{"$f":"IF(ISBLANK('INSTRUCTIONS - Project Info'!E27), \"Auto-Populated from the INSTRUCTIONS Sheet\", 'INSTRUCTIONS - Project Info'!E27)","v":"Auto-Populated from the INSTRUCTIONS Sheet"}]
[{"$nulls":10},"Project Type:",null,{"$f":"IF(ISBLANK('INSTRUCTIONS - Project Info'!E29), \"Auto-Populated from the INSTRUCTIONS Sheet\", 'INSTRUCTIONS - Project Info'!E29)","v":"Auto-Populated from the INSTRUCTIONS Sheet"}]
[]
[null,"Step 2: Filter out the blank rows.  Click on the filter button in cell G32 and remove the check mark beside (Blanks).  To undue this select the filter button and select the check mark beside (Blanks).",{"$nulls":9},"Last-Mile"]
[{"$nulls":12},"Total Number of Communities",{"$f":"IF(W33=0,\"\",W33)","v":""}]
[{"$nulls":12},"First Nations Communities",{"$f":"IF(X28=0,\"\",X28)","v":""}]
[null,"Step 3: For each project community, provide information for columns H-M for last-mile projects, if applicable, and or columns O-T for transport projects, if applicable. ",{"$nulls":10},"Total Number of Households",{"$f":"IF(Y33=0,\"\",Y33)","v":""}]
[]
[]
[null,"Notes:",{"$nulls":9},"Transport","Total Number of Communities",{"$f":"IF(Z33=0,\"\",Z33)","v":""}]
[null,1,"Verify selected place names as multiples do exist.  A map link is provided in column C.  For more information refer to the data source found here:",{"$nulls":9},"First Nations Communities",{"$f":"IF(AA28=0,\"\",AA28)","v":""}]
[null,null," https://open.canada.ca/data/en/dataset/fe945388-1dd9-4a4a-9a1e-5c552579a28c",{"$nulls":9},"Total Number of PoPs",{"$f":"IF(AB33=0,\"\",AB33)","v":""}]
[]
[null,2,"Column D indicates whether a selected community has access to 50/10 Mbps internet based on data from Innovation, Science and Economic Development Canada. For last-mile projects the Connecting British Columbia Program provides funding for communities that do not have access to 50/10 Mbps internet.  Refer to section 3.1 in the Application Guide for more information."]
[]
[]
[null,3,"Contention ratio or over subscription ratio is the number of users sharing the same data capacity. For example a 50:1 contention ratio means that up to 50 broadband customers are sharing the same bandwidth at any one time."]
[{"$nulls":23},"Sum of FN Communities:",null,null,"Sum of FN Transport Communitiers:"]
[]
[null,"COMMUNITY INFORMATION",{"$nulls":21},{"$f":"SUM(X33:X1274)","v":0},null,null,{"$f":"SUM(AA33:AA1268)","v":0},{"$nulls":10},"Based on threshold fo 75% HHs in a HEX having access to 50/10"]
[]
[{"$nulls":6},"Step 1","Step 3"]
[null,"Reference List",{"$nulls":5}," Last-Mile Project",{"$nulls":6},"Transport Project",{"$nulls":5},"Last-Mile Stats Calculations",{"$nulls":4},"Transport Calculations",null,null,"Reference List ",{"$nulls":9},"CRTC Broadband Fund Criteria",{"$nulls":3},"Not Used Currently"]
[null,"Place ID\n","Place Name1 \n(*denotes an indigenous community)","Served with\n50/10 Mbps\nInternet2\n(Yes or No)","Regional District","Economic Region","\nIdentify Communities for \nProposed Project \n(use drop-down in each cell)\n                                \n                  Step 2","Number of Households proposed to be served?","Broadband Speeds proposed for households\n(Mbps)","Contention Ratio3 \n(X:1) - enter value\nfor only X below","Proposed Last-Mile Retail Pricing\n(minimum 50/10 Mbps service with unlimited data)","Existing Transport Capacity \n(Mbps)","Name of Existing Transport Provider\n(leave blank for none)","Network\nCapacity\nCheck\n(Auto-populated)","Transport Technology \n(use drop-down)","Transport Capacity \n(Mbps)","Number of Points-of-Presence (PoPs) ","Number of Breakouts ","Proposed Transport Wholesale Pricing (1000 Mbps)","Proposed Transport Wholesale Pricing (10000 Mbps)","Check Calculation 1 (Household Capacity Required)","Check Calculation 2 (Difference with Available Transport)","Total Number of Communities Calculation","Total number of First Nations & Indigenous Communities Calculation","Total number of HHs Calculation","Total Number of Transport Communities","Total number of First Nations & Indigenous Communities Calculation","Total Number of PoPs","Place Name","First Nations","Latitude","Longitude","Map Links","Place ID","Place Type","HEX POPULATION","HEX TOTAL_DWELLINGS","Broadband 50/10 Mbps Access (Yes/No)","Eligible for CRTC Last-Mile Funding (Yes/No)","CRTC Transport Eligible","CRTC Satellite Dependant","Placename with Asterix for First Nations","Condition for Last-Mile Community Names","Condition for Transport "]
[null,50604,{"$f":"HYPERLINK(AG33,AP33)","v":"?Akisq'nuk First Nation*"},"No","Regional District of East Kootenay","Kootenay",{"$nulls":7},{"$f":"IF(COUNT(V33)=0, \"\", IF(V33>=0,\"Sufficient Capacity\", IF(V33<0,\"Not Enough Capacity\")))","v":""},{"$nulls":6},{"$f":"IF(OR(ISBLANK(H33),ISBLANK(I33),ISBLANK(J33)), \"\",(H33*I33/J33))","v":""},{"$f":"IF(AND(COUNT(L33,U33)=2, OR($M$10=\"Last-Mile\", $M$10=\"Transport & Last-Mile\")), L33-U33, \"\")","v":""},{"$f":"COUNTA(H33:H1274)","v":0},{"$f":"IF(AD33=\"Y\",COUNT(H33), \"\")","v":0},{"$f":"SUM(H33:H1274)","v":0},{"$f":"COUNTA(P33:P1274)","v":0},{"$f":"IF(AD33=\"Y\",COUNT(P33), \"\")","v":0},{"$f":"SUM(Q33:Q1274)","v":0},"?Akisq'nuk First Nation","Y",{"v":50.411307768,"d":"50.41131"},{"v":-115.908159529,"d":"-115.90816"},"http://www.google.com/maps/place/50.411307768,-115.908159529",50604,"Rural First Nations Primary Reserve",61,50,"No","Yes","Yes","No ",{"$f":"IF(AD33=\"Y\", CONCATENATE(AC33,\"*\"), AC33)","v":"?Akisq'nuk First Nation*"},{"$f":"IF(G33=\"Last-Mile\",\"TRUE\",IF(G33=\"Transport & Last-Mile\",\"TRUE\",\"FALSE\"))","v":"FALSE"},{"$f":"IF(G33=\"Transport\",\"TRUE\",IF(G33=\"Transport & Last-Mile\",\"TRUE\",\"FALSE\"))","v":"FALSE"}]
[null,8013,"?Akisq'nuk*","No","Regional District of East Kootenay","Kootenay",{"$nulls":14},"","",null,0,null,null,0,null,"?Akisq'nuk","Y",{"v":50.451202,"d":"50.45120"},{"v":-115.959718,"d":"-115.95972"},"http://www.google.com/maps/place/50.451202,-115.959718",8013,"Rural First Nations Secondary Reserve",105,58,"No","No","Yes","No ","?Akisq'nuk*","FALSE","FALSE"]
[null,50602,"?aqam*","No","Regional District of East Kootenay","Kootenay",{"$nulls":14},"","",null,0,null,null,0,null,"?aqam","Y",{"v":49.583492611,"d":"49.58349"},{"v":-115.754511788,"d":"-115.75451"},"http://www.google.com/maps/place/49.583492611,-115.754511788",50602,"Rural First Nations Secondary Reserve",105,38,"No","No","Yes","No ","?aqam*","FALSE","FALSE"]
[null,50709,"?Esdilagh First Nation*","No","Cariboo Regional District","Cariboo",{"$nulls":7},"",{"$nulls":6},"","",null,0,null,null,0,null,"?Esdilagh First Nation","Y",{"v":52.562844921,"d":"52.56284"},{"v":-122.496775954,"d":"-122.49678"},"http://www.google.com/maps/place/52.562844921,-122.496775954",50709,"Rural First Nations Primary Reserve",24,13,"No","Yes","No","No ","?Esdilagh First Nation*","FALSE","FALSE"]
[null,8482,"100 Mile House","Yes","Cariboo Regional District","Cariboo",{"$nulls":7},"",{"$nulls":6},"","",null,"",null,null,"",null,"100 Mile House","N",{"v":51.639147,"d":"51.63915"},{"v":-121.294483,"d":"-121.29448"},"http://www.google.com/maps/place/51.639147,-121.294483",8482,"Rural",1979,937,"Yes","No","No","No ","100 Mile House","FALSE","FALSE"]
[null,8481,"103 Mile","Yes","Cariboo Regional District","Cariboo",{"$nulls":7},"",{"$nulls":6},"","",null,"",null,null,"",null,"103 Mile","N",{"v":51.688988,"d":"51.68899"},{"v":-121.313539,"d":"-121.31354"},"http://www.google.com/maps/place/51.688988,-121.313539",8481,"Rural",936,422,"Yes","No","No","No ","103 Mile","FALSE","FALSE"]
[null,8480,"105 Mile House","Yes","Cariboo Regional District","Cariboo",{"$nulls":7},"",{"$nulls":6},"","",null,"",null,null,"",null,"105 Mile House","N",{"v":51.706944,"d":"51.70694"},{"v":-121.331114,"d":"-121.33111"},"http://www.google.com/maps/place/51.706944,-121.331114",8480,"Rural",936,422,"Yes","No","No","No ","105 Mile House","FALSE","FALSE"]
[null,8479,"108 Mile Ranch","Yes","Cariboo Regional District","Cariboo",{"$nulls":7},"",{"$nulls":6},"","",null,"",null,null,"",null,"108 Mile Ranch","N",{"v":51.728096,"d":"51.72810"},{"v":-121.350512,"d":"-121.35051"},"http://www.google.com/maps/place/51.728096,-121.350512",8479,"Rural",2305,1057,"Yes","No","No","No ","108 Mile Ranch","FALSE","FALSE"]
[null,8477,"122 Mile House","No","Cariboo Regional District","Cariboo",{"$nulls":7},"",{"$nulls":6},"","",null,"",null,null,"",null,"122 Mile House","N",{"v":51.848347,"d":"51.84835"},{"v":-121.598813,"d":"-121.59881"},"http://www.google.com/maps/place/51.848347,-121.598813",8477,"Rural",245,188,"No","Yes","No","No ","122 Mile House","FALSE","FALSE"]
[null,8475,"141 Mile House","No","Cariboo Regional District","Cariboo",{"$nulls":7},"",{"$nulls":6},"","",null,"",null,null,"",null,"141 Mile House","N",{"v":51.994,"d":"51.99400"},{"v":-121.845635,"d":"-121.84564"},"http://www.google.com/maps/place/51.994,-121.845635",8475,"Rural",81,34,"No","Yes","No","No ","141 Mile House","FALSE","FALSE"]
[null,8458,"150 Mile House","No","Cariboo Regional District","Cariboo",{"$nulls":7},"",{"$nulls":6},"","",null,"",null,null,"",null,"150 Mile House","N",{"v":52.114653,"d":"52.11465"},{"v":-121.935482,"d":"-121.93548"},"http://www.google.com/maps/place/52.114653,-121.935482",8458,"Rural",438,191,"No","Yes","No","No ","150 Mile House","FALSE","FALSE"]
[null,8988,"40 Mile Flats","No","Regional District of Kitimat-Stikine","North Coast",{"$nulls":7},"",{"$nulls":6},"","",null,"",null,null,"",null,"40 Mile Flats","N",57.93631,{"v":-130.050057,"d":"-130.05006"},"http://www.google.com/maps/place/57.93631,-130.050057",8988,"Rural",30,27,"No","Yes","No","No ","40 Mile Flats","FALSE","FALSE"]
[null,8263,"70 Mile House","No","Thompson-Nicola Regional District","Thompson--Okanagan",{"$nulls":7},"",{"$nulls":6},"","",null,"",null,null,"",null,"70 Mile House","N",{"v":51.308437,"d":"51.30844"},{"v":-121.396005,"d":"-121.39601"},"http://www.google.com/maps/place/51.308437,-121.396005",8263,"Rural",56,40,"No","Yes","No","No ","70 Mile House","FALSE","FALSE"]
[null,8494,"93 Mile","No","Cariboo Regional District","Cariboo",{"$nulls":7},"",{"$nulls":6},"","",null,"",null,null,"",null,"93 Mile","N",{"v":51.574786,"d":"51.57479"},{"v":-121.340812,"d":"-121.34081"},"http://www.google.com/maps/place/51.574786,-121.340812",8494,"Rural",113,61,"No","Yes","No","No ","93 Mile","FALSE","FALSE"]
[null,8070,"Abbotsford","Yes","Fraser Valley Regional District","Lower Mainland--Southwest",{"$nulls":7},"",{"$nulls":6},"","",null,"",null,null,"",null,"Abbotsford","N",49.04775,{"v":-122.270317,"d":"-122.27032"},"http://www.google.com/maps/place/49.04775,-122.270317",8070,"Urban",23354,8415,"Yes","No","No","No ","Abbotsford","FALSE","FALSE"]
[null,8073,"Aberdeen","Yes","Fraser Valley Regional District","Lower Mainland--Southwest",{"$nulls":7},"",{"$nulls":6},"","",null,"",null,null,"",null,"Aberdeen","N",{"v":49.050298,"d":"49.05030"},{"v":-122.4112,"d":"-122.41120"},"http://www.google.com/maps/place/49.050298,-122.4112",8073,"Rural",13400,4700,"Yes","No","No","No ","Aberdeen","FALSE","FALSE"]
[null,8315,"Adams Lake*","Yes","Columbia-Shuswap Regional District","Thompson--Okanagan",{"$nulls":7},"",{"$nulls":6},"","",null,0,null,null,0,null,"Adams Lake","Y",{"v":50.736567,"d":"50.73657"},{"v":-119.320557,"d":"-119.32056"},"http://www.google.com/maps/place/50.736567,-119.320557",8315,"Rural First Nations Secondary Reserve",1613,803,"Yes","No","No","No ","Adams Lake*","FALSE","FALSE"]
[null,50684,"Adams Lake*","No","Thompson-Nicola Regional District","Thompson--Okanagan",{"$nulls":7},"",{"$nulls":6},"","",null,0,null,null,0,null,"Adams Lake","Y",{"v":50.828685489,"d":"50.82869"},{"v":-119.701465439,"d":"-119.70147"},"http://www.google.com/maps/place/50.828685489,-119.701465439",50684,"Rural First Nations Primary Reserve",2605,1302,"No","Yes","No","No ","Adams Lake*","FALSE","FALSE"]
[null,8050,"Agassiz","Yes","Fraser Valley Regional District","Lower Mainland--Southwest",{"$nulls":7},"",{"$nulls":6},"","",null,"",null,null,"",null,"Agassiz","N",{"v":49.2333,"d":"49.23330"},{"v":-121.7667,"d":"-121.76670"},"http://www.google.com/maps/place/49.2333,-121.7667",8050,"Rural",4557,1935,"Yes","No","No","No ","Agassiz","FALSE","FALSE"]
[null,50659,"Ahousaht*","No","Regional District of Alberni-Clayoquot","Vancouver Island and Coast",{"$nulls":7},"",{"$nulls":6},"","",null,0,null,null,0,null,"Ahousaht","Y",{"v":49.275433361,"d":"49.27543"},{"v":-126.057568756,"d":"-126.05757"},"http://www.google.com/maps/place/49.275433361,-126.057568756",50659,"Rural First Nations Secondary Reserve",607,192,"No","Yes","Yes","No ","Ahousaht*","FALSE","FALSE"]
[null,7956,"Ainsworth Hot Springs","No","Regional District of Central Kootenay","Kootenay",{"$nulls":7},"",{"$nulls":6},"","",null,"",null,null,"",null,"Ainsworth Hot Springs","N",{"v":49.734265,"d":"49.73427"},{"v":-116.912552,"d":"-116.91255"},"http://www.google.com/maps/place/49.734265,-116.912552",7956,"Rural",82,68,"No","No","Yes","No ","Ainsworth Hot Springs","FALSE","FALSE"]
[null,50558,"Aitchelitz*","Yes","Fraser Valley Regional District","Lower Mainland--Southwest",{"$nulls":7},"",{"$nulls":6},"","",null,0,null,null,0,null,"Aitchelitz","Y",{"v":49.150417311,"d":"49.15042"},{"v":-121.986896773,"d":"-121.98690"},"http://www.google.com/maps/place/49.150417311,-121.986896773",50558,"Rural First Nations Primary Reserve",27163,12788,"Yes","No","Yes","No ","Aitchelitz*","FALSE","FALSE"]
[null,8642,"Albert Head","Yes","Capital Regional District","Vancouver Island and Coast",{"$nulls":7},"",{"$nulls":6},"","",null,"",null,null,"",null,"Albert Head","N",48.39109,{"v":-123.503312,"d":"-123.50331"},"http://www.google.com/maps/place/48.39109,-123.503312",8642,"Urban",3484,1427,"Yes","No","No","No ","Albert Head","FALSE","FALSE"]
[null,8406,"Albreda","No","Regional District of Fraser-Fort George","Cariboo",{"$nulls":7},"",{"$nulls":6},"","",null,"",null,null,"",null,"Albreda","N",{"v":52.6375,"d":"52.63750"},{"v":-119.1625,"d":"-119.16250"},"http://www.google.com/maps/place/52.6375,-119.1625",8406,"Rural",3,3,"No","Yes","No","No ","Albreda","FALSE","FALSE"]
[null,8075,"Aldergrove","Yes","Metro Vancouver Regional District","Lower Mainland--Southwest",{"$nulls":7},"",{"$nulls":6},"","",null,"",null,null,"",null,"Aldergrove","N",{"v":49.057581,"d":"49.05758"},{"v":-122.470611,"d":"-122.47061"},"http://www.google.com/maps/place/49.057581,-122.470611",8075,"Rural",13400,4700,"Yes","No","No","No ","Aldergrove","FALSE","FALSE"]
[null,8556,"Alert Bay","No","Regional District of Mount Waddington","Vancouver Island and Coast",{"$nulls":7},"",{"$nulls":6},"","",null,"",null,null,"",null,"Alert Bay","N",{"v":50.578901,"d":"50.57890"},{"v":-126.919832,"d":"-126.91983"},"http://www.google.com/maps/place/50.578901,-126.919832",8556,"Rural",294,167,"No","Yes","No","No ","Alert Bay","FALSE","FALSE"]
[null,8509,"Alexis Creek","No","Cariboo Regional District","Cariboo",{"$nulls":7},"",{"$nulls":6},"","",null,"",null,null,"",null,"Alexis Creek","N",{"v":52.0833,"d":"52.08330"},{"v":-123.283301,"d":"-123.28330"},"http://www.google.com/maps/place/52.0833,-123.283301",8509,"Rural",68,42,"No","Yes","Yes","No ","Alexis Creek","FALSE","FALSE"]
[null,50710,"Alexis Creek*","No","Cariboo Regional District","Cariboo",{"$nulls":7},"",{"$nulls":6},"","",null,0,null,null,0,null,"Alexis Creek","Y",{"v":52.138577579,"d":"52.13858"},{"v":-123.952087706,"d":"-123.95209"},"http://www.google.com/maps/place/52.138577579,-123.952087706",50710,"Rural First Nations Primary Reserve",196,64,"No","Yes","Yes","No ","Alexis Creek*","FALSE","FALSE"]
[null,8419,"Aleza Lake","No","Regional District of Fraser-Fort George","Cariboo",{"$nulls":7},"",{"$nulls":6},"","",null,"",null,null,"",null,"Aleza Lake","N",54.11433,{"v":-122.033734,"d":"-122.03373"},"http://www.google.com/maps/place/54.11433,-122.033734",8419,"Rural",16,11,"No","Yes","No","No ","Aleza Lake","FALSE","FALSE"]
[null,8894,"Alice Arm","No","Regional District of Kitimat-Stikine","North Coast",{"$nulls":7},"",{"$nulls":6},"","",null,"",null,null,"",null,"Alice Arm","N",{"v":55.482822,"d":"55.48282"},{"v":-129.4899691,"d":"-129.48997"},"http://www.google.com/maps/place/55.482822,-129.4899691",8894,"Rural",0,0,"No","Yes","No","No ","Alice Arm","FALSE","FALSE"]
[null,50711,"Alkali Lake (Esk'etemc)*","Yes","Cariboo Regional District","Cariboo",{"$nulls":7},"",{"$nulls":6},"","",null,0,null,null,0,null,"Alkali Lake (Esk'etemc)","Y",{"v":51.788658832,"d":"51.78866"},{"v":-122.236447751,"d":"-122.23645"},"http://www.google.com/maps/place/51.788658832,-122.236447751",50711,"Rural First Nations Primary Reserve",321,120,"Yes","No","No","No ","Alkali Lake (Esk'etemc)*","FALSE","FALSE"]
[null,8279,"Allison Lake","No","Regional District of Okanagan-Similkameen","Thompson--Okanagan",{"$nulls":7},"",{"$nulls":6},"","",null,"",null,null,"",null,"Allison Lake","N",{"v":49.688901,"d":"49.68890"},{"v":-120.6014,"d":"-120.60140"},"http://www.google.com/maps/place/49.688901,-120.6014",8279,"Rural",124,130,"No","Yes","Yes","No ","Allison Lake","FALSE","FALSE"]
[null,8163,"Alpine Meadows","Yes","Squamish-Lillooet Regional District","Lower Mainland--Southwest",{"$nulls":7},"",{"$nulls":6},"","",null,"",null,null,"",null,"Alpine Meadows","N",{"v":50.149999,"d":"50.15000"},{"v":-122.9667,"d":"-122.96670"},"http://www.google.com/maps/place/50.149999,-122.9667",8163,"Rural",2057,1089,"Yes","No","No","No ","Alpine Meadows","FALSE","FALSE"]
[null,8952,"Altona","No","Peace River Regional District","Northeast",{"$nulls":7},"",{"$nulls":6},"","",null,"",null,null,"",null,"Altona","N",{"v":56.877525,"d":"56.87753"},{"v":-120.953724,"d":"-120.95372"},"http://www.google.com/maps/place/56.877525,-120.953724",8952,"Rural",103,25,"No","Yes","Yes","No ","Altona","FALSE","FALSE"]
[null,8521,"Anahim Lake","No","Cariboo Regional District","Cariboo",{"$nulls":7},"",{"$nulls":6},"","",null,"",null,null,"",null,"Anahim Lake","N",{"v":52.461372,"d":"52.46137"},{"v":-125.302967,"d":"-125.30297"},"http://www.google.com/maps/place/52.461372,-125.302967",8521,"Rural",359,203,"No","Yes","No","No ","Anahim Lake","FALSE","FALSE"]
[null,8493,"Anderson Subdivision","No","Cariboo Regional District","Cariboo",{"$nulls":7},"",{"$nulls":6},"","",null,"",null,null,"",null,"Anderson Subdivision","N",{"v":51.579537,"d":"51.57954"},{"v":-121.138201,"d":"-121.13820"},"http://www.google.com/maps/place/51.579537,-121.138201",8493,"Rural",577,319,"No","Yes","No","No ","Anderson Subdivision","FALSE","FALSE"]
[null,8360,"Anglemont","No","Columbia-Shuswap Regional District","Thompson--Okanagan",{"$nulls":7},"",{"$nulls":6},"","",null,"",null,null,"",null,"Anglemont","N",{"v":50.9667,"d":"50.96670"},{"v":-119.166701,"d":"-119.16670"},"http://www.google.com/maps/place/50.9667,-119.166701",8360,"Rural",463,568,"No","Yes","No","No ","Anglemont","FALSE","FALSE"]
[null,8112,"Anmore","Yes","Metro Vancouver Regional District","Lower Mainland--Southwest",{"$nulls":7},"",{"$nulls":6},"","",null,"",null,null,"",null,"Anmore","N",{"v":49.311547,"d":"49.31155"},{"v":-122.848839,"d":"-122.84884"},"http://www.google.com/maps/place/49.311547,-122.848839",8112,"Urban",2318,786,"Yes","No","No","No ","Anmore","FALSE","FALSE"]
[null,8309,"Annis","No","Columbia-Shuswap Regional District","Thompson--Okanagan",{"$nulls":7},"",{"$nulls":6},"","",null,"",null,null,"",null,"Annis","N",{"v":50.790686,"d":"50.79069"},{"v":-119.081785,"d":"-119.08179"},"http://www.google.com/maps/place/50.790686,-119.081785",8309,"Rural",38,69,"No","Yes","No","No ","Annis","FALSE","FALSE"]
[null,8905,"Anzac","No","Regional District of Fraser-Fort George","Cariboo",{"$nulls":7},"",{"$nulls":6},"","",null,"",null,null,"",null,"Anzac","N",{"v":54.7667,"d":"54.76670"},{"v":-122.499999,"d":"-122.50000"},"http://www.google.com/maps/place/54.7667,-122.499999",8905,"Rural",0,0,"No","Yes","No","No ","Anzac","FALSE","FALSE"]
[null,8000,"Apex Mountain","No","Regional District of Okanagan-Similkameen","Thompson--Okanagan",{"$nulls":7},"",{"$nulls":6},"","",null,"",null,null,"",null,"Apex Mountain","N",49.39418,{"v":-119.907218,"d":"-119.90722"},"http://www.google.com/maps/place/49.39418,-119.907218",8000,"Rural",102,507,"No","Yes","No","No ","Apex Mountain","FALSE","FALSE"]
[null,100119,"Appledale","No","Regional District of Central Kootenay","Kootenay",{"$nulls":7},"",{"$nulls":6},"","",null,"",null,null,"",null,"Appledale","N",{"v":49.65,"d":"49.65000"},-117.53333,"http://www.google.com/maps/place/49.65,-117.53333",100119,"Rural",435,218,"No","Yes","No","No ","Appledale","FALSE","FALSE"]
[null,8666,"Arbutus Ridge","Yes","Cowichan Valley Regional District","Vancouver Island and Coast",{"$nulls":7},"",{"$nulls":6},"","",null,"",null,null,"",null,"Arbutus Ridge","N",{"v":48.693312,"d":"48.69331"},-123.54009,"http://www.google.com/maps/place/48.693312,-123.54009",8666,"Rural",2161,1091,"Yes","No","No","No ","Arbutus Ridge","FALSE","FALSE"]
[null,8658,"Ardmore","Yes","Capital Regional District","Vancouver Island and Coast",{"$nulls":7},"",{"$nulls":6},"","",null,"",null,null,"",null,"Ardmore","N",{"v":48.6389,"d":"48.63890"},{"v":-123.466701,"d":"-123.46670"},"http://www.google.com/maps/place/48.6389,-123.466701",8658,"Urban",2946,1364,"Yes","No","No","No ","Ardmore","FALSE","FALSE"]
[null,9029,"Argenta","No","Regional District of Central Kootenay","Kootenay",{"$nulls":7},"",{"$nulls":6},"","",null,"",null,null,"",null,"Argenta","N",{"v":50.166699,"d":"50.16670"},{"v":-116.916701,"d":"-116.91670"},"http://www.google.com/maps/place/50.166699,-116.916701",9029,"Rural",78,78,"No","Yes","No","No ","Argenta","FALSE","FALSE"]
[null,8294,"Armstrong","Yes","Regional District of North Okanagan","Thompson--Okanagan",{"$nulls":7},"",{"$nulls":6},"","",null,"",null,null,"",null,"Armstrong","N",{"v":50.446115,"d":"50.44612"},{"v":-119.199171,"d":"-119.19917"},"http://www.google.com/maps/place/50.446115,-119.199171",8294,"Rural",5907,2464,"Yes","No","No","No ","Armstrong","FALSE","FALSE"]
[null,8916,"Arras","No","Peace River Regional District","Northeast",{"$nulls":7},"",{"$nulls":6},"","",null,"",null,null,"",null,"Arras","N",{"v":55.753519,"d":"55.75352"},{"v":-120.525783,"d":"-120.52578"},"http://www.google.com/maps/place/55.753519,-120.525783",8916,"Rural",199,71,"No","Yes","No","No ","Arras","FALSE","FALSE"]
[null,100111,"Arrow Creek","Yes","Regional District of Central Kootenay","Kootenay",{"$nulls":7},"",{"$nulls":6},"","",null,"",null,null,"",null,"Arrow Creek","N",{"v":49.133333,"d":"49.13333"},{"v":-116.45,"d":"-116.45000"},"http://www.google.com/maps/place/49.133333,-116.45",100111,"Rural",536,249,"Yes","No","No","No ","Arrow Creek","FALSE","FALSE"]
[null,8266,"Ashcroft","No","Thompson-Nicola Regional District","Thompson--Okanagan",{"$nulls":7},"",{"$nulls":6},"","",null,"",null,null,"",null,"Ashcroft","N",{"v":50.721109,"d":"50.72111"},{"v":-121.280668,"d":"-121.28067"},"http://www.google.com/maps/place/50.721109,-121.280668",8266,"Rural",1302,669,"No","Yes","No","No ","Ashcroft","FALSE","FALSE"]
[null,50685,"Ashcroft*","No","Thompson-Nicola Regional District","Thompson--Okanagan",{"$nulls":7},"",{"$nulls":6},"","",null,0,null,null,0,null,"Ashcroft","Y",{"v":50.720386885,"d":"50.72039"},{"v":-121.322474811,"d":"-121.32247"},"http://www.google.com/maps/place/50.720386885,-121.322474811",50685,"Rural First Nations Primary Reserve",1302,669,"No","Yes","No","No ","Ashcroft*","FALSE","FALSE"]
[null,100152,"Ashnola / Riverside*","No","Regional District of Okanagan-Similkameen","Thompson--Okanagan",{"$nulls":7},"",{"$nulls":6},"","",null,0,null,null,0,null,"Ashnola / Riverside","Y",49.22308,{"v":-119.970223,"d":"-119.97022"},"http://www.google.com/maps/place/49.22308,-119.970223",100152,"Rural First Nations Secondary Reserve",100,41,"No","Yes","No","No ","Ashnola / Riverside*","FALSE","FALSE"]
[null,8300,"Ashton Creek","Yes","Regional District of North Okanagan","Thompson--Okanagan",{"$nulls":7},"",{"$nulls":6},"","",null,"",null,null,"",null,"Ashton Creek","N",{"v":50.555993,"d":"50.55599"},{"v":-119.012635,"d":"-119.01264"},"http://www.google.com/maps/place/50.555993,-119.012635",8300,"Rural",164,68,"Yes","No","No","No ","Ashton Creek","FALSE","FALSE"]
[null,100359,"Aspen Grove","No","Thompson-Nicola Regional District","Thompson--Okanagan",{"$nulls":7},"",{"$nulls":6},"","",null,"",null,null,"",null,"Aspen Grove","N",{"v":49.93842778,"d":"49.93843"},{"v":-120.62920278,"d":"-120.62920"},"http://www.google.com/maps/place/49.93842778,-120.62920278",100359,"Rural",6,5,"No","Yes","No","No ","Aspen Grove","FALSE","FALSE"]
[null,8996,"Atlin","No","Stikine Regional District (Unincorporated)","Nechako",{"$nulls":7},"",{"$nulls":6},"","",null,"",null,null,"",null,"Atlin","N",{"v":59.567863,"d":"59.56786"},{"v":-133.696706,"d":"-133.69671"},"http://www.google.com/maps/place/59.567863,-133.696706",8996,"Rural",225,247,"No","Yes","No","No ","Atlin","FALSE","FALSE"]
[null,8925,"Attachie","No","Peace River Regional District","Northeast",{"$nulls":7},"",{"$nulls":6},"","",null,"",null,null,"",null,"Attachie","N",{"v":56.220478,"d":"56.22048"},{"v":-121.423331,"d":"-121.42333"},"http://www.google.com/maps/place/56.220478,-121.423331",8925,"Rural",5,2,"No","Yes","No","No ","Attachie","FALSE","FALSE"]
[null,8401,"Avola","No","Thompson-Nicola Regional District","Thompson--Okanagan",{"$nulls":7},"",{"$nulls":6},"","",null,"",null,null,"",null,"Avola","N",{"v":51.781182,"d":"51.78118"},-119.32323,"http://www.google.com/maps/place/51.781182,-119.32323",8401,"Rural",56,45,"No","Yes","No","No ","Avola","FALSE","FALSE"]
[null,9059,"Baker Creek","No","Cariboo Regional District","Cariboo",{"$nulls":7},"",{"$nulls":6},"","",null,"",null,null,"",null,"Baker Creek","N",{"v":52.927449,"d":"52.92745"},{"v":-123.017374,"d":"-123.01737"},"http://www.google.com/maps/place/52.927449,-123.017374",9059,"Rural",31,18,"No","Yes","Yes","No ","Baker Creek","FALSE","FALSE"]
[null,8101,"Baker Trails","No","Fraser Valley Regional District","Lower Mainland--Southwest",{"$nulls":7},"",{"$nulls":6},"","",null,"",null,null,"",null,"Baker Trails","N",{"v":49.085388,"d":"49.08539"},-121.92677,"http://www.google.com/maps/place/49.085388,-121.92677",8101,"Rural",752,326,"No","No","No","No ","Baker Trails","FALSE","FALSE"]
[null,8531,"Baldy Hughes","No","Regional District of Fraser-Fort George","Cariboo",{"$nulls":7},"",{"$nulls":6},"","",null,"",null,null,"",null,"Baldy Hughes","N",{"v":53.624596,"d":"53.62460"},-122.93323,"http://www.google.com/maps/place/53.624596,-122.93323",8531,"Rural",17,6,"No","Yes","No","No ","Baldy Hughes","FALSE","FALSE"]
[null,7950,"Balfour","Yes","Regional District of Central Kootenay","Kootenay",{"$nulls":7},"",{"$nulls":6},"","",null,"",null,null,"",null,"Balfour","N",{"v":49.628334,"d":"49.62833"},{"v":-116.971805,"d":"-116.97181"},"http://www.google.com/maps/place/49.628334,-116.971805",7950,"Rural",892,611,"Yes","No","No","No ","Balfour","FALSE","FALSE"]
[null,8355,"Balmoral","Yes","Columbia-Shuswap Regional District","Thompson--Okanagan",{"$nulls":7},"",{"$nulls":6},"","",null,"",null,null,"",null,"Balmoral","N",{"v":50.853118,"d":"50.85312"},{"v":-119.354588,"d":"-119.35459"},"http://www.google.com/maps/place/50.853118,-119.354588",8355,"Rural",1297,694,"Yes","No","Yes","No ","Balmoral","FALSE","FALSE"]
[null,8603,"Bamfield","No","Regional District of Alberni-Clayoquot","Vancouver Island and Coast",{"$nulls":7},"",{"$nulls":6},"","",null,"",null,null,"",null,"Bamfield","N",{"v":48.831223,"d":"48.83122"},{"v":-125.132582,"d":"-125.13258"},"http://www.google.com/maps/place/48.831223,-125.132582",8603,"Rural",177,218,"No","Yes","No","No ","Bamfield","FALSE","FALSE"]
[null,8280,"Bankeir","No","Regional District of Okanagan-Similkameen","Thompson--Okanagan",{"$nulls":7},"",{"$nulls":6},"","",null,"",null,null,"",null,"Bankeir","N",{"v":49.710727,"d":"49.71073"},{"v":-120.224912,"d":"-120.22491"},"http://www.google.com/maps/place/49.710727,-120.224912",8280,"Rural",162,226,"No","Yes","No","No ","Bankeir","FALSE","FALSE"]
[null,8438,"Barlow Creek","Yes","Cariboo Regional District","Cariboo",{"$nulls":7},"",{"$nulls":6},"","",null,"",null,null,"",null,"Barlow Creek","N",{"v":53.023013,"d":"53.02301"},{"v":-122.445283,"d":"-122.44528"},"http://www.google.com/maps/place/53.023013,-122.445283",8438,"Rural",2347,981,"Yes","No","No","No ","Barlow Creek","FALSE","FALSE"]
[null,8200,{"$f":"HYPERLINK(AG97,AP97)","v":"Barney's Bar"},"Yes","qathet Regional District","Vancouver Island and Coast",{"$nulls":7},{"$f":"IF(COUNT(V97)=0, \"\", IF(V97>=0,\"Sufficient Capacity\", IF(V97<0,\"Not Enough Capacity\")))","v":""},{"$nulls":6},{"$f":"IF(OR(ISBLANK(H97),ISBLANK(I97),ISBLANK(J97)), \"\",(H97*I97/J97))","v":""},{"$f":"IF(AND(COUNT(L97,U97)=2, OR($M$10=\"Last-Mile\", $M$10=\"Transport & Last-Mile\")), L97-U97, \"\")","v":""},null,{"$f":"IF(AD97=\"Y\",COUNT(H97), \"\")","v":""},null,null,{"$f":"IF(AD97=\"Y\",COUNT(P97), \"\")","v":""},null,"Barney's Bar","N",{"v":49.784503,"d":"49.78450"},{"v":-124.444137,"d":"-124.44414"},"http://www.google.com/maps/place/49.784503,-124.444137",8200,"Rural",943,472,"Yes","No","Yes","No ",{"$f":"IF(AD97=\"Y\", CONCATENATE(AC97,\"*\"), AC97)","v":"Barney's Bar"},{"$f":"IF(G97=\"Last-Mile\",\"TRUE\",IF(G97=\"Transport & Last-Mile\",\"TRUE\",\"FALSE\"))","v":"FALSE"},{"$f":"IF(G97=\"Transport\",\"TRUE\",IF(G97=\"Transport & Last-Mile\",\"TRUE\",\"FALSE\"))","v":"FALSE"}]
[null,8371,"Barnhartvale","Yes","Thompson-Nicola Regional District","Thompson--Okanagan",{"$nulls":7},"",{"$nulls":6},"","",null,"",null,null,"",null,"Barnhartvale","N",{"v":50.650535,"d":"50.65054"},{"v":-120.170485,"d":"-120.17049"},"http://www.google.com/maps/place/50.650535,-120.170485",8371,"Rural",5591,2162,"Yes","No","Yes","No ","Barnhartvale","FALSE","FALSE"]
[null,8843,"Barrett Lake","No","Bulkley Nechako Regional District","Nechako",{"$nulls":7},"",{"$nulls":6},"","",null,"",null,null,"",null,"Barrett Lake","N",{"v":54.45,"d":"54.45000"},{"v":-126.750001,"d":"-126.75000"},"http://www.google.com/maps/place/54.45,-126.750001",8843,"Rural",47,17,"No","Yes","No","No ","Barrett Lake","FALSE","FALSE"]
[null,8392,"Barriere","No","Thompson-Nicola Regional District","Thompson--Okanagan",{"$nulls":7},"",{"$nulls":6},"","",null,"",null,null,"",null,"Barriere","N",51.18191,-120.13341,"http://www.google.com/maps/place/51.18191,-120.13341",8392,"Rural",928,438,"No","Yes","Yes","No ","Barriere","FALSE","FALSE"]
[null,7928,"Baynes Lake","No","Regional District of East Kootenay","Kootenay",{"$nulls":7},"",{"$nulls":6},"","",null,"",null,null,"",null,"Baynes Lake","N",{"v":49.2333,"d":"49.23330"},{"v":-115.2167,"d":"-115.21670"},"http://www.google.com/maps/place/49.2333,-115.2167",7928,"Rural",142,84,"No","Yes","No","No ","Baynes Lake","FALSE","FALSE"]
[null,8995,"Bear Camp","No","Stikine Regional District (Unincorporated)","Nechako",{"$nulls":7},"",{"$nulls":6},"","",null,"",null,null,"",null,"Bear Camp","N",{"v":59.9167,"d":"59.91670"},{"v":-136.799999,"d":"-136.80000"},"http://www.google.com/maps/place/59.9167,-136.799999",8995,"Rural",3,5,"No","Yes","No","No ","Bear Camp","FALSE","FALSE"]
[null,8223,"Bear Creek","No","Fraser Valley Regional District","Lower Mainland--Southwest",{"$nulls":7},"",{"$nulls":6},"","",null,"",null,null,"",null,"Bear Creek","N",49.52898,{"v":-121.761295,"d":"-121.76130"},"http://www.google.com/maps/place/49.52898,-121.761295",8223,"Rural",1,5,"No","Yes","No","No ","Bear Creek","FALSE","FALSE"]
[null,8926,"Bear Flat","No","Peace River Regional District","Northeast",{"$nulls":7},"",{"$nulls":6},"","",null,"",null,null,"",null,"Bear Flat","N",{"v":56.274046,"d":"56.27405"},{"v":-121.230744,"d":"-121.23074"},"http://www.google.com/maps/place/56.274046,-121.230744",8926,"Rural",3,1,"No","Yes","No","No ","Bear Flat","FALSE","FALSE"]
[null,8429,"Bear Lake","No","Regional District of Fraser-Fort George","Cariboo",{"$nulls":7},"",{"$nulls":6},"","",null,"",null,null,"",null,"Bear Lake","N",{"v":54.495906,"d":"54.49591"},-122.67922,"http://www.google.com/maps/place/54.495906,-122.67922",8429,"Rural",null,null,"No","No","Yes","No ","Bear Lake","FALSE","FALSE"]
[null,8904,"Bear Lake","No","Stikine Regional District (Unincorporated)","Nechako",{"$nulls":7},"",{"$nulls":6},"","",null,"",null,null,"",null,"Bear Lake","N",{"v":56.2,"d":"56.20000"},{"v":-126.85,"d":"-126.85000"},"http://www.google.com/maps/place/56.2,-126.85",8904,"Rural",157,98,"No","Yes","No","No ","Bear Lake","FALSE","FALSE"]
[null,8346,"Beaton","No","Columbia-Shuswap Regional District","Thompson--Okanagan",{"$nulls":7},"",{"$nulls":6},"","",null,"",null,null,"",null,"Beaton","N",{"v":50.733301,"d":"50.73330"},{"v":-117.7333,"d":"-117.73330"},"http://www.google.com/maps/place/50.733301,-117.7333",8346,"Rural",6,20,"No","Yes","No","No ","Beaton","FALSE","FALSE"]
[null,8963,"Beatton Ranch","No","Peace River Regional District","Northeast",{"$nulls":7},"",{"$nulls":6},"","",null,"",null,null,"",null,"Beatton Ranch","N",{"v":56.733301,"d":"56.73330"},{"v":-122.5833,"d":"-122.58330"},"http://www.google.com/maps/place/56.733301,-122.5833",8963,"Rural",2,1,"No","Yes","No","No ","Beatton Ranch","FALSE","FALSE"]
[null,8142,"Beaverdell","No","Regional District of Kootenay Boundary","Kootenay",{"$nulls":7},"",{"$nulls":6},"","",null,"",null,null,"",null,"Beaverdell","N",49.43681,{"v":-119.088964,"d":"-119.08896"},"http://www.google.com/maps/place/49.43681,-119.088964",8142,"Rural",157,106,"No","Yes","No","No ","Beaverdell","FALSE","FALSE"]
[null,8835,"Beaverley","Yes","Regional District of Fraser-Fort George","Cariboo",{"$nulls":7},"",{"$nulls":6},"","",null,"",null,null,"",null,"Beaverley","N",{"v":53.817244,"d":"53.81724"},{"v":-122.881338,"d":"-122.88134"},"http://www.google.com/maps/place/53.817244,-122.881338",8835,"Urban",837,309,"Yes","No","No","No ","Beaverley","FALSE","FALSE"]
[null,50640,"Beecher Bay*","Yes","Capital Regional District","Vancouver Island and Coast",{"$nulls":7},"",{"$nulls":6},"","",null,0,null,null,0,null,"Beecher Bay","Y",{"v":48.337563767,"d":"48.33756"},{"v":-123.608301999,"d":"-123.60830"},"http://www.google.com/maps/place/48.337563767,-123.608301999",50640,"Rural First Nations Primary Reserve",1348,563,"Yes","No","Yes","No ","Beecher Bay*","FALSE","FALSE"]
[null,8108,"Belcarra","Yes","Metro Vancouver Regional District","Lower Mainland--Southwest",{"$nulls":7},"",{"$nulls":6},"","",null,"",null,null,"",null,"Belcarra","N",{"v":49.318236,"d":"49.31824"},{"v":-122.928169,"d":"-122.92817"},"http://www.google.com/maps/place/49.318236,-122.928169",8108,"Rural",7963,3263,"Yes","No","No","No ","Belcarra","FALSE","FALSE"]
[null,8102,"Bell Acres","No","Fraser Valley Regional District","Lower Mainland--Southwest",{"$nulls":7},"",{"$nulls":6},"","",null,"",null,null,"",null,"Bell Acres","N",{"v":49.078048,"d":"49.07805"},{"v":-121.866156,"d":"-121.86616"},"http://www.google.com/maps/place/49.078048,-121.866156",8102,"Rural",1137,565,"No","No","No","No ","Bell Acres","FALSE","FALSE"]
[null,8898,"Bell II","No","Regional District of Kitimat-Stikine","North Coast",{"$nulls":7},"",{"$nulls":6},"","",null,"",null,null,"",null,"Bell II","N",{"v":56.744444,"d":"56.74444"},{"v":-129.794443,"d":"-129.79444"},"http://www.google.com/maps/place/56.744444,-129.794443",8898,"Rural",null,null,"No","No","No","No ","Bell II","FALSE","FALSE"]
[null,50538,"Bella Bella (Heiltsuk)*","No","Central Coast Regional District","Vancouver Island and Coast",{"$nulls":7},"",{"$nulls":6},"","",null,0,null,null,0,null,"Bella Bella (Heiltsuk)","Y",{"v":52.169770157,"d":"52.16977"},{"v":-128.144901014,"d":"-128.14490"},"http://www.google.com/maps/place/52.169770157,-128.144901014",50538,"Rural First Nations Primary Reserve",944,436,"No","Yes","No","No ","Bella Bella (Heiltsuk)*","FALSE","FALSE"]
[null,8524,"Bella Coola*","No","Central Coast Regional District","Vancouver Island and Coast",{"$nulls":7},"",{"$nulls":6},"","",null,0,null,null,0,null,"Bella Coola","Y",{"v":52.370575,"d":"52.37058"},{"v":-126.751771,"d":"-126.75177"},"http://www.google.com/maps/place/52.370575,-126.751771",8524,"Rural First Nations Primary Reserve",945,372,"No","Yes","No","No ","Bella Coola*","FALSE","FALSE"]
[null,8999,"Bennett","No","Stikine Regional District (Unincorporated)","Nechako",{"$nulls":7},"",{"$nulls":6},"","",null,"",null,null,"",null,"Bennett","N",{"v":59.845115,"d":"59.84512"},{"v":-134.986935,"d":"-134.98694"},"http://www.google.com/maps/place/59.845115,-134.986935",8999,"Rural",3,5,"No","Yes","No","No ","Bennett","FALSE","FALSE"]
[null,8942,"Bessborough","No","Peace River Regional District","Northeast",{"$nulls":7},"",{"$nulls":6},"","",null,"",null,null,"",null,"Bessborough","N",{"v":55.810857,"d":"55.81086"},{"v":-120.506356,"d":"-120.50636"},"http://www.google.com/maps/place/55.810857,-120.506356",8942,"Rural",37,17,"No","Yes","No","No ","Bessborough","FALSE","FALSE"]
[null,8505,"Big Bar Creek","No","Thompson-Nicola Regional District","Thompson--Okanagan",{"$nulls":7},"",{"$nulls":6},"","",null,"",null,null,"",null,"Big Bar Creek","N",{"v":51.182919,"d":"51.18292"},{"v":-122.117024,"d":"-122.11702"},"http://www.google.com/maps/place/51.182919,-122.117024",8505,"Rural",5,6,"No","Yes","No","No ","Big Bar Creek","FALSE","FALSE"]
[null,8761,"Big Bay","No","Strathcona Regional District","Vancouver Island and Coast",{"$nulls":7},"",{"$nulls":6},"","",null,"",null,null,"",null,"Big Bay","N",{"v":50.397215,"d":"50.39722"},{"v":-125.135258,"d":"-125.13526"},"http://www.google.com/maps/place/50.397215,-125.135258",8761,"Rural",6,20,"No","Yes","Yes","No ","Big Bay","FALSE","FALSE"]
[null,8511,"Big Creek","No","Cariboo Regional District","Cariboo",{"$nulls":7},"",{"$nulls":6},"","",null,"",null,null,"",null,"Big Creek","N",51.71881,{"v":-123.037621,"d":"-123.03762"},"http://www.google.com/maps/place/51.71881,-123.037621",8511,"Rural",25,16,"No","Yes","No","No ","Big Creek","FALSE","FALSE"]
[null,8449,"Big Lake Ranch","No","Cariboo Regional District","Cariboo",{"$nulls":7},"",{"$nulls":6},"","",null,"",null,null,"",null,"Big Lake Ranch","N",{"v":52.404901,"d":"52.40490"},{"v":-121.876238,"d":"-121.87624"},"http://www.google.com/maps/place/52.404901,-121.876238",8449,"Rural",61,33,"No","Yes","No","No ","Big Lake Ranch","FALSE","FALSE"]
[null,8155,"Big White","Yes","Regional District of Kootenay Boundary","Kootenay",{"$nulls":7},"",{"$nulls":6},"","",null,"",null,null,"",null,"Big White","N",{"v":49.721424,"d":"49.72142"},{"v":-118.940367,"d":"-118.94037"},"http://www.google.com/maps/place/49.721424,-118.940367",8155,"Rural",251,1880,"Yes","No","No","No ","Big White","FALSE","FALSE"]
[null,8399,"Birch Island","No","Thompson-Nicola Regional District","Thompson--Okanagan",{"$nulls":7},"",{"$nulls":6},"","",null,"",null,null,"",null,"Birch Island","N",{"v":51.597084,"d":"51.59708"},{"v":-119.910417,"d":"-119.91042"},"http://www.google.com/maps/place/51.597084,-119.910417",8399,"Rural",31,13,"No","Yes","Yes","No ","Birch Island","FALSE","FALSE"]
[null,9033,"Birchdale","Yes","Regional District of Central Kootenay","Kootenay",{"$nulls":7},"",{"$nulls":6},"","",null,"",null,null,"",null,"Birchdale","N",{"v":50.034395,"d":"50.03440"},{"v":-116.873517,"d":"-116.87352"},"http://www.google.com/maps/place/50.034395,-116.873517",9033,"Rural",33,39,"Yes","No","No","No ","Birchdale","FALSE","FALSE"]
[null,8168,"Birken","No","Squamish-Lillooet Regional District","Lower Mainland--Southwest",{"$nulls":7},"",{"$nulls":6},"","",null,"",null,null,"",null,"Birken","N",{"v":50.4833,"d":"50.48330"},{"v":-122.6167,"d":"-122.61670"},"http://www.google.com/maps/place/50.4833,-122.6167",8168,"Rural",74,37,"No","Yes","Yes","No ","Birken","FALSE","FALSE"]
[null,8468,"Black Creek","No","Cariboo Regional District","Cariboo",{"$nulls":7},"",{"$nulls":6},"","",null,"",null,null,"",null,"Black Creek","N",{"v":52.298115,"d":"52.29812"},{"v":-121.093121,"d":"-121.09312"},"http://www.google.com/maps/place/52.298115,-121.093121",8468,"Rural",4,4,"No","Yes","No","No ","Black Creek","FALSE","FALSE"]
[null,8748,"Black Creek","No","Comox Valley Regional District","Vancouver Island and Coast",{"$nulls":7},"",{"$nulls":6},"","",null,"",null,null,"",null,"Black Creek","N",{"v":49.836867,"d":"49.83687"},{"v":-125.132113,"d":"-125.13211"},"http://www.google.com/maps/place/49.836867,-125.132113",8748,"Rural",944,409,"No","No","Yes","No ","Black Creek","FALSE","FALSE"]
[null,8387,"Black Pines","No","Thompson-Nicola Regional District","Thompson--Okanagan",{"$nulls":7},"",{"$nulls":6},"","",null,"",null,null,"",null,"Black Pines","N",{"v":50.933875,"d":"50.93388"},{"v":-120.258378,"d":"-120.25838"},"http://www.google.com/maps/place/50.933875,-120.258378",8387,"Rural",131,53,"No","Yes","No","No ","Black Pines","FALSE","FALSE"]
[null,8202,"Black Point","Yes","qathet Regional District","Vancouver Island and Coast",{"$nulls":7},"",{"$nulls":6},"","",null,"",null,null,"",null,"Black Point","N",{"v":49.773964,"d":"49.77396"},{"v":-124.394159,"d":"-124.39416"},"http://www.google.com/maps/place/49.773964,-124.394159",8202,"Rural",1213,645,"Yes","No","No","No ","Black Point","FALSE","FALSE"]
[null,8398,"Blackpool","No","Thompson-Nicola Regional District","Thompson--Okanagan",{"$nulls":7},"",{"$nulls":6},"","",null,"",null,null,"",null,"Blackpool","N",{"v":51.596903,"d":"51.59690"},{"v":-120.119771,"d":"-120.11977"},"http://www.google.com/maps/place/51.596903,-120.119771",8398,"Rural",517,323,"No","Yes","Yes","No ","Blackpool","FALSE","FALSE"]
[null,8529,"Blackwater","No","Cariboo Regional District","Cariboo",{"$nulls":7},"",{"$nulls":6},"","",null,"",null,null,"",null,"Blackwater","N",{"v":53.287529,"d":"53.28753"},{"v":-123.151307,"d":"-123.15131"},"http://www.google.com/maps/place/53.287529,-123.151307",8529,"Rural",11,6,"No","Yes","No","No ","Blackwater","FALSE","FALSE"]
[null,8333,"Blaeberry","No","Columbia-Shuswap Regional District","Thompson--Okanagan",{"$nulls":7},"",{"$nulls":6},"","",null,"",null,null,"",null,"Blaeberry","N",{"v":51.433301,"d":"51.43330"},{"v":-117.0667,"d":"-117.06670"},"http://www.google.com/maps/place/51.433301,-117.0667",8333,"Rural",83,45,"No","Yes","No","No ","Blaeberry","FALSE","FALSE"]
[null,8327,"Blind Bay","Yes","Columbia-Shuswap Regional District","Thompson--Okanagan",{"$nulls":7},"",{"$nulls":6},"","",null,"",null,null,"",null,"Blind Bay","N",{"v":50.8833,"d":"50.88330"},{"v":-119.383301,"d":"-119.38330"},"http://www.google.com/maps/place/50.8833,-119.383301",8327,"Rural",1855,1047,"Yes","No","No","No ","Blind Bay","FALSE","FALSE"]
[null,8769,"Blind Channel","No","Strathcona Regional District","Vancouver Island and Coast",{"$nulls":7},"",{"$nulls":6},"","",null,"",null,null,"",null,"Blind Channel","N",{"v":50.4167,"d":"50.41670"},{"v":-125.499999,"d":"-125.50000"},"http://www.google.com/maps/place/50.4167,-125.499999",8769,"Rural",12,23,"No","Yes","Yes","No ","Blind Channel","FALSE","FALSE"]
[null,8758,"Bliss Landing","No","qathet Regional District","Vancouver Island and Coast",{"$nulls":7},"",{"$nulls":6},"","",null,"",null,null,"",null,"Bliss Landing","N",{"v":50.036566,"d":"50.03657"},{"v":-124.816336,"d":"-124.81634"},"http://www.google.com/maps/place/50.036566,-124.816336",8758,"Rural",76,201,"No","Yes","Yes","No ","Bliss Landing","FALSE","FALSE"]
[null,8766,"Bloedel","No","Strathcona Regional District","Vancouver Island and Coast",{"$nulls":7},"",{"$nulls":6},"","",null,"",null,null,"",null,"Bloedel","N",{"v":50.116699,"d":"50.11670"},{"v":-125.383299,"d":"-125.38330"},"http://www.google.com/maps/place/50.116699,-125.383299",8766,"Rural",10,5,"No","Yes","Yes","No ","Bloedel","FALSE","FALSE"]
[null,8581,"Blowhole","No","Strathcona Regional District","Vancouver Island and Coast",{"$nulls":7},"",{"$nulls":6},"","",null,"",null,null,"",null,"Blowhole","N",{"v":49.8292,"d":"49.82920"},{"v":-126.6764,"d":"-126.67640"},"http://www.google.com/maps/place/49.8292,-126.6764",8581,"Rural",4,3,"No","Yes","Yes","No ","Blowhole","FALSE","FALSE"]
[null,8402,"Blue River","No","Thompson-Nicola Regional District","Thompson--Okanagan",{"$nulls":7},"",{"$nulls":6},"","",null,"",null,null,"",null,"Blue River","N",{"v":52.106146,"d":"52.10615"},{"v":-119.305862,"d":"-119.30586"},"http://www.google.com/maps/place/52.106146,-119.305862",8402,"Rural",159,162,"No","Yes","No","No ","Blue River","FALSE","FALSE"]
[null,8151,"Blue Springs","No","Regional District of North Okanagan","Thompson--Okanagan",{"$nulls":7},"",{"$nulls":6},"","",null,"",null,null,"",null,"Blue Springs","N",{"v":50.249999,"d":"50.25000"},{"v":-118.850001,"d":"-118.85000"},"http://www.google.com/maps/place/50.249999,-118.850001",8151,"Rural",68,30,"No","Yes","No","No ","Blue Springs","FALSE","FALSE"]
[null,7971,"Blueberry Creek","Yes","Regional District of Central Kootenay","Kootenay",{"$nulls":7},"",{"$nulls":6},"","",null,"",null,null,"",null,"Blueberry Creek","N",{"v":49.246007,"d":"49.24601"},{"v":-117.658675,"d":"-117.65868"},"http://www.google.com/maps/place/49.246007,-117.658675",7971,"Rural",1530,680,"Yes","No","Yes","No ","Blueberry Creek","FALSE","FALSE"]
[null,50547,"Blueberry River First Nations*","No","Peace River Regional District","Northeast",{"$nulls":7},"",{"$nulls":6},"","",null,0,null,null,0,null,"Blueberry River First Nations","Y",{"v":56.704040799,"d":"56.70404"},{"v":-121.112413197,"d":"-121.11241"},"http://www.google.com/maps/place/56.704040799,-121.112413197",50547,"Rural First Nations Primary Reserve",29,11,"No","Yes","No","No ","Blueberry River First Nations*","FALSE","FALSE"]
[null,8587,"Boat Basin","No","Regional District of Alberni-Clayoquot","Vancouver Island and Coast",{"$nulls":7},"",{"$nulls":6},"","",null,"",null,null,"",null,"Boat Basin","N",{"v":49.4792,"d":"49.47920"},{"v":-126.425001,"d":"-126.42500"},"http://www.google.com/maps/place/49.4792,-126.425001",8587,"Rural",5,3,"No","Yes","Yes","No ","Boat Basin","FALSE","FALSE"]
[null,8897,"Bob Quinn Lake","No","Regional District of Kitimat-Stikine","North Coast",{"$nulls":7},"",{"$nulls":6},"","",null,"",null,null,"",null,"Bob Quinn Lake","N",{"v":56.9722,"d":"56.97220"},{"v":-130.2472,"d":"-130.24720"},"http://www.google.com/maps/place/56.9722,-130.2472",8897,"Remote Community",2,1,"No","Yes","Yes","No ","Bob Quinn Lake","FALSE","FALSE"]
[null,8763,"Bold Point","No","Strathcona Regional District","Vancouver Island and Coast",{"$nulls":7},"",{"$nulls":6},"","",null,"",null,null,"",null,"Bold Point","N",{"v":50.172061,"d":"50.17206"},{"v":-125.160964,"d":"-125.16096"},"http://www.google.com/maps/place/50.172061,-125.160964",8763,"Rural",43,24,"No","Yes","No","No ","Bold Point","FALSE","FALSE"]
[null,50686,"Bonaparte*","No","Thompson-Nicola Regional District","Thompson--Okanagan",{"$nulls":7},"",{"$nulls":6},"","",null,0,null,null,0,null,"Bonaparte","Y",{"v":50.842151949,"d":"50.84215"},{"v":-121.385288531,"d":"-121.38529"},"http://www.google.com/maps/place/50.842151949,-121.385288531",50686,"Rural First Nations Primary Reserve",127,54,"No","Yes","No","No ","Bonaparte*","FALSE","FALSE"]
[null,8426,"Bonnet Hill","Yes","Regional District of Fraser-Fort George","Cariboo",{"$nulls":7},"",{"$nulls":6},"","",null,"",null,null,"",null,"Bonnet Hill","N",{"v":53.9,"d":"53.90000"},{"v":-122.616699,"d":"-122.61670"},"http://www.google.com/maps/place/53.9,-122.616699",8426,"Rural",1260,538,"Yes","No","No","No ","Bonnet Hill","FALSE","FALSE"]
[null,7977,"Bonnington Falls","Yes","Regional District of Central Kootenay","Kootenay",{"$nulls":7},"",{"$nulls":6},"","",null,"",null,null,"",null,"Bonnington Falls","N",{"v":49.4667,"d":"49.46670"},{"v":-117.483301,"d":"-117.48330"},"http://www.google.com/maps/place/49.4667,-117.483301",7977,"Rural",920,389,"Yes","No","No","No ","Bonnington Falls","FALSE","FALSE"]
[null,100134,"Booth Creek","No","Regional District of East Kootenay","Kootenay",{"$nulls":7},"",{"$nulls":6},"","",null,"",null,null,"",null,"Booth Creek","N",{"v":49.57624524,"d":"49.57625"},{"v":-115.85795687,"d":"-115.85796"},"http://www.google.com/maps/place/49.57624524,-115.85795687",100134,"Rural",396,158,"No","No","No","No ","Booth Creek","FALSE","FALSE"]
[null,50700,"Boothroyd*","No","Fraser Valley Regional District","Lower Mainland--Southwest",{"$nulls":7},"",{"$nulls":6},"","",null,0,null,null,0,null,"Boothroyd","Y",{"v":49.963070753,"d":"49.96307"},{"v":-121.484964595,"d":"-121.48496"},"http://www.google.com/maps/place/49.963070753,-121.484964595",50700,"Rural First Nations Primary Reserve",81,46,"No","No","No","No ","Boothroyd*","FALSE","FALSE"]
[null,8961,"Boring Ranch","No","Peace River Regional District","Northeast",{"$nulls":7},"",{"$nulls":6},"","",null,"",null,null,"",null,"Boring Ranch","N",{"v":56.95,"d":"56.95000"},{"v":-122.700002,"d":"-122.70000"},"http://www.google.com/maps/place/56.95,-122.700002",8961,"Rural",2,1,"No","Yes","No","No ","Boring Ranch","FALSE","FALSE"]
[null,8232,"Boston Bar","Yes","Fraser Valley Regional District","Lower Mainland--Southwest",{"$nulls":7},"",{"$nulls":6},"","",null,"",null,null,"",null,"Boston Bar","N",49.86244,{"v":-121.443288,"d":"-121.44329"},"http://www.google.com/maps/place/49.86244,-121.443288",8232,"Rural",232,165,"Yes","No","No","No ","Boston Bar","FALSE","FALSE"]
[null,50701,"Boston Bar First Nation*","Yes","Fraser Valley Regional District","Lower Mainland--Southwest",{"$nulls":7},"",{"$nulls":6},"","",null,0,null,null,0,null,"Boston Bar First Nation","Y",{"v":49.87717051,"d":"49.87717"},{"v":-121.450370376,"d":"-121.45037"},"http://www.google.com/maps/place/49.87717051,-121.450370376",50701,"Rural First Nations Primary Reserve",111,82,"Yes","No","No","No ","Boston Bar First Nation*","FALSE","FALSE"]
[null,8268,"Boston Flats","No","Thompson-Nicola Regional District","Thompson--Okanagan",{"$nulls":7},"",{"$nulls":6},"","",null,"",null,null,"",null,"Boston Flats","N",{"v":50.769855,"d":"50.76986"},{"v":-121.304062,"d":"-121.30406"},"http://www.google.com/maps/place/50.769855,-121.304062",8268,"Rural",1008,516,"No","Yes","No","No ","Boston Flats","FALSE","FALSE"]
[null,8031,"Boswell","No","Regional District of Central Kootenay","Kootenay",{"$nulls":7},"",{"$nulls":6},"","",null,"",null,null,"",null,"Boswell","N",{"v":49.450303,"d":"49.45030"},{"v":-116.763762,"d":"-116.76376"},"http://www.google.com/maps/place/49.450303,-116.763762",8031,"Rural",89,112,"No","Yes","No","No ","Boswell","FALSE","FALSE"]
[null,8443,"Bouchie Lake","No","Cariboo Regional District","Cariboo",{"$nulls":7},"",{"$nulls":6},"","",null,"",null,null,"",null,"Bouchie Lake","N",{"v":53.026172,"d":"53.02617"},-122.59733,"http://www.google.com/maps/place/53.026172,-122.59733",8443,"Rural",988,449,"No","No","No","No ","Bouchie Lake","FALSE","FALSE"]
[null,8722,"Bowser","Yes","Regional District of Nanaimo","Vancouver Island and Coast",{"$nulls":7},"",{"$nulls":6},"","",null,"",null,null,"",null,"Bowser","N",{"v":49.438693,"d":"49.43869"},{"v":-124.684757,"d":"-124.68476"},"http://www.google.com/maps/place/49.438693,-124.684757",8722,"Rural",1193,639,"Yes","No","No","No ","Bowser","FALSE","FALSE"]
[null,8159,"Brackendale","Yes","Squamish-Lillooet Regional District","Lower Mainland--Southwest",{"$nulls":7},"",{"$nulls":6},"","",null,"",null,null,"",null,"Brackendale","N",{"v":49.7667,"d":"49.76670"},{"v":-123.149999,"d":"-123.15000"},"http://www.google.com/maps/place/49.7667,-123.149999",8159,"Rural",3472,1229,"Yes","No","No","No ","Brackendale","FALSE","FALSE"]
[null,8962,"Brady Ranch","No","Peace River Regional District","Northeast",{"$nulls":7},"",{"$nulls":6},"","",null,"",null,null,"",null,"Brady Ranch","N",{"v":56.833299,"d":"56.83330"},{"v":-122.6333,"d":"-122.63330"},"http://www.google.com/maps/place/56.833299,-122.6333",8962,"Rural",7,2,"No","Yes","No","No ","Brady Ranch","FALSE","FALSE"]
[null,8139,"Braeloch","Yes","Regional District of Central Okanagan","Thompson--Okanagan",{"$nulls":7},"",{"$nulls":6},"","",null,"",null,null,"",null,"Braeloch","N",{"v":49.783299,"d":"49.78330"},{"v":-119.5167,"d":"-119.51670"},"http://www.google.com/maps/place/49.783299,-119.5167",8139,"Urban",12549,4342,"Yes","No","No","No ","Braeloch","FALSE","FALSE"]
[null,8760,{"$f":"HYPERLINK(AG161,AP161)","v":"Brem River*"},"No","Strathcona Regional District","Vancouver Island and Coast",{"$nulls":7},{"$f":"IF(COUNT(V161)=0, \"\", IF(V161>=0,\"Sufficient Capacity\", IF(V161<0,\"Not Enough Capacity\")))","v":""},{"$nulls":6},{"$f":"IF(OR(ISBLANK(H161),ISBLANK(I161),ISBLANK(J161)), \"\",(H161*I161/J161))","v":""},{"$f":"IF(AND(COUNT(L161,U161)=2, OR($M$10=\"Last-Mile\", $M$10=\"Transport & Last-Mile\")), L161-U161, \"\")","v":""},null,{"$f":"IF(AD161=\"Y\",COUNT(H161), \"\")","v":0},null,null,{"$f":"IF(AD161=\"Y\",COUNT(P161), \"\")","v":0},null,"Brem River","Y",{"v":50.439183,"d":"50.43918"},{"v":-124.671339,"d":"-124.67134"},"http://www.google.com/maps/place/50.439183,-124.671339",8760,"Rural First Nations Secondary Reserve",6,20,"No","Yes","No","No ",{"$f":"IF(AD161=\"Y\", CONCATENATE(AC161,\"*\"), AC161)","v":"Brem River*"},{"$f":"IF(G161=\"Last-Mile\",\"TRUE\",IF(G161=\"Transport & Last-Mile\",\"TRUE\",\"FALSE\"))","v":"FALSE"},{"$f":"IF(G161=\"Transport\",\"TRUE\",IF(G161=\"Transport & Last-Mile\",\"TRUE\",\"FALSE\"))","v":"FALSE"}]
[null,8653,"Brentwood Bay","Yes","Capital Regional District","Vancouver Island and Coast",{"$nulls":7},"",{"$nulls":6},"","",null,"",null,null,"",null,"Brentwood Bay","N",{"v":48.568282,"d":"48.56828"},{"v":-123.456224,"d":"-123.45622"},"http://www.google.com/maps/place/48.568282,-123.456224",8653,"Urban",7409,3123,"Yes","No","No","No ","Brentwood Bay","FALSE","FALSE"]
[null,8198,"Brew Bay","Yes","qathet Regional District","Vancouver Island and Coast",{"$nulls":7},"",{"$nulls":6},"","",null,"",null,null,"",null,"Brew Bay","N",{"v":49.775789,"d":"49.77579"},{"v":-124.371108,"d":"-124.37111"},"http://www.google.com/maps/place/49.775789,-124.371108",8198,"Rural",1213,645,"Yes","No","No","No ","Brew Bay","FALSE","FALSE"]
[null,7991,"Bridesville","No","Regional District of Kootenay Boundary","Kootenay",{"$nulls":7},"",{"$nulls":6},"","",null,"",null,null,"",null,"Bridesville","N",49.03578,{"v":-119.142375,"d":"-119.14238"},"http://www.google.com/maps/place/49.03578,-119.142375",7991,"Rural",63,45,"No","Yes","Yes","No ","Bridesville","FALSE","FALSE"]
[null,8496,"Bridge Lake","No","Cariboo Regional District","Cariboo",{"$nulls":7},"",{"$nulls":6},"","",null,"",null,null,"",null,"Bridge Lake","N",{"v":51.478593,"d":"51.47859"},-120.72552,"http://www.google.com/maps/place/51.478593,-120.72552",8496,"Rural",98,127,"No","Yes","No","No ","Bridge Lake","FALSE","FALSE"]
[null,50590,"Bridge River*","No","Squamish-Lillooet Regional District","Lower Mainland--Southwest",{"$nulls":7},"",{"$nulls":6},"","",null,0,null,null,0,null,"Bridge River","Y",{"v":50.769540807,"d":"50.76954"},{"v":-121.96409765,"d":"-121.96410"},"http://www.google.com/maps/place/50.769540807,-121.96409765",50590,"Rural First Nations Primary Reserve",208,79,"No","Yes","No","No ","Bridge River*","FALSE","FALSE"]
[null,7980,"Brilliant","Yes","Regional District of Central Kootenay","Kootenay",{"$nulls":7},"",{"$nulls":6},"","",null,"",null,null,"",null,"Brilliant","N",{"v":49.321727,"d":"49.32173"},{"v":-117.643053,"d":"-117.64305"},"http://www.google.com/maps/place/49.321727,-117.643053",7980,"Rural",2797,1298,"Yes","No","No","No ","Brilliant","FALSE","FALSE"]
[null,8340,"Brisco","No","Regional District of East Kootenay","Kootenay",{"$nulls":7},"",{"$nulls":6},"","",null,"",null,null,"",null,"Brisco","N",{"v":50.8333,"d":"50.83330"},{"v":-116.266699,"d":"-116.26670"},"http://www.google.com/maps/place/50.8333,-116.266699",8340,"Rural",7,6,"No","Yes","No","No ","Brisco","FALSE","FALSE"]
[null,100113,"Brisco","No","Regional District of East Kootenay","Kootenay",{"$nulls":7},"",{"$nulls":6},"","",null,"",null,null,"",null,"Brisco","N",{"v":50.83842878,"d":"50.83843"},{"v":-116.32643741,"d":"-116.32644"},"http://www.google.com/maps/place/50.83842878,-116.32643741",100113,"Rural",12,7,"No","Yes","No","No ","Brisco","FALSE","FALSE"]
[null,9051,"Britannia Beach","Yes","Squamish-Lillooet Regional District","Lower Mainland--Southwest",{"$nulls":7},"",{"$nulls":6},"","",null,"",null,null,"",null,"Britannia Beach","N",{"v":49.627966,"d":"49.62797"},{"v":-123.203663,"d":"-123.20366"},"http://www.google.com/maps/place/49.627966,-123.203663",9051,"Rural",306,131,"Yes","No","No","No ","Britannia Beach","FALSE","FALSE"]
[null,8789,"Broman Lake*","No","Bulkley Nechako Regional District","Nechako",{"$nulls":7},"",{"$nulls":6},"","",null,0,null,null,0,null,"Broman Lake","Y",54.42032,{"v":-126.134615,"d":"-126.13462"},"http://www.google.com/maps/place/54.42032,-126.134615",8789,"Rural First Nations Primary Reserve",10,10,"No","Yes","No","No ","Broman Lake*","FALSE","FALSE"]
[null,8278,"Brookmere","No","Thompson-Nicola Regional District","Thompson--Okanagan",{"$nulls":7},"",{"$nulls":6},"","",null,"",null,null,"",null,"Brookmere","N",{"v":49.818099,"d":"49.81810"},{"v":-120.875001,"d":"-120.87500"},"http://www.google.com/maps/place/49.818099,-120.875001",8278,"Rural",33,47,"No","Yes","Yes","No ","Brookmere","FALSE","FALSE"]
[null,8082,"Brookswood","Yes","Metro Vancouver Regional District","Lower Mainland--Southwest",{"$nulls":7},"",{"$nulls":6},"","",null,"",null,null,"",null,"Brookswood","N",49.07177,{"v":-122.665988,"d":"-122.66599"},"http://www.google.com/maps/place/49.07177,-122.665988",8082,"Urban",18781,6847,"Yes","No","No","No ","Brookswood","FALSE","FALSE"]
[null,8349,"Brouse","No","Regional District of Central Kootenay","Kootenay",{"$nulls":7},"",{"$nulls":6},"","",null,"",null,null,"",null,"Brouse","N",{"v":50.2167,"d":"50.21670"},{"v":-117.750001,"d":"-117.75000"},"http://www.google.com/maps/place/50.2167,-117.750001",8349,"Rural",399,192,"No","Yes","No","No ","Brouse","FALSE","FALSE"]
[null,8430,"Buckhorn","No","Regional District of Fraser-Fort George","Cariboo",{"$nulls":7},"",{"$nulls":6},"","",null,"",null,null,"",null,"Buckhorn","N",{"v":53.794224,"d":"53.79422"},{"v":-122.654717,"d":"-122.65472"},"http://www.google.com/maps/place/53.794224,-122.654717",8430,"Rural",409,163,"No","No","No","No ","Buckhorn","FALSE","FALSE"]
[null,8968,"Buckinghorse River","No","Peace River Regional District","Northeast",{"$nulls":7},"",{"$nulls":6},"","",null,"",null,null,"",null,"Buckinghorse River","N",{"v":57.390144,"d":"57.39014"},-122.84167,"http://www.google.com/maps/place/57.390144,-122.84167",8968,"Rural",6,2,"No","Yes","No","No ","Buckinghorse River","FALSE","FALSE"]
[null,8728,"Buckley Bay","Yes","Comox Valley Regional District","Vancouver Island and Coast",{"$nulls":7},"",{"$nulls":6},"","",null,"",null,null,"",null,"Buckley Bay","N",{"v":49.533334,"d":"49.53333"},{"v":-124.856944,"d":"-124.85694"},"http://www.google.com/maps/place/49.533334,-124.856944",8728,"Rural",324,181,"Yes","No","No","No ","Buckley Bay","FALSE","FALSE"]
[null,8483,"Buffalo Creek","No","Cariboo Regional District","Cariboo",{"$nulls":7},"",{"$nulls":6},"","",null,"",null,null,"",null,"Buffalo Creek","N",{"v":51.7333,"d":"51.73330"},{"v":-121.150001,"d":"-121.15000"},"http://www.google.com/maps/place/51.7333,-121.150001",8483,"Rural",99,48,"No","Yes","No","No ","Buffalo Creek","FALSE","FALSE"]
[null,8955,"Buick","No","Peace River Regional District","Northeast",{"$nulls":7},"",{"$nulls":6},"","",null,"",null,null,"",null,"Buick","N",{"v":56.762466,"d":"56.76247"},{"v":-121.270044,"d":"-121.27004"},"http://www.google.com/maps/place/56.762466,-121.270044",8955,"Rural",89,12,"No","Yes","No","No ","Buick","FALSE","FALSE"]
[null,8903,"Bulkley House","No","Bulkley Nechako Regional District","Nechako",{"$nulls":7},"",{"$nulls":6},"","",null,"",null,null,"",null,"Bulkley House","N",{"v":55.70908611,"d":"55.70909"},{"v":-126.2301222,"d":"-126.23012"},"http://www.google.com/maps/place/55.70908611,-126.2301222",8903,"Rural",null,null,"No","No","No","No ","Bulkley House","FALSE","FALSE"]
[null,50632,"Bull Harbour (Tlatlasikwala)*","No","Regional District of Mount Waddington","Vancouver Island and Coast",{"$nulls":7},"",{"$nulls":6},"","",null,0,null,null,0,null,"Bull Harbour (Tlatlasikwala)","Y",{"v":50.922475255,"d":"50.92248"},{"v":-127.93998874,"d":"-127.93999"},"http://www.google.com/maps/place/50.922475255,-127.93998874",50632,"Rural First Nations Primary Reserve",0,7,"No","Yes","No","No ","Bull Harbour (Tlatlasikwala)*","FALSE","FALSE"]
[null,7932,"Bull River","No","Regional District of East Kootenay","Kootenay",{"$nulls":7},"",{"$nulls":6},"","",null,"",null,null,"",null,"Bull River","N",{"v":49.470053,"d":"49.47005"},{"v":-115.448181,"d":"-115.44818"},"http://www.google.com/maps/place/49.470053,-115.448181",7932,"Rural",58,32,"No","Yes","No","No ","Bull River","FALSE","FALSE"]
[null,8105,"Burnaby","Yes","Metro Vancouver Regional District","Lower Mainland--Southwest",{"$nulls":7},"",{"$nulls":6},"","",null,"",null,null,"",null,"Burnaby","N",{"v":49.252088,"d":"49.25209"},{"v":-122.961708,"d":"-122.96171"},"http://www.google.com/maps/place/49.252088,-122.961708",8105,"Urban",45637,17845,"Yes","No","No","No ","Burnaby","FALSE","FALSE"]
[null,8783,"Burns Lake","No","Bulkley Nechako Regional District","Nechako",{"$nulls":7},"",{"$nulls":6},"","",null,"",null,null,"",null,"Burns Lake","N",{"v":54.231422,"d":"54.23142"},{"v":-125.759652,"d":"-125.75965"},"http://www.google.com/maps/place/54.231422,-125.759652",8783,"Rural",2478,1013,"No","Yes","No","No ","Burns Lake","FALSE","FALSE"]
[null,50619,"Burns Lake*","No","Bulkley Nechako Regional District","Nechako",{"$nulls":7},"",{"$nulls":6},"","",null,0,null,null,0,null,"Burns Lake","Y",{"v":54.236657095,"d":"54.23666"},{"v":-125.771112955,"d":"-125.77111"},"http://www.google.com/maps/place/54.236657095,-125.771112955",50619,"Rural First Nations Primary Reserve",2478,1013,"No","Yes","No","No ","Burns Lake*","FALSE","FALSE"]
[null,50549,"Burrard (Tsleil-Waututh Nation)*","Yes","Metro Vancouver Regional District","Lower Mainland--Southwest",{"$nulls":7},"",{"$nulls":6},"","",null,0,null,null,0,null,"Burrard (Tsleil-Waututh Nation)","Y",{"v":49.310978091,"d":"49.31098"},{"v":-122.989135369,"d":"-122.98914"},"http://www.google.com/maps/place/49.310978091,-122.989135369",50549,"Urban First Nations Primary Reserve",18670,6990,"Yes","No","No","No ","Burrard (Tsleil-Waututh Nation)*","FALSE","FALSE"]
[null,8025,"Burton","No","Regional District of Central Kootenay","Kootenay",{"$nulls":7},"",{"$nulls":6},"","",null,"",null,null,"",null,"Burton","N",{"v":49.985595,"d":"49.98560"},{"v":-117.880137,"d":"-117.88014"},"http://www.google.com/maps/place/49.985595,-117.880137",8025,"Rural",180,139,"No","Yes","No","No ","Burton","FALSE","FALSE"]
[null,8883,"Butedale","No","Regional District of Kitimat-Stikine","North Coast",{"$nulls":7},"",{"$nulls":6},"","",null,"",null,null,"",null,"Butedale","N",{"v":53.15,"d":"53.15000"},{"v":-128.699999,"d":"-128.70000"},"http://www.google.com/maps/place/53.15,-128.699999",8883,"Rural",5,2,"No","Yes","Yes","No ","Butedale","FALSE","FALSE"]
[null,8265,"Cache Creek","No","Thompson-Nicola Regional District","Thompson--Okanagan",{"$nulls":7},"",{"$nulls":6},"","",null,"",null,null,"",null,"Cache Creek","N",{"v":50.811944,"d":"50.81194"},{"v":-121.323334,"d":"-121.32333"},"http://www.google.com/maps/place/50.811944,-121.323334",8265,"Rural",1008,516,"No","Yes","No","No ","Cache Creek","FALSE","FALSE"]
[null,8289,"Caesars","No","Regional District of Central Okanagan","Thompson--Okanagan",{"$nulls":7},"",{"$nulls":6},"","",null,"",null,null,"",null,"Caesars","N",{"v":50.0667,"d":"50.06670"},{"v":-119.500001,"d":"-119.50000"},"http://www.google.com/maps/place/50.0667,-119.500001",8289,"Rural",49,90,"No","Yes","No","No ","Caesars","FALSE","FALSE"]
[null,8389,"Cahilty","No","Thompson-Nicola Regional District","Thompson--Okanagan",{"$nulls":7},"",{"$nulls":6},"","",null,"",null,null,"",null,"Cahilty","N",{"v":50.949999,"d":"50.95000"},{"v":-120.016701,"d":"-120.01670"},"http://www.google.com/maps/place/50.949999,-120.016701",8389,"Rural",12,7,"No","Yes","No","No ","Cahilty","FALSE","FALSE"]
[null,100146,"Calder Road-Selkirk View","No","Regional District of Central Kootenay","Kootenay",{"$nulls":7},"",{"$nulls":6},"","",null,"",null,null,"",null,"Calder Road-Selkirk View","N",49.87967,{"v":-118.171649,"d":"-118.17165"},"http://www.google.com/maps/place/49.87967,-118.171649",100146,"Rural",15,11,"No","Yes","No","No ","Calder Road-Selkirk View","FALSE","FALSE"]
[null,8369,"Campbell Creek","Yes","Thompson-Nicola Regional District","Thompson--Okanagan",{"$nulls":7},"",{"$nulls":6},"","",null,"",null,null,"",null,"Campbell Creek","N",{"v":50.654021,"d":"50.65402"},{"v":-120.084969,"d":"-120.08497"},"http://www.google.com/maps/place/50.654021,-120.084969",8369,"Rural",680,257,"Yes","No","No","No ","Campbell Creek","FALSE","FALSE"]
[null,8752,"Campbell River","No","Strathcona Regional District","Vancouver Island and Coast",{"$nulls":7},"",{"$nulls":6},"","",null,"",null,null,"",null,"Campbell River","N",{"v":50.016667,"d":"50.01667"},{"v":-125.241668,"d":"-125.24167"},"http://www.google.com/maps/place/50.016667,-125.241668",8752,"Urban",null,null,"No","No","Yes","No ","Campbell River","FALSE","FALSE"]
[null,50622,"Campbell River No.11*","Yes","Strathcona Regional District","Vancouver Island and Coast",{"$nulls":7},"",{"$nulls":6},"","",null,0,null,null,0,null,"Campbell River No.11","Y",{"v":50.031657403,"d":"50.03166"},{"v":-125.247919353,"d":"-125.24792"},"http://www.google.com/maps/place/50.031657403,-125.247919353",50622,"Urban First Nations Primary Reserve",6241,3178,"Yes","No","No","No ","Campbell River No.11*","FALSE","FALSE"]
[null,8010,"Canal Flats","Yes","Regional District of East Kootenay","Kootenay",{"$nulls":7},"",{"$nulls":6},"","",null,"",null,null,"",null,"Canal Flats","N",{"v":50.157583,"d":"50.15758"},{"v":-115.816855,"d":"-115.81686"},"http://www.google.com/maps/place/50.157583,-115.816855",8010,"Rural",520,294,"Yes","No","No","No ","Canal Flats","FALSE","FALSE"]
[null,8490,"Canim Lake","No","Cariboo Regional District","Cariboo",{"$nulls":7},"",{"$nulls":6},"","",null,"",null,null,"",null,"Canim Lake","N",{"v":51.766918,"d":"51.76692"},{"v":-120.894272,"d":"-120.89427"},"http://www.google.com/maps/place/51.766918,-120.894272",8490,"Rural",121,151,"No","Yes","No","No ","Canim Lake","FALSE","FALSE"]
[null,50713,"Canim Lake*","No","Cariboo Regional District","Cariboo",{"$nulls":7},"",{"$nulls":6},"","",null,0,null,null,0,null,"Canim Lake","Y",{"v":51.777598471,"d":"51.77760"},{"v":-120.986436023,"d":"-120.98644"},"http://www.google.com/maps/place/51.777598471,-120.986436023",50713,"Rural First Nations Primary Reserve",109,46,"No","Yes","No","No ","Canim Lake*","FALSE","FALSE"]
[null,8312,"Canoe","Yes","Columbia-Shuswap Regional District","Thompson--Okanagan",{"$nulls":7},"",{"$nulls":6},"","",null,"",null,null,"",null,"Canoe","N",{"v":50.751501,"d":"50.75150"},{"v":-119.227389,"d":"-119.22739"},"http://www.google.com/maps/place/50.751501,-119.227389",8312,"Rural",3051,1330,"Yes","No","No","No ","Canoe","FALSE","FALSE"]
[null,50723,"Canoe Creek (Stswecem'c Xgat'tem First Nation)*","Yes","Cariboo Regional District","Cariboo",{"$nulls":7},"",{"$nulls":6},"","",null,0,null,null,0,null,"Canoe Creek (Stswecem'c Xgat'tem First Nation)","Y",{"v":51.588840213,"d":"51.58884"},{"v":-122.20895149,"d":"-122.20895"},"http://www.google.com/maps/place/51.588840213,-122.20895149",50723,"Rural First Nations Primary Reserve",89,38,"Yes","No","No","No ","Canoe Creek (Stswecem'c Xgat'tem First Nation)*","FALSE","FALSE"]
[null,8502,"Canoe Creek*","Yes","Cariboo Regional District","Cariboo",{"$nulls":7},"",{"$nulls":6},"","",null,0,null,null,0,null,"Canoe Creek","Y",{"v":51.595617,"d":"51.59562"},{"v":-122.092169,"d":"-122.09217"},"http://www.google.com/maps/place/51.595617,-122.092169",8502,"Rural First Nations Secondary Reserve",18,9,"Yes","No","Yes","No ","Canoe Creek*","FALSE","FALSE"]
[null,8504,"Canoe Creek*","No","Thompson-Nicola Regional District","Thompson--Okanagan",{"$nulls":7},"",{"$nulls":6},"","",null,0,null,null,0,null,"Canoe Creek","Y",{"v":51.469131,"d":"51.46913"},{"v":-122.148759,"d":"-122.14876"},"http://www.google.com/maps/place/51.469131,-122.148759",8504,"Rural First Nations Secondary Reserve",62,20,"No","Yes","No","No ","Canoe Creek*","FALSE","FALSE"]
[null,7946,"Canyon","Yes","Regional District of Central Kootenay","Kootenay",{"$nulls":7},"",{"$nulls":6},"","",null,"",null,null,"",null,"Canyon","N",{"v":49.081267,"d":"49.08127"},{"v":-116.442846,"d":"-116.44285"},"http://www.google.com/maps/place/49.081267,-116.442846",7946,"Rural",412,184,"Yes","No","No","No ","Canyon","FALSE","FALSE"]
[null,8331,"Canyon Hot Springs","No","Columbia-Shuswap Regional District","Thompson--Okanagan",{"$nulls":7},"",{"$nulls":6},"","",null,"",null,null,"",null,"Canyon Hot Springs","N",{"v":51.136933,"d":"51.13693"},{"v":-117.852168,"d":"-117.85217"},"http://www.google.com/maps/place/51.136933,-117.852168",8331,"Rural",3,1,"No","Yes","No","No ","Canyon Hot Springs","FALSE","FALSE"]
[null,50623,"Cape Mudge*","Yes","Strathcona Regional District","Vancouver Island and Coast",{"$nulls":7},"",{"$nulls":6},"","",null,0,null,null,0,null,"Cape Mudge","Y",{"v":50.018405453,"d":"50.01841"},{"v":-125.290922893,"d":"-125.29092"},"http://www.google.com/maps/place/50.018405453,-125.290922893",50623,"Urban First Nations Primary Reserve",6372,2852,"Yes","No","No","No ","Cape Mudge*","FALSE","FALSE"]
[null,8143,"Carmi","No","Regional District of Kootenay Boundary","Kootenay",{"$nulls":7},"",{"$nulls":6},"","",null,"",null,null,"",null,"Carmi","N",49.50093,{"v":-119.121976,"d":"-119.12198"},"http://www.google.com/maps/place/49.50093,-119.121976",8143,"Rural",195,154,"No","Yes","No","No ","Carmi","FALSE","FALSE"]
[null,8350,"Carrolls Landing","No","Regional District of Central Kootenay","Kootenay",{"$nulls":7},"",{"$nulls":6},"","",null,"",null,null,"",null,"Carrolls Landing","N",{"v":50.0333,"d":"50.03330"},{"v":-117.9,"d":"-117.90000"},"http://www.google.com/maps/place/50.0333,-117.9",8350,"Rural",1,1,"No","Yes","No","No ","Carrolls Landing","FALSE","FALSE"]
[null,8034,"Cascade","No","Regional District of Kootenay Boundary","Kootenay",{"$nulls":7},"",{"$nulls":6},"","",null,"",null,null,"",null,"Cascade","N",{"v":49.018675,"d":"49.01868"},{"v":-118.207069,"d":"-118.20707"},"http://www.google.com/maps/place/49.018675,-118.207069",8034,"Rural",123,68,"No","Yes","No","No ","Cascade","FALSE","FALSE"]
[null,8696,"Cassidy","Yes","Regional District of Nanaimo","Vancouver Island and Coast",{"$nulls":7},"",{"$nulls":6},"","",null,"",null,null,"",null,"Cassidy","N",{"v":49.049999,"d":"49.05000"},{"v":-123.8833,"d":"-123.88330"},"http://www.google.com/maps/place/49.049999,-123.8833",8696,"Rural",1398,663,"Yes","No","No","No ","Cassidy","FALSE","FALSE"]
[null,7970,"Castlegar","Yes","Regional District of Central Kootenay","Kootenay",{"$nulls":7},"",{"$nulls":6},"","",null,"",null,null,"",null,"Castlegar","N",{"v":49.321815,"d":"49.32182"},{"v":-117.660314,"d":"-117.66031"},"http://www.google.com/maps/place/49.321815,-117.660314",7970,"Rural",4290,2036,"Yes","No","No","No ","Castlegar","FALSE","FALSE"]
[null,8123,"Caulfeild","Yes","Metro Vancouver Regional District","Lower Mainland--Southwest",{"$nulls":7},"",{"$nulls":6},"","",null,"",null,null,"",null,"Caulfeild","N",49.34164,-123.26049,"http://www.google.com/maps/place/49.34164,-123.26049",8123,"Urban",5883,2191,"Yes","No","No","No ","Caulfeild","FALSE","FALSE"]
[null,7995,"Cawston","No","Regional District of Okanagan-Similkameen","Thompson--Okanagan",{"$nulls":7},"",{"$nulls":6},"","",null,"",null,null,"",null,"Cawston","N",{"v":49.180181,"d":"49.18018"},{"v":-119.763751,"d":"-119.76375"},"http://www.google.com/maps/place/49.180181,-119.763751",7995,"Rural",858,390,"No","Yes","No","No ","Cawston","FALSE","FALSE"]
[null,8606,"Caycuse","No","Cowichan Valley Regional District","Vancouver Island and Coast",{"$nulls":7},"",{"$nulls":6},"","",null,"",null,null,"",null,"Caycuse","N",{"v":48.894327,"d":"48.89433"},{"v":-124.366159,"d":"-124.36616"},"http://www.google.com/maps/place/48.894327,-124.366159",8606,"Rural",24,34,"No","Yes","No","No ","Caycuse","FALSE","FALSE"]
[null,50591,"Cayoose Creek*","No","Squamish-Lillooet Regional District","Lower Mainland--Southwest",{"$nulls":7},"",{"$nulls":6},"","",null,0,null,null,0,null,"Cayoose Creek","Y",{"v":50.674303825,"d":"50.67430"},{"v":-121.934060123,"d":"-121.93406"},"http://www.google.com/maps/place/50.674303825,-121.934060123",50591,"Rural First Nations Primary Reserve",1790,965,"No","Yes","No","No ","Cayoose Creek*","FALSE","FALSE"]
[null,8946,"Cecil Lake","No","Peace River Regional District","Northeast",{"$nulls":7},"",{"$nulls":6},"","",null,"",null,null,"",null,"Cecil Lake","N",{"v":56.305961,"d":"56.30596"},{"v":-120.576751,"d":"-120.57675"},"http://www.google.com/maps/place/56.305961,-120.576751",8946,"Rural",44,15,"No","Yes","No","No ","Cecil Lake","FALSE","FALSE"]
[null,8697,"Cedar","Yes","Regional District of Nanaimo","Vancouver Island and Coast",{"$nulls":7},"",{"$nulls":6},"","",null,"",null,null,"",null,"Cedar","N",{"v":49.104326,"d":"49.10433"},{"v":-123.854455,"d":"-123.85446"},"http://www.google.com/maps/place/49.104326,-123.854455",8697,"Urban",2870,1213,"Yes","No","No","No ","Cedar","FALSE","FALSE"]
[null,8408,"Cedarside","No","Regional District of Fraser-Fort George","Cariboo",{"$nulls":7},"",{"$nulls":6},"","",null,"",null,null,"",null,"Cedarside","N",{"v":52.782348,"d":"52.78235"},-119.25013,"http://www.google.com/maps/place/52.782348,-119.25013",8408,"Rural",758,427,"No","Yes","No","No ","Cedarside","FALSE","FALSE"]
[null,8860,"Cedarvale","No","Regional District of Kitimat-Stikine","North Coast",{"$nulls":7},"",{"$nulls":6},"","",null,"",null,null,"",null,"Cedarvale","N",{"v":55.0194,"d":"55.01940"},{"v":-128.3292,"d":"-128.32920"},"http://www.google.com/maps/place/55.0194,-128.3292",8860,"Rural",0,0,"No","Yes","Yes","No ","Cedarvale","FALSE","FALSE"]
[null,8582,"Ceepeecee","No","Strathcona Regional District","Vancouver Island and Coast",{"$nulls":7},"",{"$nulls":6},"","",null,"",null,null,"",null,"Ceepeecee","N",{"v":49.873235,"d":"49.87324"},{"v":-126.71103600000001,"d":"-126.71104"},"http://www.google.com/maps/place/49.873235,-126.711036",8582,"Rural",8,7,"No","Yes","Yes","No ","Ceepeecee","FALSE","FALSE"]
[null,8359,"Celista","No","Columbia-Shuswap Regional District","Thompson--Okanagan",{"$nulls":7},"",{"$nulls":6},"","",null,"",null,null,"",null,"Celista","N",{"v":50.944405,"d":"50.94441"},{"v":-119.348962,"d":"-119.34896"},"http://www.google.com/maps/place/50.944405,-119.348962",8359,"Rural",283,264,"No","No","No","No ","Celista","FALSE","FALSE"]
[null,8655,"Central Saanich","Yes","Capital Regional District","Vancouver Island and Coast",{"$nulls":7},"",{"$nulls":6},"","",null,"",null,null,"",null,"Central Saanich","N",{"v":48.566904,"d":"48.56690"},{"v":-123.397055,"d":"-123.39706"},"http://www.google.com/maps/place/48.566904,-123.397055",8655,"Rural",9159,3979,"Yes","No","No","No ","Central Saanich","FALSE","FALSE"]
[null,8620,"Chamiss Bay","No","Strathcona Regional District","Vancouver Island and Coast",{"$nulls":7},"",{"$nulls":6},"","",null,"",null,null,"",null,"Chamiss Bay","N",{"v":50.0694,"d":"50.06940"},{"v":-127.2875,"d":"-127.28750"},"http://www.google.com/maps/place/50.0694,-127.2875",8620,"Rural",4,13,"No","Yes","No","No ","Chamiss Bay","FALSE","FALSE"]
[null,8929,"Charlie Lake","Yes","Peace River Regional District","Northeast",{"$nulls":7},"",{"$nulls":6},"","",null,"",null,null,"",null,"Charlie Lake","N",{"v":56.297401,"d":"56.29740"},{"v":-120.985399,"d":"-120.98540"},"http://www.google.com/maps/place/56.297401,-120.985399",8929,"Rural",1138,448,"Yes","No","No","No ","Charlie Lake","FALSE","FALSE"]
[null,8934,"Charlie Lake part B","Yes","Peace River Regional District","Northeast",{"$nulls":7},"",{"$nulls":6},"","",null,"",null,null,"",null,"Charlie Lake part B","N",{"v":56.336792,"d":"56.33679"},{"v":-121.009291,"d":"-121.00929"},"http://www.google.com/maps/place/56.336792,-121.009291",8934,"Rural",1138,448,"Yes","No","Yes","No ","Charlie Lake part B","FALSE","FALSE"]
[null,8324,{"$f":"HYPERLINK(AG225,AP225)","v":"Chase"},"No","Thompson-Nicola Regional District","Thompson--Okanagan",{"$nulls":7},{"$f":"IF(COUNT(V225)=0, \"\", IF(V225>=0,\"Sufficient Capacity\", IF(V225<0,\"Not Enough Capacity\")))","v":""},{"$nulls":6},{"$f":"IF(OR(ISBLANK(H225),ISBLANK(I225),ISBLANK(J225)), \"\",(H225*I225/J225))","v":""},{"$f":"IF(AND(COUNT(L225,U225)=2, OR($M$10=\"Last-Mile\", $M$10=\"Transport & Last-Mile\")), L225-U225, \"\")","v":""},null,{"$f":"IF(AD225=\"Y\",COUNT(H225), \"\")","v":""},null,null,{"$f":"IF(AD225=\"Y\",COUNT(P225), \"\")","v":""},null,"Chase","N",{"v":50.822105,"d":"50.82211"},{"v":-119.6883,"d":"-119.68830"},"http://www.google.com/maps/place/50.822105,-119.6883",8324,"Rural",2605,1302,"No","Yes","No","No ",{"$f":"IF(AD225=\"Y\", CONCATENATE(AC225,\"*\"), AC225)","v":"Chase"},{"$f":"IF(G225=\"Last-Mile\",\"TRUE\",IF(G225=\"Transport & Last-Mile\",\"TRUE\",\"FALSE\"))","v":"FALSE"},{"$f":"IF(G225=\"Transport\",\"TRUE\",IF(G225=\"Transport & Last-Mile\",\"TRUE\",\"FALSE\"))","v":"FALSE"}]
[null,8262,"Chasm","No","Thompson-Nicola Regional District","Thompson--Okanagan",{"$nulls":7},"",{"$nulls":6},"","",null,"",null,null,"",null,"Chasm","N",{"v":51.216699,"d":"51.21670"},{"v":-121.483301,"d":"-121.48330"},"http://www.google.com/maps/place/51.216699,-121.483301",8262,"Rural",14,9,"No","Yes","No","No ","Chasm","FALSE","FALSE"]
[null,50583,"Chawathil*","No","Fraser Valley Regional District","Lower Mainland--Southwest",{"$nulls":7},"",{"$nulls":6},"","",null,0,null,null,0,null,"Chawathil","Y",{"v":49.369822294,"d":"49.36982"},{"v":-121.552604417,"d":"-121.55260"},"http://www.google.com/maps/place/49.369822294,-121.552604417",50583,"Rural First Nations Primary Reserve",394,160,"No","No","No","No ","Chawathil*","FALSE","FALSE"]
[null,50584,"Cheam*","Yes","Fraser Valley Regional District","Lower Mainland--Southwest",{"$nulls":7},"",{"$nulls":6},"","",null,0,null,null,0,null,"Cheam","Y",{"v":49.189786987,"d":"49.18979"},{"v":-121.783488476,"d":"-121.78349"},"http://www.google.com/maps/place/49.189786987,-121.783488476",50584,"Rural First Nations Primary Reserve",2923,1074,"Yes","No","No","No ","Cheam*","FALSE","FALSE"]
[null,50559,"Chehalis (Sts'ailes)*","Yes","Fraser Valley Regional District","Lower Mainland--Southwest",{"$nulls":7},"",{"$nulls":6},"","",null,0,null,null,0,null,"Chehalis (Sts'ailes)","Y",{"v":49.298510556,"d":"49.29851"},{"v":-121.914171648,"d":"-121.91417"},"http://www.google.com/maps/place/49.298510556,-121.914171648",50559,"Rural First Nations Primary Reserve",532,168,"Yes","No","No","No ","Chehalis (Sts'ailes)*","FALSE","FALSE"]
[null,8680,"Chemainus","Yes","Cowichan Valley Regional District","Vancouver Island and Coast",{"$nulls":7},"",{"$nulls":6},"","",null,"",null,null,"",null,"Chemainus","N",{"v":48.926565,"d":"48.92657"},{"v":-123.720588,"d":"-123.72059"},"http://www.google.com/maps/place/48.926565,-123.720588",8680,"Rural",4359,2260,"Yes","No","No","No ","Chemainus","FALSE","FALSE"]
[null,50641,"Chemainus (Stz'uminus First Nation)*","Yes","Cowichan Valley Regional District","Vancouver Island and Coast",{"$nulls":7},"",{"$nulls":6},"","",null,0,null,null,0,null,"Chemainus (Stz'uminus First Nation)","Y",{"v":48.993023934,"d":"48.99302"},{"v":-123.772111335,"d":"-123.77211"},"http://www.google.com/maps/place/48.993023934,-123.772111335",50641,"Rural First Nations Primary Reserve",971,316,"Yes","No","No","No ","Chemainus (Stz'uminus First Nation)*","FALSE","FALSE"]
[null,8618,"Chemainus*","Yes","Cowichan Valley Regional District","Vancouver Island and Coast",{"$nulls":7},"",{"$nulls":6},"","",null,0,null,null,0,null,"Chemainus","Y",{"v":48.901357,"d":"48.90136"},{"v":-123.696519,"d":"-123.69652"},"http://www.google.com/maps/place/48.901357,-123.696519",8618,"Rural First Nations Secondary Reserve",4359,2260,"Yes","No","No","No ","Chemainus*","FALSE","FALSE"]
[null,8694,"Chemainus*","Yes","Cowichan Valley Regional District","Vancouver Island and Coast",{"$nulls":7},"",{"$nulls":6},"","",null,0,null,null,0,null,"Chemainus","Y",{"v":49.016099,"d":"49.01610"},-123.85959,"http://www.google.com/maps/place/49.016099,-123.85959",8694,"Rural First Nations Secondary Reserve",2534,1080,"Yes","No","Yes","No ","Chemainus*","FALSE","FALSE"]
[null,8739,"Cherry Creek","Yes","Regional District of Alberni-Clayoquot","Vancouver Island and Coast",{"$nulls":7},"",{"$nulls":6},"","",null,"",null,null,"",null,"Cherry Creek","N",{"v":49.282722,"d":"49.28272"},{"v":-124.787497,"d":"-124.78750"},"http://www.google.com/maps/place/49.282722,-124.787497",8739,"Rural",8294,3960,"Yes","No","Yes","No ","Cherry Creek","FALSE","FALSE"]
[null,8381,"Cherry Creek","No","Thompson-Nicola Regional District","Thompson--Okanagan",{"$nulls":7},"",{"$nulls":6},"","",null,"",null,null,"",null,"Cherry Creek","N",{"v":50.7125,"d":"50.71250"},{"v":-120.624998,"d":"-120.62500"},"http://www.google.com/maps/place/50.7125,-120.624998",8381,"Rural",202,92,"No","Yes","No","No ","Cherry Creek","FALSE","FALSE"]
[null,8664,"Cherry Point","Yes","Cowichan Valley Regional District","Vancouver Island and Coast",{"$nulls":7},"",{"$nulls":6},"","",null,"",null,null,"",null,"Cherry Point","N",{"v":48.727722,"d":"48.72772"},{"v":-123.583611,"d":"-123.58361"},"http://www.google.com/maps/place/48.727722,-123.583611",8664,"Rural",4012,1694,"Yes","No","No","No ","Cherry Point","FALSE","FALSE"]
[null,8154,"Cherryville","No","Regional District of North Okanagan","Thompson--Okanagan",{"$nulls":7},"",{"$nulls":6},"","",null,"",null,null,"",null,"Cherryville","N",{"v":50.240746,"d":"50.24075"},{"v":-118.620518,"d":"-118.62052"},"http://www.google.com/maps/place/50.240746,-118.620518",8154,"Rural",359,160,"No","Yes","No","No ","Cherryville","FALSE","FALSE"]
[null,8819,"Cheslatta","No","Bulkley Nechako Regional District","Nechako",{"$nulls":7},"",{"$nulls":6},"","",null,"",null,null,"",null,"Cheslatta","N",{"v":53.8167,"d":"53.81670"},{"v":-125.8,"d":"-125.80000"},"http://www.google.com/maps/place/53.8167,-125.8",8819,"Rural",6,3,"No","Yes","No","No ","Cheslatta","FALSE","FALSE"]
[null,50620,"Cheslatta Carrier Nation*","No","Bulkley Nechako Regional District","Nechako",{"$nulls":7},"",{"$nulls":6},"","",null,0,null,null,0,null,"Cheslatta Carrier Nation","Y",{"v":54.002474907,"d":"54.00247"},{"v":-125.714104902,"d":"-125.71410"},"http://www.google.com/maps/place/54.002474907,-125.714104902",50620,"Rural First Nations Primary Reserve",38,30,"No","Yes","No","No ","Cheslatta Carrier Nation*","FALSE","FALSE"]
[null,8907,"Chetwynd","No","Peace River Regional District","Northeast",{"$nulls":7},"",{"$nulls":6},"","",null,"",null,null,"",null,"Chetwynd","N",{"v":55.694899,"d":"55.69490"},{"v":-121.619167,"d":"-121.61917"},"http://www.google.com/maps/place/55.694899,-121.619167",8907,"Rural",2394,1188,"No","Yes","Yes","No ","Chetwynd","FALSE","FALSE"]
[null,8514,"Chezacut","No","Cariboo Regional District","Cariboo",{"$nulls":7},"",{"$nulls":6},"","",null,"",null,null,"",null,"Chezacut","N",{"v":52.399305,"d":"52.39931"},{"v":-124.027589,"d":"-124.02759"},"http://www.google.com/maps/place/52.399305,-124.027589",8514,"Rural",10,11,"No","Yes","Yes","No ","Chezacut","FALSE","FALSE"]
[null,8513,"Chilanko Forks","No","Cariboo Regional District","Cariboo",{"$nulls":7},"",{"$nulls":6},"","",null,"",null,null,"",null,"Chilanko Forks","N",{"v":52.119852,"d":"52.11985"},{"v":-124.060644,"d":"-124.06064"},"http://www.google.com/maps/place/52.119852,-124.060644",8513,"Rural",23,12,"No","Yes","No","No ","Chilanko Forks","FALSE","FALSE"]
[null,8460,"Chilcotin Road Area","Yes","Cariboo Regional District","Cariboo",{"$nulls":7},"",{"$nulls":6},"","",null,"",null,null,"",null,"Chilcotin Road Area","N",{"v":52.116587,"d":"52.11659"},{"v":-122.179007,"d":"-122.17901"},"http://www.google.com/maps/place/52.116587,-122.179007",8460,"Rural",542,251,"Yes","No","Yes","No ","Chilcotin Road Area","FALSE","FALSE"]
[null,8058,"Chilliwack","Yes","Fraser Valley Regional District","Lower Mainland--Southwest",{"$nulls":7},"",{"$nulls":6},"","",null,"",null,null,"",null,"Chilliwack","N",{"v":49.175,"d":"49.17500"},{"v":-121.941701,"d":"-121.94170"},"http://www.google.com/maps/place/49.175,-121.941701",8058,"Urban",9881,3991,"Yes","No","No","No ","Chilliwack","FALSE","FALSE"]
[null,8393,"Chinook Cove","No","Thompson-Nicola Regional District","Thompson--Okanagan",{"$nulls":7},"",{"$nulls":6},"","",null,"",null,null,"",null,"Chinook Cove","N",{"v":51.233299,"d":"51.23330"},{"v":-120.1667,"d":"-120.16670"},"http://www.google.com/maps/place/51.233299,-120.1667",8393,"Rural",148,72,"No","Yes","No","No ","Chinook Cove","FALSE","FALSE"]
[null,9025,"Christian Valley","No","Regional District of Kootenay Boundary","Kootenay",{"$nulls":7},"",{"$nulls":6},"","",null,"",null,null,"",null,"Christian Valley","N",{"v":49.551274,"d":"49.55127"},{"v":-118.801631,"d":"-118.80163"},"http://www.google.com/maps/place/49.551274,-118.801631",9025,"Rural",5,4,"No","Yes","No","No ","Christian Valley","FALSE","FALSE"]
[null,7984,"Christina Lake","Yes","Regional District of Kootenay Boundary","Kootenay",{"$nulls":7},"",{"$nulls":6},"","",null,"",null,null,"",null,"Christina Lake","N",{"v":49.039151,"d":"49.03915"},{"v":-118.215917,"d":"-118.21592"},"http://www.google.com/maps/place/49.039151,-118.215917",7984,"Rural",1035,788,"Yes","No","No","No ","Christina Lake","FALSE","FALSE"]
[null,8436,"Cinema","No","Cariboo Regional District","Cariboo",{"$nulls":7},"",{"$nulls":6},"","",null,"",null,null,"",null,"Cinema","N",{"v":53.2333,"d":"53.23330"},{"v":-122.449999,"d":"-122.45000"},"http://www.google.com/maps/place/53.2333,-122.449999",8436,"Rural",54,33,"No","Yes","No","No ","Cinema","FALSE","FALSE"]
[null,8700,"Cinnabar Valley","Yes","Regional District of Nanaimo","Vancouver Island and Coast",{"$nulls":7},"",{"$nulls":6},"","",null,"",null,null,"",null,"Cinnabar Valley","N",{"v":49.103295,"d":"49.10330"},{"v":-123.926406,"d":"-123.92641"},"http://www.google.com/maps/place/49.103295,-123.926406",8700,"Urban",2773,1146,"Yes","No","No","No ","Cinnabar Valley","FALSE","FALSE"]
[null,8930,"Clairmont","Yes","Peace River Regional District","Northeast",{"$nulls":7},"",{"$nulls":6},"","",null,"",null,null,"",null,"Clairmont","N",{"v":56.255928,"d":"56.25593"},{"v":-120.899884,"d":"-120.89988"},"http://www.google.com/maps/place/56.255928,-120.899884",8930,"Rural",6893,3566,"Yes","No","No","No ","Clairmont","FALSE","FALSE"]
[null,8944,"Clayhurst","No","Peace River Regional District","Northeast",{"$nulls":7},"",{"$nulls":6},"","",null,"",null,null,"",null,"Clayhurst","N",{"v":56.186796,"d":"56.18680"},{"v":-120.030465,"d":"-120.03047"},"http://www.google.com/maps/place/56.186796,-120.030465",8944,"Rural",28,10,"No","Yes","No","No ","Clayhurst","FALSE","FALSE"]
[null,8074,"Clearbrook","Yes","Fraser Valley Regional District","Lower Mainland--Southwest",{"$nulls":7},"",{"$nulls":6},"","",null,"",null,null,"",null,"Clearbrook","N",{"v":49.05,"d":"49.05000"},{"v":-122.333299,"d":"-122.33330"},"http://www.google.com/maps/place/49.05,-122.333299",8074,"Urban",59460,23603,"Yes","No","No","No ","Clearbrook","FALSE","FALSE"]
[null,100135,"Clearview","No","Regional District of East Kootenay","Kootenay",{"$nulls":7},"",{"$nulls":6},"","",null,"",null,null,"",null,"Clearview","N",{"v":49.610329382,"d":"49.61033"},{"v":-115.80778883,"d":"-115.80779"},"http://www.google.com/maps/place/49.610329382,-115.80778883",100135,"Rural",271,127,"No","Yes","No","No ","Clearview","FALSE","FALSE"]
[null,8397,"Clearwater","No","Thompson-Nicola Regional District","Thompson--Okanagan",{"$nulls":7},"",{"$nulls":6},"","",null,"",null,null,"",null,"Clearwater","N",{"v":51.65,"d":"51.65000"},{"v":-120.0333,"d":"-120.03330"},"http://www.google.com/maps/place/51.65,-120.0333",8397,"Rural",858,406,"No","Yes","No","No ","Clearwater","FALSE","FALSE"]
[null,8825,"Clemretta","No","Bulkley Nechako Regional District","Nechako",{"$nulls":7},"",{"$nulls":6},"","",null,"",null,null,"",null,"Clemretta","N",{"v":54.003806,"d":"54.00381"},{"v":-126.284612,"d":"-126.28461"},"http://www.google.com/maps/place/54.003806,-126.284612",8825,"Rural",38,39,"No","Yes","Yes","No ","Clemretta","FALSE","FALSE"]
[null,8261,"Clinton","No","Thompson-Nicola Regional District","Thompson--Okanagan",{"$nulls":7},"",{"$nulls":6},"","",null,"",null,null,"",null,"Clinton","N",{"v":51.094184,"d":"51.09418"},-121.58679,"http://www.google.com/maps/place/51.094184,-121.58679",8261,"Rural",688,403,"No","Yes","Yes","No ","Clinton","FALSE","FALSE"]
[null,8634,"Clo-oose*","No","Cowichan Valley Regional District","Vancouver Island and Coast",{"$nulls":7},"",{"$nulls":6},"","",null,0,null,null,0,null,"Clo-oose","Y",{"v":48.662949,"d":"48.66295"},{"v":-124.821563,"d":"-124.82156"},"http://www.google.com/maps/place/48.662949,-124.821563",8634,"Rural First Nations Secondary Reserve",null,null,"No","No","No","No ","Clo-oose*","FALSE","FALSE"]
[null,8088,"Cloverdale","Yes","Metro Vancouver Regional District","Lower Mainland--Southwest",{"$nulls":7},"",{"$nulls":6},"","",null,"",null,null,"",null,"Cloverdale","N",{"v":49.111723,"d":"49.11172"},{"v":-122.724855,"d":"-122.72486"},"http://www.google.com/maps/place/49.111723,-122.724855",8088,"Urban",31750,10828,"Yes","No","Yes","No ","Cloverdale","FALSE","FALSE"]
[null,8547,"Coal Harbour","No","Regional District of Mount Waddington","Vancouver Island and Coast",{"$nulls":7},"",{"$nulls":6},"","",null,"",null,null,"",null,"Coal Harbour","N",{"v":50.6,"d":"50.60000"},{"v":-127.5833,"d":"-127.58330"},"http://www.google.com/maps/place/50.6,-127.5833",8547,"Rural",139,98,"No","Yes","Yes","No ","Coal Harbour","FALSE","FALSE"]
[null,8978,"Coal River","No","Northern Rockies Regional Municipality","Northeast",{"$nulls":7},"",{"$nulls":6},"","",null,"",null,null,"",null,"Coal River","N",{"v":59.65,"d":"59.65000"},{"v":-126.9333,"d":"-126.93330"},"http://www.google.com/maps/place/59.65,-126.9333",8978,"Rural",1,0,"No","Yes","No","No ","Coal River","FALSE","FALSE"]
[null,8128,"Coalmont","No","Regional District of Okanagan-Similkameen","Thompson--Okanagan",{"$nulls":7},"",{"$nulls":6},"","",null,"",null,null,"",null,"Coalmont","N",{"v":49.508898,"d":"49.50890"},{"v":-120.695433,"d":"-120.69543"},"http://www.google.com/maps/place/49.508898,-120.695433",8128,"Rural",66,50,"No","Yes","No","No ","Coalmont","FALSE","FALSE"]
[null,8665,"Cobble Hill","Yes","Cowichan Valley Regional District","Vancouver Island and Coast",{"$nulls":7},"",{"$nulls":6},"","",null,"",null,null,"",null,"Cobble Hill","N",{"v":48.691498,"d":"48.69150"},{"v":-123.584571,"d":"-123.58457"},"http://www.google.com/maps/place/48.691498,-123.584571",8665,"Rural",4012,1694,"Yes","No","No","No ","Cobble Hill","FALSE","FALSE"]
[null,7935,"Cokato","Yes","Regional District of East Kootenay","Kootenay",{"$nulls":7},"",{"$nulls":6},"","",null,"",null,null,"",null,"Cokato","N",{"v":49.4667,"d":"49.46670"},{"v":-115.066699,"d":"-115.06670"},"http://www.google.com/maps/place/49.4667,-115.066699",7935,"Rural",223,547,"Yes","No","No","No ","Cokato","FALSE","FALSE"]
[null,8283,"Coldstream","Yes","Regional District of North Okanagan","Thompson--Okanagan",{"$nulls":7},"",{"$nulls":6},"","",null,"",null,null,"",null,"Coldstream","N",{"v":50.229201,"d":"50.22920"},{"v":-119.226609,"d":"-119.22661"},"http://www.google.com/maps/place/50.229201,-119.226609",8283,"Urban",6256,2450,"Yes","No","No","No ","Coldstream","FALSE","FALSE"]
[null,8277,"Coldwater*","No","Thompson-Nicola Regional District","Thompson--Okanagan",{"$nulls":7},"",{"$nulls":6},"","",null,0,null,null,0,null,"Coldwater","Y",{"v":50.002411,"d":"50.00241"},-120.98532,"http://www.google.com/maps/place/50.002411,-120.98532",8277,"Rural First Nations Secondary Reserve",9,5,"No","Yes","No","No ","Coldwater*","FALSE","FALSE"]
[null,50693,"Coldwater*","No","Thompson-Nicola Regional District","Thompson--Okanagan",{"$nulls":7},"",{"$nulls":6},"","",null,0,null,null,0,null,"Coldwater","Y",{"v":50.027103635,"d":"50.02710"},{"v":-120.855204051,"d":"-120.85520"},"http://www.google.com/maps/place/50.027103635,-120.855204051",50693,"Rural First Nations Primary Reserve",283,103,"No","Yes","No","No ","Coldwater*","FALSE","FALSE"]
[null,8826,"Colleymount","No","Bulkley Nechako Regional District","Nechako",{"$nulls":7},"",{"$nulls":6},"","",null,"",null,null,"",null,"Colleymount","N",{"v":54.033301,"d":"54.03330"},{"v":-126.149999,"d":"-126.15000"},"http://www.google.com/maps/place/54.033301,-126.149999",8826,"Rural",11,9,"No","Yes","No","No ","Colleymount","FALSE","FALSE"]
[null,8643,"Colwood","Yes","Capital Regional District","Vancouver Island and Coast",{"$nulls":7},"",{"$nulls":6},"","",null,"",null,null,"",null,"Colwood","N",{"v":48.432077,"d":"48.43208"},{"v":-123.496518,"d":"-123.49652"},"http://www.google.com/maps/place/48.432077,-123.496518",8643,"Urban",20173,8475,"Yes","No","No","No ","Colwood","FALSE","FALSE"]
[null,8465,"Commodore Heights","Yes","Cariboo Regional District","Cariboo",{"$nulls":7},"",{"$nulls":6},"","",null,"",null,null,"",null,"Commodore Heights","N",{"v":52.166699,"d":"52.16670"},{"v":-122.1333,"d":"-122.13330"},"http://www.google.com/maps/place/52.166699,-122.1333",8465,"Rural",9762,4441,"Yes","No","No","No ","Commodore Heights","FALSE","FALSE"]
[null,8733,"Comox","Yes","Comox Valley Regional District","Vancouver Island and Coast",{"$nulls":7},"",{"$nulls":6},"","",null,"",null,null,"",null,"Comox","N",{"v":49.673858,"d":"49.67386"},{"v":-124.927795,"d":"-124.92780"},"http://www.google.com/maps/place/49.673858,-124.927795",8733,"Rural",16722,7466,"Yes","No","No","No ","Comox","FALSE","FALSE"]
[null,50624,"Comox (K'ómoks First Nation)*","Yes","Comox Valley Regional District","Vancouver Island and Coast",{"$nulls":7},"",{"$nulls":6},"","",null,0,null,null,0,null,"Comox (K'ómoks First Nation)","Y",{"v":49.6787687,"d":"49.67877"},{"v":-124.958903812,"d":"-124.95890"},"http://www.google.com/maps/place/49.6787687,-124.958903812",50624,"Rural First Nations Primary Reserve",9659,4816,"Yes","No","No","No ","Comox (K'ómoks First Nation)*","FALSE","FALSE"]
[null,50692,"Cook's Ferry (Oregon Jack Creek)*","No","Thompson-Nicola Regional District","Thompson--Okanagan",{"$nulls":7},"",{"$nulls":6},"","",null,0,null,null,0,null,"Cook's Ferry (Oregon Jack Creek)","Y",{"v":50.619421522,"d":"50.61942"},{"v":-121.319117044,"d":"-121.31912"},"http://www.google.com/maps/place/50.619421522,-121.319117044",50692,"Rural First Nations Primary Reserve",5,5,"No","Yes","No","No ","Cook's Ferry (Oregon Jack Creek)*","FALSE","FALSE"]
[null,50694,"Cook's Ferry*","No","Thompson-Nicola Regional District","Thompson--Okanagan",{"$nulls":7},"",{"$nulls":6},"","",null,0,null,null,0,null,"Cook's Ferry","Y",{"v":50.42409072,"d":"50.42409"},{"v":-121.317911128,"d":"-121.31791"},"http://www.google.com/maps/place/50.42409072,-121.317911128",50694,"Rural First Nations Primary Reserve",60,36,"No","Yes","No","No ","Cook's Ferry*","FALSE","FALSE"]
[null,8715,"Coombs","Yes","Regional District of Nanaimo","Vancouver Island and Coast",{"$nulls":7},"",{"$nulls":6},"","",null,"",null,null,"",null,"Coombs","N",{"v":49.304371,"d":"49.30437"},-124.41797,"http://www.google.com/maps/place/49.304371,-124.41797",8715,"Rural",5301,2598,"Yes","No","No","No ","Coombs","FALSE","FALSE"]
[null,8022,"Cooper Creek","No","Regional District of Central Kootenay","Kootenay",{"$nulls":7},"",{"$nulls":6},"","",null,"",null,null,"",null,"Cooper Creek","N",50.20229,{"v":-116.962878,"d":"-116.96288"},"http://www.google.com/maps/place/50.20229,-116.962878",8022,"Rural",159,117,"No","Yes","No","No ","Cooper Creek","FALSE","FALSE"]
[null,8115,"Coquitlam","Yes","Metro Vancouver Regional District","Lower Mainland--Southwest",{"$nulls":7},"",{"$nulls":6},"","",null,"",null,null,"",null,"Coquitlam","N",{"v":49.253916,"d":"49.25392"},{"v":-122.848809,"d":"-122.84881"},"http://www.google.com/maps/place/49.253916,-122.848809",8115,"Urban",43149,17723,"Yes","No","No","No ","Coquitlam","FALSE","FALSE"]
[null,8444,"Cottonwood","No","Cariboo Regional District","Cariboo",{"$nulls":7},"",{"$nulls":6},"","",null,"",null,null,"",null,"Cottonwood","N",{"v":53.052208,"d":"53.05221"},{"v":-122.156352,"d":"-122.15635"},"http://www.google.com/maps/place/53.052208,-122.156352",8444,"Rural",20,12,"No","Yes","No","No ","Cottonwood","FALSE","FALSE"]
[null,8732,"Courtenay","Yes","Comox Valley Regional District","Vancouver Island and Coast",{"$nulls":7},"",{"$nulls":6},"","",null,"",null,null,"",null,"Courtenay","N",{"v":49.688915,"d":"49.68892"},{"v":-124.998974,"d":"-124.99897"},"http://www.google.com/maps/place/49.688915,-124.998974",8732,"Urban",9659,4816,"Yes","No","No","No ","Courtenay","FALSE","FALSE"]
[null,8672,"Cowichan Bay","Yes","Cowichan Valley Regional District","Vancouver Island and Coast",{"$nulls":7},"",{"$nulls":6},"","",null,"",null,null,"",null,"Cowichan Bay","N",{"v":48.737086,"d":"48.73709"},{"v":-123.619919,"d":"-123.61992"},"http://www.google.com/maps/place/48.737086,-123.619919",8672,"Rural",2545,1108,"Yes","No","Yes","No ","Cowichan Bay","FALSE","FALSE"]
[null,8673,"Cowichan Station","Yes","Cowichan Valley Regional District","Vancouver Island and Coast",{"$nulls":7},"",{"$nulls":6},"","",null,"",null,null,"",null,"Cowichan Station","N",{"v":48.729414,"d":"48.72941"},{"v":-123.665676,"d":"-123.66568"},"http://www.google.com/maps/place/48.729414,-123.665676",8673,"Rural",2545,1108,"Yes","No","Yes","No ","Cowichan Station","FALSE","FALSE"]
[null,8614,"Cowichan*","Yes","Cowichan Valley Regional District","Vancouver Island and Coast",{"$nulls":7},"",{"$nulls":6},"","",null,0,null,null,0,null,"Cowichan","Y",48.75955,{"v":-123.828869,"d":"-123.82887"},"http://www.google.com/maps/place/48.75955,-123.828869",8614,"Rural First Nations Secondary Reserve",760,315,"Yes","No","No","No ","Cowichan*","FALSE","FALSE"]
[null,8678,"Cowichan*","Yes","Cowichan Valley Regional District","Vancouver Island and Coast",{"$nulls":7},"",{"$nulls":6},"","",null,0,null,null,0,null,"Cowichan","Y",{"v":48.768781,"d":"48.76878"},-123.67978,"http://www.google.com/maps/place/48.768781,-123.67978",8678,"Rural First Nations Primary Reserve",13267,6189,"Yes","No","Yes","No ","Cowichan*","FALSE","FALSE"]
[null,50642,"Cowichan*","Yes","Cowichan Valley Regional District","Vancouver Island and Coast",{"$nulls":7},"",{"$nulls":6},"","",null,0,null,null,0,null,"Cowichan","Y",{"v":48.776217696,"d":"48.77622"},{"v":-123.709288442,"d":"-123.70929"},"http://www.google.com/maps/place/48.776217696,-123.709288442",50642,"Rural First Nations Secondary Reserve",13267,6189,"Yes","No","No","No ","Cowichan*","FALSE","FALSE"]
[null,8212,"Cranberry","Yes","qathet Regional District","Vancouver Island and Coast",{"$nulls":7},"",{"$nulls":6},"","",null,"",null,null,"",null,"Cranberry","N",{"v":49.870214,"d":"49.87021"},{"v":-124.523161,"d":"-124.52316"},"http://www.google.com/maps/place/49.870214,-124.523161",8212,"Rural",2267,1093,"Yes","No","No","No ","Cranberry","FALSE","FALSE"]
[null,8892,"Cranberry Junction","No","Regional District of Kitimat-Stikine","North Coast",{"$nulls":7},"",{"$nulls":6},"","",null,"",null,null,"",null,"Cranberry Junction","N",{"v":55.5667,"d":"55.56670"},{"v":-128.599999,"d":"-128.60000"},"http://www.google.com/maps/place/55.5667,-128.599999",8892,"Rural",null,null,"No","No","No","No ","Cranberry Junction","FALSE","FALSE"]
[null,7934,"Cranbrook","Yes","Regional District of East Kootenay","Kootenay",{"$nulls":7},"",{"$nulls":6},"","",null,"",null,null,"",null,"Cranbrook","N",{"v":49.515487,"d":"49.51549"},{"v":-115.758896,"d":"-115.75890"},"http://www.google.com/maps/place/49.515487,-115.758896",7934,"Rural",7426,3583,"Yes","No","Yes","No ","Cranbrook","FALSE","FALSE"]
[null,7949,"Crawford Bay","No","Regional District of Central Kootenay","Kootenay",{"$nulls":7},"",{"$nulls":6},"","",null,"",null,null,"",null,"Crawford Bay","N",{"v":49.676593,"d":"49.67659"},{"v":-116.822438,"d":"-116.82244"},"http://www.google.com/maps/place/49.676593,-116.822438",7949,"Rural",294,207,"No","Yes","Yes","No ","Crawford Bay","FALSE","FALSE"]
[null,8413,"Crescent Spur","No","Regional District of Fraser-Fort George","Cariboo",{"$nulls":7},"",{"$nulls":6},"","",null,"",null,null,"",null,"Crescent Spur","N",{"v":53.571733,"d":"53.57173"},{"v":-120.695463,"d":"-120.69546"},"http://www.google.com/maps/place/53.571733,-120.695463",8413,"Rural",37,18,"No","Yes","Yes","No ","Crescent Spur","FALSE","FALSE"]
[null,100126,{"$f":"HYPERLINK(AG289,AP289)","v":"Crescent Valley"},"Yes","Regional District of Central Kootenay","Kootenay",{"$nulls":7},{"$f":"IF(COUNT(V289)=0, \"\", IF(V289>=0,\"Sufficient Capacity\", IF(V289<0,\"Not Enough Capacity\")))","v":""},{"$nulls":6},{"$f":"IF(OR(ISBLANK(H289),ISBLANK(I289),ISBLANK(J289)), \"\",(H289*I289/J289))","v":""},{"$f":"IF(AND(COUNT(L289,U289)=2, OR($M$10=\"Last-Mile\", $M$10=\"Transport & Last-Mile\")), L289-U289, \"\")","v":""},null,{"$f":"IF(AD289=\"Y\",COUNT(H289), \"\")","v":""},null,null,{"$f":"IF(AD289=\"Y\",COUNT(P289), \"\")","v":""},null,"Crescent Valley","N",{"v":49.44637222,"d":"49.44637"},{"v":-117.55776111,"d":"-117.55776"},"http://www.google.com/maps/place/49.44637222,-117.55776111",100126,"Rural",1520,723,"Yes","No","No","No ",{"$f":"IF(AD289=\"Y\", CONCATENATE(AC289,\"*\"), AC289)","v":"Crescent Valley"},{"$f":"IF(G289=\"Last-Mile\",\"TRUE\",IF(G289=\"Transport & Last-Mile\",\"TRUE\",\"FALSE\"))","v":"FALSE"},{"$f":"IF(G289=\"Transport\",\"TRUE\",IF(G289=\"Transport & Last-Mile\",\"TRUE\",\"FALSE\"))","v":"FALSE"}]
[null,7943,"Creston","Yes","Regional District of Central Kootenay","Kootenay",{"$nulls":7},"",{"$nulls":6},"","",null,"",null,null,"",null,"Creston","N",49.10062,{"v":-116.507478,"d":"-116.50748"},"http://www.google.com/maps/place/49.10062,-116.507478",7943,"Rural",4618,2368,"Yes","No","Yes","No ","Creston","FALSE","FALSE"]
[null,8499,"Criss Creek","No","Thompson-Nicola Regional District","Thompson--Okanagan",{"$nulls":7},"",{"$nulls":6},"","",null,"",null,null,"",null,"Criss Creek","N",{"v":51.05,"d":"51.05000"},{"v":-120.7333,"d":"-120.73330"},"http://www.google.com/maps/place/51.05,-120.7333",8499,"Rural",0,0,"No","Yes","No","No ","Criss Creek","FALSE","FALSE"]
[null,8615,"Crofton","Yes","Cowichan Valley Regional District","Vancouver Island and Coast",{"$nulls":7},"",{"$nulls":6},"","",null,"",null,null,"",null,"Crofton","N",{"v":48.863168,"d":"48.86317"},{"v":-123.643433,"d":"-123.64343"},"http://www.google.com/maps/place/48.863168,-123.643433",8615,"Rural",2889,1245,"Yes","No","Yes","No ","Crofton","FALSE","FALSE"]
[null,8353,"Crowsnest","No","Regional District of East Kootenay","Kootenay",{"$nulls":7},"",{"$nulls":6},"","",null,"",null,null,"",null,"Crowsnest","N",{"v":49.636767,"d":"49.63677"},{"v":-114.695344,"d":"-114.69534"},"http://www.google.com/maps/place/49.636767,-114.695344",8353,"Rural",5,1,"No","Yes","No","No ","Crowsnest","FALSE","FALSE"]
[null,8061,"Cultus Lake","Yes","Fraser Valley Regional District","Lower Mainland--Southwest",{"$nulls":7},"",{"$nulls":6},"","",null,"",null,null,"",null,"Cultus Lake","N",{"v":49.071353,"d":"49.07135"},{"v":-121.966086,"d":"-121.96609"},"http://www.google.com/maps/place/49.071353,-121.966086",8061,"Rural",480,331,"Yes","No","Yes","No ","Cultus Lake","FALSE","FALSE"]
[null,8730,"Cumberland","Yes","Comox Valley Regional District","Vancouver Island and Coast",{"$nulls":7},"",{"$nulls":6},"","",null,"",null,null,"",null,"Cumberland","N",{"v":49.621955,"d":"49.62196"},{"v":-125.026486,"d":"-125.02649"},"http://www.google.com/maps/place/49.621955,-125.026486",8730,"Rural",3984,1716,"Yes","No","No","No ","Cumberland","FALSE","FALSE"]
[null,8370,"Dallas","Yes","Thompson-Nicola Regional District","Thompson--Okanagan",{"$nulls":7},"",{"$nulls":6},"","",null,"",null,null,"",null,"Dallas","N",{"v":50.666699,"d":"50.66670"},{"v":-120.166699,"d":"-120.16670"},"http://www.google.com/maps/place/50.666699,-120.166699",8370,"Rural",5591,2162,"Yes","No","No","No ","Dallas","FALSE","FALSE"]
[null,50635,"Da'naxda'xw First Nation*","No","Regional District of Mount Waddington","Vancouver Island and Coast",{"$nulls":7},"",{"$nulls":6},"","",null,0,null,null,0,null,"Da'naxda'xw First Nation","Y",{"v":51.015832512,"d":"51.01583"},{"v":-125.614468897,"d":"-125.61447"},"http://www.google.com/maps/place/51.015832512,-125.614468897",50635,"Rural First Nations Secondary Reserve",3,9,"No","Yes","No","No ","Da'naxda'xw First Nation*","FALSE","FALSE"]
[null,8811,"Danskin","No","Bulkley Nechako Regional District","Nechako",{"$nulls":7},"",{"$nulls":6},"","",null,"",null,null,"",null,"Danskin","N",{"v":53.9889,"d":"53.98890"},{"v":-125.7917,"d":"-125.79170"},"http://www.google.com/maps/place/53.9889,-125.7917",8811,"Rural",84,54,"No","Yes","No","No ","Danskin","FALSE","FALSE"]
[null,8169,"D'Arcy*","No","Squamish-Lillooet Regional District","Lower Mainland--Southwest",{"$nulls":7},"",{"$nulls":6},"","",null,0,null,null,0,null,"D'Arcy","Y",{"v":50.55,"d":"50.55000"},{"v":-122.4833,"d":"-122.48330"},"http://www.google.com/maps/place/50.55,-122.4833",8169,"Rural First Nations Secondary Reserve",185,105,"No","Yes","No","No ","D'Arcy*","FALSE","FALSE"]
[null,8395,"Darfield","No","Thompson-Nicola Regional District","Thompson--Okanagan",{"$nulls":7},"",{"$nulls":6},"","",null,"",null,null,"",null,"Darfield","N",{"v":51.3,"d":"51.30000"},{"v":-120.183299,"d":"-120.18330"},"http://www.google.com/maps/place/51.3,-120.183299",8395,"Rural",157,77,"No","Yes","Yes","No ","Darfield","FALSE","FALSE"]
[null,8713,"Dashwood","Yes","Regional District of Nanaimo","Vancouver Island and Coast",{"$nulls":7},"",{"$nulls":6},"","",null,"",null,null,"",null,"Dashwood","N",{"v":49.362061,"d":"49.36206"},{"v":-124.505929,"d":"-124.50593"},"http://www.google.com/maps/place/49.362061,-124.505929",8713,"Rural",2298,1229,"Yes","No","Yes","No ","Dashwood","FALSE","FALSE"]
[null,8184,"Davis Bay","Yes","Sunshine Coast Regional District","Lower Mainland--Southwest",{"$nulls":7},"",{"$nulls":6},"","",null,"",null,null,"",null,"Davis Bay","N",{"v":49.445312,"d":"49.44531"},{"v":-123.725533,"d":"-123.72553"},"http://www.google.com/maps/place/49.445312,-123.725533",8184,"Rural",2316,1208,"Yes","No","No","No ","Davis Bay","FALSE","FALSE"]
[null,8938,"Dawson Creek","Yes","Peace River Regional District","Northeast",{"$nulls":7},"",{"$nulls":6},"","",null,"",null,null,"",null,"Dawson Creek","N",{"v":55.759514,"d":"55.75951"},{"v":-120.234544,"d":"-120.23454"},"http://www.google.com/maps/place/55.759514,-120.234544",8938,"Rural",6226,3256,"Yes","No","Yes","No ","Dawson Creek","FALSE","FALSE"]
[null,8539,"Dawsons Landing","No","Central Coast Regional District","Vancouver Island and Coast",{"$nulls":7},"",{"$nulls":6},"","",null,"",null,null,"",null,"Dawsons Landing","N",{"v":51.57655278,"d":"51.57655"},{"v":-127.59223056,"d":"-127.59223"},"http://www.google.com/maps/place/51.57655278,-127.59223056",8539,"Rural",1,1,"No","Yes","Yes","No ","Dawsons Landing","FALSE","FALSE"]
[null,8983,"Dease Lake","No","Regional District of Kitimat-Stikine","North Coast",{"$nulls":7},"",{"$nulls":6},"","",null,"",null,null,"",null,"Dease Lake","N",{"v":58.4394,"d":"58.43940"},{"v":-129.995499,"d":"-129.99550"},"http://www.google.com/maps/place/58.4394,-129.995499",8983,"Rural",245,142,"No","Yes","Yes","No ","Dease Lake","FALSE","FALSE"]
[null,8787,"Decker Lake","No","Bulkley Nechako Regional District","Nechako",{"$nulls":7},"",{"$nulls":6},"","",null,"",null,null,"",null,"Decker Lake","N",{"v":54.300001,"d":"54.30000"},{"v":-125.833301,"d":"-125.83330"},"http://www.google.com/maps/place/54.300001,-125.833301",8787,"Rural",304,139,"No","Yes","Yes","No ","Decker Lake","FALSE","FALSE"]
[null,8723,"Deep Bay","Yes","Regional District of Nanaimo","Vancouver Island and Coast",{"$nulls":7},"",{"$nulls":6},"","",null,"",null,null,"",null,"Deep Bay","N",{"v":49.464234,"d":"49.46423"},{"v":-124.724611,"d":"-124.72461"},"http://www.google.com/maps/place/49.464234,-124.724611",8723,"Rural",504,326,"Yes","No","Yes","No ","Deep Bay","FALSE","FALSE"]
[null,8659,"Deep Cove","Yes","Capital Regional District","Vancouver Island and Coast",{"$nulls":7},"",{"$nulls":6},"","",null,"",null,null,"",null,"Deep Cove","N",{"v":48.679567,"d":"48.67957"},{"v":-123.472518,"d":"-123.47252"},"http://www.google.com/maps/place/48.679567,-123.472518",8659,"Rural",2946,1364,"Yes","No","No","No ","Deep Cove","FALSE","FALSE"]
[null,8118,"Deep Cove","Yes","Metro Vancouver Regional District","Lower Mainland--Southwest",{"$nulls":7},"",{"$nulls":6},"","",null,"",null,null,"",null,"Deep Cove","N",{"v":49.323229,"d":"49.32323"},{"v":-122.947901,"d":"-122.94790"},"http://www.google.com/maps/place/49.323229,-122.947901",8118,"Urban",7963,3263,"Yes","No","Yes","No ","Deep Cove","FALSE","FALSE"]
[null,8306,"Deep Creek","No","Columbia-Shuswap Regional District","Thompson--Okanagan",{"$nulls":7},"",{"$nulls":6},"","",null,"",null,null,"",null,"Deep Creek","N",{"v":50.609368,"d":"50.60937"},{"v":-119.213438,"d":"-119.21344"},"http://www.google.com/maps/place/50.609368,-119.213438",8306,"Rural",985,444,"No","No","No","No ","Deep Creek","FALSE","FALSE"]
[null,9021,"Deer Park","No","Regional District of Central Kootenay","Kootenay",{"$nulls":7},"",{"$nulls":6},"","",null,"",null,null,"",null,"Deer Park","N",{"v":49.416217,"d":"49.41622"},{"v":-118.039438,"d":"-118.03944"},"http://www.google.com/maps/place/49.416217,-118.039438",9021,"Rural",91,104,"No","Yes","Yes","No ","Deer Park","FALSE","FALSE"]
[null,8675,"Deerholme","Yes","Cowichan Valley Regional District","Vancouver Island and Coast",{"$nulls":7},"",{"$nulls":6},"","",null,"",null,null,"",null,"Deerholme","N",{"v":48.7528,"d":"48.75280"},{"v":-123.758301,"d":"-123.75830"},"http://www.google.com/maps/place/48.7528,-123.758301",8675,"Rural",717,295,"Yes","No","No","No ","Deerholme","FALSE","FALSE"]
[null,8488,"Deka Lake","No","Cariboo Regional District","Cariboo",{"$nulls":7},"",{"$nulls":6},"","",null,"",null,null,"",null,"Deka Lake","N",{"v":51.6083,"d":"51.60830"},{"v":-120.849999,"d":"-120.85000"},"http://www.google.com/maps/place/51.6083,-120.849999",8488,"Rural",222,449,"No","Yes","No","No ","Deka Lake","FALSE","FALSE"]
[null,8119,"Delbrook","Yes","Metro Vancouver Regional District","Lower Mainland--Southwest",{"$nulls":7},"",{"$nulls":6},"","",null,"",null,null,"",null,"Delbrook","N",{"v":49.343025,"d":"49.34303"},{"v":-123.085198,"d":"-123.08520"},"http://www.google.com/maps/place/49.343025,-123.085198",8119,"Urban",47239,20236,"Yes","No","No","No ","Delbrook","FALSE","FALSE"]
[null,9004,"Delkatla","No","North Coast Regional District","North Coast",{"$nulls":7},"",{"$nulls":6},"","",null,"",null,null,"",null,"Delkatla","N",{"v":54.008621,"d":"54.00862"},{"v":-132.129479,"d":"-132.12948"},"http://www.google.com/maps/place/54.008621,-132.129479",9004,"Rural",544,313,"No","Yes","Yes","No ","Delkatla","FALSE","FALSE"]
[null,8736,"Denman Island","No","Comox Valley Regional District","Vancouver Island and Coast",{"$nulls":7},"",{"$nulls":6},"","",null,"",null,null,"",null,"Denman Island","N",{"v":49.535791,"d":"49.53579"},{"v":-124.813115,"d":"-124.81312"},"http://www.google.com/maps/place/49.535791,-124.813115",8736,"Rural",422,272,"No","Yes","No","No ","Denman Island","FALSE","FALSE"]
[null,8703,"Departure Bay","Yes","Regional District of Nanaimo","Vancouver Island and Coast",{"$nulls":7},"",{"$nulls":6},"","",null,"",null,null,"",null,"Departure Bay","N",{"v":49.205369,"d":"49.20537"},{"v":-123.974761,"d":"-123.97476"},"http://www.google.com/maps/place/49.205369,-123.974761",8703,"Urban",8436,3710,"Yes","No","No","No ","Departure Bay","FALSE","FALSE"]
[null,50579,"Deroche (Leq' a: mel First Nation)*","Yes","Fraser Valley Regional District","Lower Mainland--Southwest",{"$nulls":7},"",{"$nulls":6},"","",null,0,null,null,0,null,"Deroche (Leq' a: mel First Nation)","Y",{"v":49.187501866,"d":"49.18750"},{"v":-122.074570002,"d":"-122.07457"},"http://www.google.com/maps/place/49.187501866,-122.074570002",50579,"Rural First Nations Secondary Reserve",412,190,"Yes","No","No","No ","Deroche (Leq' a: mel First Nation)*","FALSE","FALSE"]
[null,8693,"Diamond","Yes","Cowichan Valley Regional District","Vancouver Island and Coast",{"$nulls":7},"",{"$nulls":6},"","",null,"",null,null,"",null,"Diamond","N",49.00603,{"v":-123.845622,"d":"-123.84562"},"http://www.google.com/maps/place/49.00603,-123.845622",8693,"Rural",2534,1080,"Yes","No","Yes","No ","Diamond","FALSE","FALSE"]
[null,50662,"Ditidaht*","No","Cowichan Valley Regional District","Vancouver Island and Coast",{"$nulls":7},"",{"$nulls":6},"","",null,0,null,null,0,null,"Ditidaht","Y",{"v":48.809278517,"d":"48.80928"},{"v":-124.669701742,"d":"-124.66970"},"http://www.google.com/maps/place/48.809278517,-124.669701742",50662,"Rural First Nations Primary Reserve",163,74,"No","Yes","No","No ","Ditidaht*","FALSE","FALSE"]
[null,8869,"Dodge Cove","No","North Coast Regional District","North Coast",{"$nulls":7},"",{"$nulls":6},"","",null,"",null,null,"",null,"Dodge Cove","N",{"v":54.287777,"d":"54.28778"},{"v":-130.387498,"d":"-130.38750"},"http://www.google.com/maps/place/54.287777,-130.387498",8869,"Rural",36,34,"No","Yes","No","No ","Dodge Cove","FALSE","FALSE"]
[null,8839,"Dog Creek","No","Bulkley Nechako Regional District","Nechako",{"$nulls":7},"",{"$nulls":6},"","",null,"",null,null,"",null,"Dog Creek","N",{"v":54.2833,"d":"54.28330"},{"v":-124.266701,"d":"-124.26670"},"http://www.google.com/maps/place/54.2833,-124.266701",8839,"Rural",53,25,"No","Yes","Yes","No ","Dog Creek","FALSE","FALSE"]
[null,8461,"Dog Creek","Yes","Cariboo Regional District","Cariboo",{"$nulls":7},"",{"$nulls":6},"","",null,"",null,null,"",null,"Dog Creek","N",{"v":52.094361,"d":"52.09436"},{"v":-122.114278,"d":"-122.11428"},"http://www.google.com/maps/place/52.094361,-122.114278",8461,"Rural",1928,868,"Yes","No","Yes","No ","Dog Creek","FALSE","FALSE"]
[null,8500,"Dog Creek","Yes","Cariboo Regional District","Cariboo",{"$nulls":7},"",{"$nulls":6},"","",null,"",null,null,"",null,"Dog Creek","N",{"v":51.583301,"d":"51.58330"},{"v":-122.233299,"d":"-122.23330"},"http://www.google.com/maps/place/51.583301,-122.233299",8500,"Rural",89,38,"Yes","No","Yes","No ","Dog Creek","FALSE","FALSE"]
[null,8225,"Dogwood Valley","No","Fraser Valley Regional District","Lower Mainland--Southwest",{"$nulls":7},"",{"$nulls":6},"","",null,"",null,null,"",null,"Dogwood Valley","N",{"v":49.484456,"d":"49.48446"},{"v":-121.425192,"d":"-121.42519"},"http://www.google.com/maps/place/49.484456,-121.425192",8225,"Rural",179,103,"No","Yes","Yes","No ","Dogwood Valley","FALSE","FALSE"]
[null,50548,"Doig River First Nation*","No","Peace River Regional District","Northeast",{"$nulls":7},"",{"$nulls":6},"","",null,0,null,null,0,null,"Doig River First Nation","Y",{"v":56.577853627,"d":"56.57785"},{"v":-120.495585061,"d":"-120.49559"},"http://www.google.com/maps/place/56.577853627,-120.495585061",50548,"Rural First Nations Primary Reserve",105,49,"No","Yes","Yes","No ","Doig River First Nation*","FALSE","FALSE"]
[null,8912,"Dokie Siding","No","Peace River Regional District","Northeast",{"$nulls":7},"",{"$nulls":6},"","",null,"",null,null,"",null,"Dokie Siding","N",{"v":55.662477,"d":"55.66248"},{"v":-121.734267,"d":"-121.73427"},"http://www.google.com/maps/place/55.662477,-121.734267",8912,"Rural",402,206,"No","Yes","Yes","No ","Dokie Siding","FALSE","FALSE"]
[null,8708,"Dolphin Beach","Yes","Regional District of Nanaimo","Vancouver Island and Coast",{"$nulls":7},"",{"$nulls":6},"","",null,"",null,null,"",null,"Dolphin Beach","N",{"v":49.289088,"d":"49.28909"},{"v":-124.141773,"d":"-124.14177"},"http://www.google.com/maps/place/49.289088,-124.141773",8708,"Rural",1337,738,"Yes","No","Yes","No ","Dolphin Beach","FALSE","FALSE"]
[null,8415,"Dome Creek","No","Regional District of Fraser-Fort George","Cariboo",{"$nulls":7},"",{"$nulls":6},"","",null,"",null,null,"",null,"Dome Creek","N",{"v":53.742521,"d":"53.74252"},{"v":-121.026079,"d":"-121.02608"},"http://www.google.com/maps/place/53.742521,-121.026079",8415,"Rural",25,15,"No","Yes","Yes","No ","Dome Creek","FALSE","FALSE"]
[null,8334,"Donald","No","Columbia-Shuswap Regional District","Thompson--Okanagan",{"$nulls":7},"",{"$nulls":6},"","",null,"",null,null,"",null,"Donald","N",{"v":51.4958,"d":"51.49580"},{"v":-117.173599,"d":"-117.17360"},"http://www.google.com/maps/place/51.4958,-117.173599",8334,"Rural",50,26,"No","Yes","No","No ","Donald","FALSE","FALSE"]
[null,8841,"Donald Landing","No","Bulkley Nechako Regional District","Nechako",{"$nulls":7},"",{"$nulls":6},"","",null,"",null,null,"",null,"Donald Landing","N",{"v":54.4833,"d":"54.48330"},{"v":-125.65,"d":"-125.65000"},"http://www.google.com/maps/place/54.4833,-125.65",8841,"Rural",0,1,"No","Yes","Yes","No ","Donald Landing","FALSE","FALSE"]
[null,8191,"Donnely Landing","Yes","Sunshine Coast Regional District","Lower Mainland--Southwest",{"$nulls":7},"",{"$nulls":6},"","",null,"",null,null,"",null,"Donnely Landing","N",{"v":49.624961,"d":"49.62496"},{"v":-124.043204,"d":"-124.04320"},"http://www.google.com/maps/place/49.624961,-124.043204",8191,"Rural",1422,1062,"Yes","No","No","No ","Donnely Landing","FALSE","FALSE"]
[null,8861,"Dorreen","No","Regional District of Kitimat-Stikine","North Coast",{"$nulls":7},"",{"$nulls":6},"","",null,"",null,null,"",null,"Dorreen","N",{"v":54.838899,"d":"54.83890"},{"v":-128.3458,"d":"-128.34580"},"http://www.google.com/maps/place/54.838899,-128.3458",8861,"Rural",0,0,"No","Yes","No","No ","Dorreen","FALSE","FALSE"]
[null,8086,"Douglas","Yes","Metro Vancouver Regional District","Lower Mainland--Southwest",{"$nulls":7},"",{"$nulls":6},"","",null,"",null,null,"",null,"Douglas","N",{"v":49.002778,"d":"49.00278"},{"v":-122.735557,"d":"-122.73556"},"http://www.google.com/maps/place/49.002778,-122.735557",8086,"Rural",13775,5676,"Yes","No","No","No ","Douglas","FALSE","FALSE"]
[null,8385,"Douglas Lake","No","Thompson-Nicola Regional District","Thompson--Okanagan",{"$nulls":7},"",{"$nulls":6},"","",null,"",null,null,"",null,"Douglas Lake","N",{"v":50.1667,"d":"50.16670"},{"v":-120.2,"d":"-120.20000"},"http://www.google.com/maps/place/50.1667,-120.2",8385,"Rural",23,28,"No","Yes","No","No ","Douglas Lake","FALSE","FALSE"]
[null,50561,"Douglas*","No","Fraser Valley Regional District","Lower Mainland--Southwest",{"$nulls":7},"",{"$nulls":6},"","",null,0,null,null,0,null,"Douglas","Y",{"v":49.75599262,"d":"49.75599"},{"v":-122.201085099,"d":"-122.20109"},"http://www.google.com/maps/place/49.75599262,-122.201085099",50561,"Rural First Nations Primary Reserve",57,19,"No","Yes","Yes","No ","Douglas*","FALSE","FALSE"]
[null,8341,"Dry Gulch","Yes","Regional District of East Kootenay","Kootenay",{"$nulls":7},"",{"$nulls":6},"","",null,"",null,null,"",null,"Dry Gulch","N",{"v":50.584162,"d":"50.58416"},{"v":-116.041436,"d":"-116.04144"},"http://www.google.com/maps/place/50.584162,-116.041436",8341,"Rural",917,996,"Yes","No","Yes","No ","Dry Gulch","FALSE","FALSE"]
[null,8319,"Duck Range","No","Thompson-Nicola Regional District","Thompson--Okanagan",{"$nulls":7},"",{"$nulls":6},"","",null,"",null,null,"",null,"Duck Range","N",{"v":50.619152,"d":"50.61915"},{"v":-119.830225,"d":"-119.83023"},"http://www.google.com/maps/place/50.619152,-119.830225",8319,"Rural",111,50,"No","Yes","No","No ","Duck Range","FALSE","FALSE"]
[null,8469,"Dugan Lake","No","Cariboo Regional District","Cariboo",{"$nulls":7},"",{"$nulls":6},"","",null,"",null,null,"",null,"Dugan Lake","N",{"v":52.1667,"d":"52.16670"},{"v":-121.924998,"d":"-121.92500"},"http://www.google.com/maps/place/52.1667,-121.924998",8469,"Rural",505,200,"No","Yes","No","No ","Dugan Lake","FALSE","FALSE"]
[null,8676,"Duncan","Yes","Cowichan Valley Regional District","Vancouver Island and Coast",{"$nulls":7},"",{"$nulls":6},"","",null,"",null,null,"",null,"Duncan","N",{"v":48.778934,"d":"48.77893"},{"v":-123.701502,"d":"-123.70150"},"http://www.google.com/maps/place/48.778934,-123.701502",8676,"Rural",13267,6189,"Yes","No","Yes","No ","Duncan","FALSE","FALSE"]
[null,8541,"Duncanby Landing","No","Central Coast Regional District","Vancouver Island and Coast",{"$nulls":7},"",{"$nulls":6},"","",null,"",null,null,"",null,"Duncanby Landing","N",{"v":51.406463,"d":"51.40646"},{"v":-127.644037,"d":"-127.64404"},"http://www.google.com/maps/place/51.406463,-127.644037",8541,"Rural",1,1,"No","Yes","Yes","No ","Duncanby Landing","FALSE","FALSE"]
[null,8121,"Dundarave","Yes","Metro Vancouver Regional District","Lower Mainland--Southwest",{"$nulls":7},"",{"$nulls":6},"","",null,"",null,null,"",null,"Dundarave","N",{"v":49.337954,"d":"49.33795"},{"v":-123.180536,"d":"-123.18054"},"http://www.google.com/maps/place/49.337954,-123.180536",8121,"Urban",19863,9199,"Yes","No","Yes","No ","Dundarave","FALSE","FALSE"]
[null,8720,"Dunsmuir","Yes","Regional District of Nanaimo","Vancouver Island and Coast",{"$nulls":7},"",{"$nulls":6},"","",null,"",null,null,"",null,"Dunsmuir","N",{"v":49.388085,"d":"49.38809"},{"v":-124.609426,"d":"-124.60943"},"http://www.google.com/maps/place/49.388085,-124.609426",8720,"Rural",1027,593,"Yes","No","Yes","No ","Dunsmuir","FALSE","FALSE"]
[null,8411,"Dunster","No","Regional District of Fraser-Fort George","Cariboo",{"$nulls":7},"",{"$nulls":6},"","",null,"",null,null,"",null,"Dunster","N",{"v":53.126983,"d":"53.12698"},{"v":-119.838844,"d":"-119.83884"},"http://www.google.com/maps/place/53.126983,-119.838844",8411,"Rural",92,51,"No","Yes","Yes","No ","Dunster","FALSE","FALSE"]
[null,8099,"Durieu","No","Fraser Valley Regional District","Lower Mainland--Southwest",{"$nulls":7},"",{"$nulls":6},"","",null,"",null,null,"",null,"Durieu","N",{"v":49.217533,"d":"49.21753"},{"v":-122.235034,"d":"-122.23503"},"http://www.google.com/maps/place/49.217533,-122.235034",8099,"Rural",468,214,"No","No","No","No ","Durieu","FALSE","FALSE"]
[null,8362,"Eagle Bay","No","Columbia-Shuswap Regional District","Thompson--Okanagan",{"$nulls":7},"",{"$nulls":6},"","",null,"",null,null,"",null,"Eagle Bay","N",{"v":50.9333,"d":"50.93330"},{"v":-119.216701,"d":"-119.21670"},"http://www.google.com/maps/place/50.9333,-119.216701",8362,"Rural",146,187,"No","Yes","No","No ","Eagle Bay","FALSE","FALSE"]
[null,8487,"Eagle Creek","No","Cariboo Regional District","Cariboo",{"$nulls":7},"",{"$nulls":6},"","",null,"",null,null,"",null,"Eagle Creek","N",{"v":51.859737,"d":"51.85974"},{"v":-120.865743,"d":"-120.86574"},"http://www.google.com/maps/place/51.859737,-120.865743",8487,"Rural",174,209,"No","Yes","No","No ","Eagle Creek","FALSE","FALSE"]
[null,8677,"Eagle Heights","Yes","Cowichan Valley Regional District","Vancouver Island and Coast",{"$nulls":7},"",{"$nulls":6},"","",null,"",null,null,"",null,"Eagle Heights","N",{"v":48.756265,"d":"48.75627"},{"v":-123.702584,"d":"-123.70258"},"http://www.google.com/maps/place/48.756265,-123.702584",8677,"Rural",13267,6189,"Yes","No","Yes","No ","Eagle Heights","FALSE","FALSE"]
[null,8204,"Earls Cove","No","Sunshine Coast Regional District","Lower Mainland--Southwest",{"$nulls":7},"",{"$nulls":6},"","",null,"",null,null,"",null,"Earls Cove","N",{"v":49.75,"d":"49.75000"},{"v":-124.000001,"d":"-124.00000"},"http://www.google.com/maps/place/49.75,-124.000001",8204,"Rural",80,68,"No","Yes","No","No ","Earls Cove","FALSE","FALSE"]
[null,8915,"East Pine","No","Peace River Regional District","Northeast",{"$nulls":7},"",{"$nulls":6},"","",null,"",null,null,"",null,"East Pine","N",{"v":55.716699,"d":"55.71670"},{"v":-121.216701,"d":"-121.21670"},"http://www.google.com/maps/place/55.716699,-121.216701",8915,"Rural",44,23,"No","Yes","No","No ","East Pine","FALSE","FALSE"]
[null,100151,"East Princeton","Yes","Regional District of Okanagan-Similkameen","Thompson--Okanagan",{"$nulls":7},"",{"$nulls":6},"","",null,"",null,null,"",null,"East Princeton","N",{"v":49.461848,"d":"49.46185"},{"v":-120.449402,"d":"-120.44940"},"http://www.google.com/maps/place/49.461848,-120.449402",100151,"Rural",398,207,"Yes","No","Yes","No ","East Princeton","FALSE","FALSE"]
[null,8639,"East Sooke","Yes","Capital Regional District","Vancouver Island and Coast",{"$nulls":7},"",{"$nulls":6},"","",null,"",null,null,"",null,"East Sooke","N",{"v":48.364541,"d":"48.36454"},{"v":-123.686484,"d":"-123.68648"},"http://www.google.com/maps/place/48.364541,-123.686484",8639,"Rural",6136,2793,"Yes","No","No","No ","East Sooke","FALSE","FALSE"]
[null,8704,{"$f":"HYPERLINK(AG353,AP353)","v":"East Wellington"},"Yes","Regional District of Nanaimo","Vancouver Island and Coast",{"$nulls":7},{"$f":"IF(COUNT(V353)=0, \"\", IF(V353>=0,\"Sufficient Capacity\", IF(V353<0,\"Not Enough Capacity\")))","v":""},{"$nulls":6},{"$f":"IF(OR(ISBLANK(H353),ISBLANK(I353),ISBLANK(J353)), \"\",(H353*I353/J353))","v":""},{"$f":"IF(AND(COUNT(L353,U353)=2, OR($M$10=\"Last-Mile\", $M$10=\"Transport & Last-Mile\")), L353-U353, \"\")","v":""},null,{"$f":"IF(AD353=\"Y\",COUNT(H353), \"\")","v":""},null,null,{"$f":"IF(AD353=\"Y\",COUNT(P353), \"\")","v":""},null,"East Wellington","N",{"v":49.183819,"d":"49.18382"},{"v":-124.017738,"d":"-124.01774"},"http://www.google.com/maps/place/49.183819,-124.017738",8704,"Rural",20727,8850,"Yes","No","No","No ",{"$f":"IF(AD353=\"Y\", CONCATENATE(AC353,\"*\"), AC353)","v":"East Wellington"},{"$f":"IF(G353=\"Last-Mile\",\"TRUE\",IF(G353=\"Transport & Last-Mile\",\"TRUE\",\"FALSE\"))","v":"FALSE"},{"$f":"IF(G353=\"Transport\",\"TRUE\",IF(G353=\"Transport & Last-Mile\",\"TRUE\",\"FALSE\"))","v":"FALSE"}]
[null,8041,"Eastgate","No","Regional District of Okanagan-Similkameen","Thompson--Okanagan",{"$nulls":7},"",{"$nulls":6},"","",null,"",null,null,"",null,"Eastgate","N",{"v":49.1375,"d":"49.13750"},{"v":-120.612501,"d":"-120.61250"},"http://www.google.com/maps/place/49.1375,-120.612501",8041,"Rural",72,134,"No","Yes","No","No ","Eastgate","FALSE","FALSE"]
[null,8567,"Echo Bay","No","Regional District of Mount Waddington","Vancouver Island and Coast",{"$nulls":7},"",{"$nulls":6},"","",null,"",null,null,"",null,"Echo Bay","N",{"v":50.748514,"d":"50.74851"},{"v":-126.494018,"d":"-126.49402"},"http://www.google.com/maps/place/50.748514,-126.494018",8567,"Rural",5,4,"No","Yes","Yes","No ","Echo Bay","FALSE","FALSE"]
[null,8989,"Eddontenajon","No","Regional District of Kitimat-Stikine","North Coast",{"$nulls":7},"",{"$nulls":6},"","",null,"",null,null,"",null,"Eddontenajon","N",{"v":57.822095,"d":"57.82210"},{"v":-129.958047,"d":"-129.95805"},"http://www.google.com/maps/place/57.822095,-129.958047",8989,"Rural",297,126,"No","Yes","No","No ","Eddontenajon","FALSE","FALSE"]
[null,8020,"Edgewater","No","Regional District of East Kootenay","Kootenay",{"$nulls":7},"",{"$nulls":6},"","",null,"",null,null,"",null,"Edgewater","N",{"v":50.699999,"d":"50.70000"},{"v":-116.133301,"d":"-116.13330"},"http://www.google.com/maps/place/50.699999,-116.133301",8020,"Rural",622,297,"No","Yes","No","No ","Edgewater","FALSE","FALSE"]
[null,8028,"Edgewood","No","Regional District of Central Kootenay","Kootenay",{"$nulls":7},"",{"$nulls":6},"","",null,"",null,null,"",null,"Edgewood","N",{"v":49.783301,"d":"49.78330"},{"v":-118.15,"d":"-118.15000"},"http://www.google.com/maps/place/49.783301,-118.15",8028,"Rural",247,158,"No","Yes","No","No ","Edgewood","FALSE","FALSE"]
[null,100141,"Edwards Lake*","No","Regional District of East Kootenay","Kootenay",{"$nulls":7},"",{"$nulls":6},"","",null,0,null,null,0,null,"Edwards Lake","Y",{"v":49.09270519,"d":"49.09271"},{"v":-115.12525847,"d":"-115.12526"},"http://www.google.com/maps/place/49.09270519,-115.12525847",100141,"Rural First Nations Secondary Reserve",86,74,"No","Yes","No","No ","Edwards Lake*","FALSE","FALSE"]
[null,8205,"Egmont","No","Sunshine Coast Regional District","Lower Mainland--Southwest",{"$nulls":7},"",{"$nulls":6},"","",null,"",null,null,"",null,"Egmont","N",{"v":49.75,"d":"49.75000"},{"v":-123.9333,"d":"-123.93330"},"http://www.google.com/maps/place/49.75,-123.9333",8205,"Rural",70,77,"No","Yes","Yes","No ","Egmont","FALSE","FALSE"]
[null,8574,"Ehatis 11 (Ehattesaht)","No","Strathcona Regional District","Vancouver Island and Coast",{"$nulls":7},"",{"$nulls":6},"","",null,"",null,null,"",null,"Ehatis 11 (Ehattesaht)","N",{"v":49.9828,"d":"49.98280"},{"v":-126.859674,"d":"-126.85967"},"http://www.google.com/maps/place/49.9828,-126.859674",8574,"Rural",200,134,"No","Yes","Yes","No ","Ehatis 11 (Ehattesaht)","FALSE","FALSE"]
[null,8628,"Ehatisaht","No","Strathcona Regional District","Vancouver Island and Coast",{"$nulls":7},"",{"$nulls":6},"","",null,"",null,null,"",null,"Ehatisaht","N",{"v":49.8833,"d":"49.88330"},{"v":-126.849999,"d":"-126.85000"},"http://www.google.com/maps/place/49.8833,-126.849999",8628,"Rural",4,13,"No","Yes","No","No ","Ehatisaht","FALSE","FALSE"]
[null,50634,"Ehattesaht*","No","Strathcona Regional District","Vancouver Island and Coast",{"$nulls":7},"",{"$nulls":6},"","",null,0,null,null,0,null,"Ehattesaht","Y",{"v":49.873929015,"d":"49.87393"},{"v":-126.979280349,"d":"-126.97928"},"http://www.google.com/maps/place/49.873929015,-126.979280349",50634,"Rural First Nations Primary Reserve",4,13,"No","Yes","No","No ","Ehattesaht*","FALSE","FALSE"]
[null,8764,"Elk Bay","No","Strathcona Regional District","Vancouver Island and Coast",{"$nulls":7},"",{"$nulls":6},"","",null,"",null,null,"",null,"Elk Bay","N",{"v":50.285602,"d":"50.28560"},{"v":-125.436472,"d":"-125.43647"},"http://www.google.com/maps/place/50.285602,-125.436472",8764,"Rural",1,0,"No","Yes","No","No ","Elk Bay","FALSE","FALSE"]
[null,7939,"Elkford","Yes","Regional District of East Kootenay","Kootenay",{"$nulls":7},"",{"$nulls":6},"","",null,"",null,null,"",null,"Elkford","N",50.01044,{"v":-114.929557,"d":"-114.92956"},"http://www.google.com/maps/place/50.01044,-114.929557",7939,"Rural",2499,1519,"Yes","No","No","No ","Elkford","FALSE","FALSE"]
[null,7929,"Elko","No","Regional District of East Kootenay","Kootenay",{"$nulls":7},"",{"$nulls":6},"","",null,"",null,null,"",null,"Elko","N",{"v":49.301222,"d":"49.30122"},{"v":-115.110988,"d":"-115.11099"},"http://www.google.com/maps/place/49.301222,-115.110988",7929,"Rural",243,121,"No","Yes","No","No ","Elko","FALSE","FALSE"]
[null,8140,"Ellison","Yes","Regional District of Central Okanagan","Thompson--Okanagan",{"$nulls":7},"",{"$nulls":6},"","",null,"",null,null,"",null,"Ellison","N",{"v":49.936266,"d":"49.93627"},{"v":-119.357592,"d":"-119.35759"},"http://www.google.com/maps/place/49.936266,-119.357592",8140,"Urban",3949,1885,"Yes","No","No","No ","Ellison","FALSE","FALSE"]
[null,100112,"Emerald Lake","No","Columbia-Shuswap Regional District","Thompson--Okanagan",{"$nulls":7},"",{"$nulls":6},"","",null,"",null,null,"",null,"Emerald Lake","N",{"v":51.44008333,"d":"51.44008"},{"v":-116.53985556,"d":"-116.53986"},"http://www.google.com/maps/place/51.44008333,-116.53985556",100112,"Rural",1,0,"No","Yes","Yes","No ","Emerald Lake","FALSE","FALSE"]
[null,8784,"Endako","No","Bulkley Nechako Regional District","Nechako",{"$nulls":7},"",{"$nulls":6},"","",null,"",null,null,"",null,"Endako","N",{"v":54.087502,"d":"54.08750"},{"v":-125.017023,"d":"-125.01702"},"http://www.google.com/maps/place/54.087502,-125.017023",8784,"Rural",58,30,"No","Yes","Yes","No ","Endako","FALSE","FALSE"]
[null,8295,"Enderby","Yes","Regional District of North Okanagan","Thompson--Okanagan",{"$nulls":7},"",{"$nulls":6},"","",null,"",null,null,"",null,"Enderby","N",{"v":50.554854,"d":"50.55485"},{"v":-119.140979,"d":"-119.14098"},"http://www.google.com/maps/place/50.554854,-119.140979",8295,"Rural",1985,970,"Yes","No","No","No ","Enderby","FALSE","FALSE"]
[null,8710,"Englishman River North","Yes","Regional District of Nanaimo","Vancouver Island and Coast",{"$nulls":7},"",{"$nulls":6},"","",null,"",null,null,"",null,"Englishman River North","N",{"v":49.323312,"d":"49.32331"},{"v":-124.280625,"d":"-124.28063"},"http://www.google.com/maps/place/49.323312,-124.280625",8710,"Rural",12372,6119,"Yes","No","No","No ","Englishman River North","FALSE","FALSE"]
[null,8718,"Englishman River South","Yes","Regional District of Nanaimo","Vancouver Island and Coast",{"$nulls":7},"",{"$nulls":6},"","",null,"",null,null,"",null,"Englishman River South","N",{"v":49.277851,"d":"49.27785"},{"v":-124.275048,"d":"-124.27505"},"http://www.google.com/maps/place/49.277851,-124.275048",8718,"Rural",2434,1397,"Yes","No","No","No ","Englishman River South","FALSE","FALSE"]
[null,9038,"Erie","No","Regional District of Central Kootenay","Kootenay",{"$nulls":7},"",{"$nulls":6},"","",null,"",null,null,"",null,"Erie","N",{"v":49.191207,"d":"49.19121"},{"v":-117.337387,"d":"-117.33739"},"http://www.google.com/maps/place/49.191207,-117.337387",9038,"Rural",289,162,"No","Yes","No","No ","Erie","FALSE","FALSE"]
[null,8716,"Errington","Yes","Regional District of Nanaimo","Vancouver Island and Coast",{"$nulls":7},"",{"$nulls":6},"","",null,"",null,null,"",null,"Errington","N",{"v":49.288904,"d":"49.28890"},{"v":-124.370084,"d":"-124.37008"},"http://www.google.com/maps/place/49.288904,-124.370084",8716,"Rural",2325,1112,"Yes","No","No","No ","Errington","FALSE","FALSE"]
[null,100150,"Erris","No","Regional District of Okanagan-Similkameen","Thompson--Okanagan",{"$nulls":7},"",{"$nulls":6},"","",null,"",null,null,"",null,"Erris","N",{"v":49.618459,"d":"49.61846"},{"v":-120.368922,"d":"-120.36892"},"http://www.google.com/maps/place/49.618459,-120.368922",100150,"Rural",13,13,"No","Yes","No","No ","Erris","FALSE","FALSE"]
[null,8459,"Esler","Yes","Cariboo Regional District","Cariboo",{"$nulls":7},"",{"$nulls":6},"","",null,"",null,null,"",null,"Esler","N",{"v":52.104183,"d":"52.10418"},{"v":-122.184318,"d":"-122.18432"},"http://www.google.com/maps/place/52.104183,-122.184318",8459,"Rural",542,251,"Yes","No","No","No ","Esler","FALSE","FALSE"]
[null,8583,"Esperanza","No","Strathcona Regional District","Vancouver Island and Coast",{"$nulls":7},"",{"$nulls":6},"","",null,"",null,null,"",null,"Esperanza","N",{"v":49.871257,"d":"49.87126"},{"v":-126.738434,"d":"-126.73843"},"http://www.google.com/maps/place/49.871257,-126.738434",8583,"Rural",8,7,"No","Yes","No","No ","Esperanza","FALSE","FALSE"]
[null,8650,"Esquimalt","Yes","Capital Regional District","Vancouver Island and Coast",{"$nulls":7},"",{"$nulls":6},"","",null,"",null,null,"",null,"Esquimalt","N",{"v":48.428928,"d":"48.42893"},{"v":-123.407989,"d":"-123.40799"},"http://www.google.com/maps/place/48.428928,-123.407989",8650,"Urban",42282,21677,"Yes","No","No","No ","Esquimalt","FALSE","FALSE"]
[null,50644,"Esquimalt*","Yes","Capital Regional District","Vancouver Island and Coast",{"$nulls":7},"",{"$nulls":6},"","",null,0,null,null,0,null,"Esquimalt","Y",{"v":48.444930034,"d":"48.44493"},{"v":-123.430415926,"d":"-123.43042"},"http://www.google.com/maps/place/48.444930034,-123.430415926",50644,"Rural First Nations Primary Reserve",42282,21677,"Yes","No","No","No ","Esquimalt*","FALSE","FALSE"]
[null,8586,"Estevan Point","No","Regional District of Alberni-Clayoquot","Vancouver Island and Coast",{"$nulls":7},"",{"$nulls":6},"","",null,"",null,null,"",null,"Estevan Point","N",{"v":49.378206,"d":"49.37821"},{"v":-126.533748,"d":"-126.53375"},"http://www.google.com/maps/place/49.378206,-126.533748",8586,"Rural",5,2,"No","Yes","Yes","No ","Estevan Point","FALSE","FALSE"]
[null,8699,"Extension","Yes","Regional District of Nanaimo","Vancouver Island and Coast",{"$nulls":7},"",{"$nulls":6},"","",null,"",null,null,"",null,"Extension","N",{"v":49.100488,"d":"49.10049"},{"v":-123.958191,"d":"-123.95819"},"http://www.google.com/maps/place/49.100488,-123.958191",8699,"Rural",8627,3489,"Yes","No","Yes","No ","Extension","FALSE","FALSE"]
[null,8621,"Fair Harbour","No","Strathcona Regional District","Vancouver Island and Coast",{"$nulls":7},"",{"$nulls":6},"","",null,"",null,null,"",null,"Fair Harbour","N",{"v":50.056472,"d":"50.05647"},{"v":-127.100679,"d":"-127.10068"},"http://www.google.com/maps/place/50.056472,-127.100679",8621,"Rural",4,13,"No","Yes","No","No ","Fair Harbour","FALSE","FALSE"]
[null,8012,"Fairmont Hot Springs","Yes","Regional District of East Kootenay","Kootenay",{"$nulls":7},"",{"$nulls":6},"","",null,"",null,null,"",null,"Fairmont Hot Springs","N",{"v":50.334924,"d":"50.33492"},{"v":-115.856472,"d":"-115.85647"},"http://www.google.com/maps/place/50.334924,-115.856472",8012,"Rural",628,751,"Yes","No","No","No ","Fairmont Hot Springs","FALSE","FALSE"]
[null,8303,"Falkland","Yes","Columbia-Shuswap Regional District","Thompson--Okanagan",{"$nulls":7},"",{"$nulls":6},"","",null,"",null,null,"",null,"Falkland","N",{"v":50.500939,"d":"50.50094"},-119.55701,"http://www.google.com/maps/place/50.500939,-119.55701",8303,"Rural",718,350,"Yes","No","No","No ","Falkland","FALSE","FALSE"]
[null,8726,"Fanny Bay","Yes","Comox Valley Regional District","Vancouver Island and Coast",{"$nulls":7},"",{"$nulls":6},"","",null,"",null,null,"",null,"Fanny Bay","N",{"v":49.490105,"d":"49.49011"},{"v":-124.812789,"d":"-124.81279"},"http://www.google.com/maps/place/49.490105,-124.812789",8726,"Rural",927,486,"Yes","No","No","No ","Fanny Bay","FALSE","FALSE"]
[null,8937,"Farmington","No","Peace River Regional District","Northeast",{"$nulls":7},"",{"$nulls":6},"","",null,"",null,null,"",null,"Farmington","N",{"v":55.900001,"d":"55.90000"},{"v":-120.499999,"d":"-120.50000"},"http://www.google.com/maps/place/55.900001,-120.499999",8937,"Rural",54,21,"No","Yes","No","No ","Farmington","FALSE","FALSE"]
[null,8927,"Farrell Creek","No","Peace River Regional District","Northeast",{"$nulls":7},"",{"$nulls":6},"","",null,"",null,null,"",null,"Farrell Creek","N",{"v":56.122756,"d":"56.12276"},{"v":-121.737926,"d":"-121.73793"},"http://www.google.com/maps/place/56.122756,-121.737926",8927,"Rural",4,2,"No","Yes","No","No ","Farrell Creek","FALSE","FALSE"]
[null,8027,"Fauquier","No","Regional District of Central Kootenay","Kootenay",{"$nulls":7},"",{"$nulls":6},"","",null,"",null,null,"",null,"Fauquier","N",{"v":49.8667,"d":"49.86670"},{"v":-118.066699,"d":"-118.06670"},"http://www.google.com/maps/place/49.8667,-118.066699",8027,"Rural",15,13,"No","Yes","No","No ","Fauquier","FALSE","FALSE"]
[null,8966,"Federal Ranch","No","Peace River Regional District","Northeast",{"$nulls":7},"",{"$nulls":6},"","",null,"",null,null,"",null,"Federal Ranch","N",{"v":56.4,"d":"56.40000"},{"v":-122.383299,"d":"-122.38330"},"http://www.google.com/maps/place/56.4,-122.383299",8966,"Rural",2,1,"No","Yes","No","No ","Federal Ranch","FALSE","FALSE"]
[null,8348,"Ferguson","No","Columbia-Shuswap Regional District","Thompson--Okanagan",{"$nulls":7},"",{"$nulls":6},"","",null,"",null,null,"",null,"Ferguson","N",{"v":50.683301,"d":"50.68330"},{"v":-117.4833,"d":"-117.48330"},"http://www.google.com/maps/place/50.683301,-117.4833",8348,"Rural",6,26,"No","Yes","Yes","No ","Ferguson","FALSE","FALSE"]
[null,8083,"Fern Ridge","Yes","Metro Vancouver Regional District","Lower Mainland--Southwest",{"$nulls":7},"",{"$nulls":6},"","",null,"",null,null,"",null,"Fern Ridge","N",{"v":49.048303,"d":"49.04830"},{"v":-122.655561,"d":"-122.65556"},"http://www.google.com/maps/place/49.048303,-122.655561",8083,"Urban",5860,2423,"Yes","No","No","No ","Fern Ridge","FALSE","FALSE"]
[null,7936,"Fernie","Yes","Regional District of East Kootenay","Kootenay",{"$nulls":7},"",{"$nulls":6},"","",null,"",null,null,"",null,"Fernie","N",{"v":49.506761,"d":"49.50676"},{"v":-115.068802,"d":"-115.06880"},"http://www.google.com/maps/place/49.506761,-115.068802",7936,"Rural",4432,2453,"Yes","No","Yes","No ","Fernie","FALSE","FALSE"]
[null,8688,"Fernwood","Yes","Capital Regional District","Vancouver Island and Coast",{"$nulls":7},"",{"$nulls":6},"","",null,"",null,null,"",null,"Fernwood","N",{"v":48.908949,"d":"48.90895"},{"v":-123.528074,"d":"-123.52807"},"http://www.google.com/maps/place/48.908949,-123.528074",8688,"Rural",2733,1408,"Yes","No","No","No ","Fernwood","FALSE","FALSE"]
[null,8342,"Field","No","Columbia-Shuswap Regional District","Thompson--Okanagan",{"$nulls":7},"",{"$nulls":6},"","",null,"",null,null,"",null,"Field","N",{"v":51.394902778,"d":"51.39490"},{"v":-116.49001667,"d":"-116.49002"},"http://www.google.com/maps/place/51.394902778,-116.49001667",8342,"Rural",230,112,"No","Yes","No","No ","Field","FALSE","FALSE"]
[null,8286,"Fintry","Yes","Regional District of Central Okanagan","Thompson--Okanagan",{"$nulls":7},"",{"$nulls":6},"","",null,"",null,null,"",null,"Fintry","N",{"v":50.131639,"d":"50.13164"},{"v":-119.506372,"d":"-119.50637"},"http://www.google.com/maps/place/50.131639,-119.506372",8286,"Rural",304,410,"Yes","No","No","No ","Fintry","FALSE","FALSE"]
[null,8979,"Fireside","No","Northern Rockies Regional Municipality","Northeast",{"$nulls":7},"",{"$nulls":6},"","",null,"",null,null,"",null,"Fireside","N",{"v":59.670547,"d":"59.67055"},{"v":-127.136258,"d":"-127.13626"},"http://www.google.com/maps/place/59.670547,-127.136258",8979,"Rural",0,0,"No","Yes","No","No ","Fireside","FALSE","FALSE"]
[null,8522,"Firvale","No","Central Coast Regional District","Vancouver Island and Coast",{"$nulls":7},"",{"$nulls":6},"","",null,"",null,null,"",null,"Firvale","N",{"v":52.438496,"d":"52.43850"},{"v":-126.292298,"d":"-126.29230"},"http://www.google.com/maps/place/52.438496,-126.292298",8522,"Rural",101,46,"No","Yes","No","No ","Firvale","FALSE","FALSE"]
[null,8425,"Foreman","No","Regional District of Fraser-Fort George","Cariboo",{"$nulls":7},"",{"$nulls":6},"","",null,"",null,null,"",null,"Foreman","N",{"v":53.95,"d":"53.95000"},{"v":-122.6833,"d":"-122.68330"},"http://www.google.com/maps/place/53.95,-122.6833",8425,"Rural",69,32,"No","No","No","No ","Foreman","FALSE","FALSE"]
[null,8485,"Forest Grove","No","Cariboo Regional District","Cariboo",{"$nulls":7},"",{"$nulls":6},"","",null,"",null,null,"",null,"Forest Grove","N",{"v":51.766701,"d":"51.76670"},{"v":-121.1,"d":"-121.10000"},"http://www.google.com/maps/place/51.766701,-121.1",8485,"Rural",224,142,"No","Yes","No","No ","Forest Grove","FALSE","FALSE"]
[null,8799,"Fort Babine*","No","Bulkley Nechako Regional District","Nechako",{"$nulls":7},"",{"$nulls":6},"","",null,0,null,null,0,null,"Fort Babine","Y",{"v":55.322294,"d":"55.32229"},{"v":-126.626221,"d":"-126.62622"},"http://www.google.com/maps/place/55.322294,-126.626221",8799,"Rural First Nations Primary Reserve",86,47,"No","Yes","No","No ","Fort Babine*","FALSE","FALSE"]
[null,8778,"Fort Fraser","No","Bulkley Nechako Regional District","Nechako",{"$nulls":7},"",{"$nulls":6},"","",null,"",null,null,"",null,"Fort Fraser","N",{"v":54.059967,"d":"54.05997"},{"v":-124.550268,"d":"-124.55027"},"http://www.google.com/maps/place/54.059967,-124.550268",8778,"Rural",346,192,"No","Yes","No","No ","Fort Fraser","FALSE","FALSE"]
[null,8085,"Fort Langley","Yes","Metro Vancouver Regional District","Lower Mainland--Southwest",{"$nulls":7},"",{"$nulls":6},"","",null,"",null,null,"",null,"Fort Langley","N",{"v":49.166701,"d":"49.16670"},{"v":-122.5833,"d":"-122.58330"},"http://www.google.com/maps/place/49.166701,-122.5833",8085,"Rural",5090,1930,"Yes","No","No","No ","Fort Langley","FALSE","FALSE"]
[null,8970,"Fort Nelson","No","Northern Rockies Regional Municipality","Northeast",{"$nulls":7},"",{"$nulls":6},"","",null,"",null,null,"",null,"Fort Nelson","N",{"v":58.8056,"d":"58.80560"},{"v":-122.697201,"d":"-122.69720"},"http://www.google.com/maps/place/58.8056,-122.697201",8970,"Rural",3705,1837,"No","Yes","Yes","No ","Fort Nelson","FALSE","FALSE"]
[null,50543,"Fort Nelson First Nation*","No","Northern Rockies Regional Municipality","Northeast",{"$nulls":7},"",{"$nulls":6},"","",null,0,null,null,0,null,"Fort Nelson First Nation","Y",{"v":58.770105036,"d":"58.77011"},{"v":-122.659725939,"d":"-122.65973"},"http://www.google.com/maps/place/58.770105036,-122.659725939",50543,"Rural First Nations Primary Reserve",58,30,"No","Yes","Yes","No ","Fort Nelson First Nation*","FALSE","FALSE"]
[null,8551,"Fort Rupert","Yes","Regional District of Mount Waddington","Vancouver Island and Coast",{"$nulls":7},"",{"$nulls":6},"","",null,"",null,null,"",null,"Fort Rupert","N",{"v":50.688922,"d":"50.68892"},{"v":-127.420037,"d":"-127.42004"},"http://www.google.com/maps/place/50.688922,-127.420037",8551,"Rural",587,287,"Yes","No","Yes","No ","Fort Rupert","FALSE","FALSE"]
[null,8802,"Fort St. James","No","Bulkley Nechako Regional District","Nechako",{"$nulls":7},"",{"$nulls":6},"","",null,"",null,null,"",null,"Fort St. James","N",{"v":54.448709,"d":"54.44871"},{"v":-124.256369,"d":"-124.25637"},"http://www.google.com/maps/place/54.448709,-124.256369",8802,"Rural",1092,482,"No","Yes","Yes","No ","Fort St. James","FALSE","FALSE"]
[null,8931,"Fort St. John","Yes","Peace River Regional District","Northeast",{"$nulls":7},"",{"$nulls":6},"","",null,"",null,null,"",null,"Fort St. John","N",{"v":56.246052,"d":"56.24605"},{"v":-120.844596,"d":"-120.84460"},"http://www.google.com/maps/place/56.246052,-120.844596",8931,"Rural",6893,3566,"Yes","No","Yes","No ","Fort St. John","FALSE","FALSE"]
[null,8006,"Fort Steele","No","Regional District of East Kootenay","Kootenay",{"$nulls":7},"",{"$nulls":6},"","",null,"",null,null,"",null,"Fort Steele","N",49.61694,{"v":-115.625518,"d":"-115.62552"},"http://www.google.com/maps/place/49.61694,-115.625518",8006,"Rural",95,44,"No","Yes","Yes","No ","Fort Steele","FALSE","FALSE"]
[null,50610,"Fort Ware (Kwadacha)*","No","Peace River Regional District","Northeast",{"$nulls":7},"",{"$nulls":6},"","",null,0,null,null,0,null,"Fort Ware (Kwadacha)","Y",{"v":57.42367325,"d":"57.42367"},{"v":-125.630282177,"d":"-125.63028"},"http://www.google.com/maps/place/57.42367325,-125.630282177",50610,"Remote First Nations Primary Reserve",332,128,"No","Yes","Yes","No ","Fort Ware (Kwadacha)*","FALSE","FALSE"]
[null,9027,"Fosthall","No","Regional District of Central Kootenay","Kootenay",{"$nulls":7},"",{"$nulls":6},"","",null,"",null,null,"",null,"Fosthall","N",{"v":50.348786,"d":"50.34879"},{"v":-117.935057,"d":"-117.93506"},"http://www.google.com/maps/place/50.348786,-117.935057",9027,"Rural",0,0,"No","Yes","Yes","No ","Fosthall","FALSE","FALSE"]
[null,8464,"Fox Mountain","Yes","Cariboo Regional District","Cariboo",{"$nulls":7},"",{"$nulls":6},"","",null,"",null,null,"",null,"Fox Mountain","N",{"v":52.140229,"d":"52.14023"},-122.11632,"http://www.google.com/maps/place/52.140229,-122.11632",8464,"Rural",9762,4441,"Yes","No","Yes","No ","Fox Mountain","FALSE","FALSE"]
[null,8813,"François Lake","No","Bulkley Nechako Regional District","Nechako",{"$nulls":7},"",{"$nulls":6},"","",null,"",null,null,"",null,"François Lake","N",{"v":54.05,"d":"54.05000"},{"v":-125.75,"d":"-125.75000"},"http://www.google.com/maps/place/54.05,-125.75",8813,"Rural",201,98,"No","Yes","Yes","No ","François Lake","FALSE","FALSE"]
[null,8630,"Franklin Camp","No","Regional District of Alberni-Clayoquot","Vancouver Island and Coast",{"$nulls":7},"",{"$nulls":6},"","",null,"",null,null,"",null,"Franklin Camp","N",{"v":48.972199,"d":"48.97220"},{"v":-124.7417,"d":"-124.74170"},"http://www.google.com/maps/place/48.972199,-124.7417",8630,"Rural",2,5,"No","Yes","No","No ","Franklin Camp","FALSE","FALSE"]
[null,8998,"Fraser","No","Stikine Regional District (Unincorporated)","Nechako",{"$nulls":7},"",{"$nulls":6},"","",null,"",null,null,"",null,"Fraser","N",{"v":59.715867,"d":"59.71587"},{"v":-135.048794,"d":"-135.04879"},"http://www.google.com/maps/place/59.715867,-135.048794",8998,"Rural",3,5,"No","Yes","No","No ","Fraser","FALSE","FALSE"]
[null,8780,"Fraser Lake","No","Bulkley Nechako Regional District","Nechako",{"$nulls":7},"",{"$nulls":6},"","",null,"",null,null,"",null,"Fraser Lake","N",{"v":54.0583,"d":"54.05830"},{"v":-124.847201,"d":"-124.84720"},"http://www.google.com/maps/place/54.0583,-124.847201",8780,"Rural",1103,618,"No","Yes","No","No ","Fraser Lake","FALSE","FALSE"]
[null,8712,"French Creek","Yes","Regional District of Nanaimo","Vancouver Island and Coast",{"$nulls":7},"",{"$nulls":6},"","",null,"",null,null,"",null,"French Creek","N",{"v":49.347125,"d":"49.34713"},{"v":-124.360495,"d":"-124.36050"},"http://www.google.com/maps/place/49.347125,-124.360495",8712,"Rural",7114,3556,"Yes","No","No","No ","French Creek","FALSE","FALSE"]
[null,7963,{"$f":"HYPERLINK(AG417,AP417)","v":"Fruitvale"},"Yes","Regional District of Kootenay Boundary","Kootenay",{"$nulls":7},{"$f":"IF(COUNT(V417)=0, \"\", IF(V417>=0,\"Sufficient Capacity\", IF(V417<0,\"Not Enough Capacity\")))","v":""},{"$nulls":6},{"$f":"IF(OR(ISBLANK(H417),ISBLANK(I417),ISBLANK(J417)), \"\",(H417*I417/J417))","v":""},{"$f":"IF(AND(COUNT(L417,U417)=2, OR($M$10=\"Last-Mile\", $M$10=\"Transport & Last-Mile\")), L417-U417, \"\")","v":""},null,{"$f":"IF(AD417=\"Y\",COUNT(H417), \"\")","v":""},null,null,{"$f":"IF(AD417=\"Y\",COUNT(P417), \"\")","v":""},null,"Fruitvale","N",{"v":49.113885,"d":"49.11389"},{"v":-117.547764,"d":"-117.54776"},"http://www.google.com/maps/place/49.113885,-117.547764",7963,"Rural",2680,1177,"Yes","No","No","No ",{"$f":"IF(AD417=\"Y\", CONCATENATE(AC417,\"*\"), AC417)","v":"Fruitvale"},{"$f":"IF(G417=\"Last-Mile\",\"TRUE\",IF(G417=\"Transport & Last-Mile\",\"TRUE\",\"FALSE\"))","v":"FALSE"},{"$f":"IF(G417=\"Transport\",\"TRUE\",IF(G417=\"Transport & Last-Mile\",\"TRUE\",\"FALSE\"))","v":"FALSE"}]
[null,8687,"Fulford Harbour","Yes","Capital Regional District","Vancouver Island and Coast",{"$nulls":7},"",{"$nulls":6},"","",null,"",null,null,"",null,"Fulford Harbour","N",{"v":48.770644,"d":"48.77064"},{"v":-123.450253,"d":"-123.45025"},"http://www.google.com/maps/place/48.770644,-123.450253",8687,"Rural",695,398,"Yes","No","No","No ","Fulford Harbour","FALSE","FALSE"]
[null,8344,"Galena","No","Columbia-Shuswap Regional District","Thompson--Okanagan",{"$nulls":7},"",{"$nulls":6},"","",null,"",null,null,"",null,"Galena","N",{"v":50.616701,"d":"50.61670"},{"v":-117.8667,"d":"-117.86670"},"http://www.google.com/maps/place/50.616701,-117.8667",8344,"Rural",1,1,"No","Yes","No","No ","Galena","FALSE","FALSE"]
[null,8345,"Galena Bay","No","Columbia-Shuswap Regional District","Thompson--Okanagan",{"$nulls":7},"",{"$nulls":6},"","",null,"",null,null,"",null,"Galena Bay","N",{"v":50.666699,"d":"50.66670"},{"v":-117.850001,"d":"-117.85000"},"http://www.google.com/maps/place/50.666699,-117.850001",8345,"Rural",7,18,"No","Yes","No","No ","Galena Bay","FALSE","FALSE"]
[null,8175,"Gambier Harbour","No","Metro Vancouver Regional District","Lower Mainland--Southwest",{"$nulls":7},"",{"$nulls":6},"","",null,"",null,null,"",null,"Gambier Harbour","N",{"v":49.372801,"d":"49.37280"},{"v":-123.413788,"d":"-123.41379"},"http://www.google.com/maps/place/49.372801,-123.413788",8175,"Rural",1192,594,"No","Yes","No","No ","Gambier Harbour","FALSE","FALSE"]
[null,8503,"Gang Ranch","No","Cariboo Regional District","Cariboo",{"$nulls":7},"",{"$nulls":6},"","",null,"",null,null,"",null,"Gang Ranch","N",51.55376,{"v":-122.350995,"d":"-122.35100"},"http://www.google.com/maps/place/51.55376,-122.350995",8503,"Rural",22,1,"No","Yes","No","No ","Gang Ranch","FALSE","FALSE"]
[null,8681,"Ganges","Yes","Capital Regional District","Vancouver Island and Coast",{"$nulls":7},"",{"$nulls":6},"","",null,"",null,null,"",null,"Ganges","N",{"v":48.859899,"d":"48.85990"},-123.50654,"http://www.google.com/maps/place/48.859899,-123.50654",8681,"Rural",2107,1141,"Yes","No","No","No ","Ganges","FALSE","FALSE"]
[null,8192,"Garden Bay","Yes","Sunshine Coast Regional District","Lower Mainland--Southwest",{"$nulls":7},"",{"$nulls":6},"","",null,"",null,null,"",null,"Garden Bay","N",{"v":49.636639,"d":"49.63664"},{"v":-124.033622,"d":"-124.03362"},"http://www.google.com/maps/place/49.636639,-124.033622",8192,"Rural",1422,1062,"Yes","No","No","No ","Garden Bay","FALSE","FALSE"]
[null,8215,"Garibaldi","No","Squamish-Lillooet Regional District","Lower Mainland--Southwest",{"$nulls":7},"",{"$nulls":6},"","",null,"",null,null,"",null,"Garibaldi","N",{"v":49.966699,"d":"49.96670"},{"v":-123.15,"d":"-123.15000"},"http://www.google.com/maps/place/49.966699,-123.15",8215,"Rural",15,12,"No","Yes","No","No ","Garibaldi","FALSE","FALSE"]
[null,8160,"Garibaldi Highlands","Yes","Squamish-Lillooet Regional District","Lower Mainland--Southwest",{"$nulls":7},"",{"$nulls":6},"","",null,"",null,null,"",null,"Garibaldi Highlands","N",{"v":49.741699,"d":"49.74170"},{"v":-123.134701,"d":"-123.13470"},"http://www.google.com/maps/place/49.741699,-123.134701",8160,"Rural",7995,3090,"Yes","No","No","No ","Garibaldi Highlands","FALSE","FALSE"]
[null,8484,"Gateway","No","Cariboo Regional District","Cariboo",{"$nulls":7},"",{"$nulls":6},"","",null,"",null,null,"",null,"Gateway","N",{"v":51.680759,"d":"51.68076"},{"v":-121.211468,"d":"-121.21147"},"http://www.google.com/maps/place/51.680759,-121.211468",8484,"Rural",314,155,"No","Yes","No","No ","Gateway","FALSE","FALSE"]
[null,7968,"Genelle","Yes","Regional District of Kootenay Boundary","Kootenay",{"$nulls":7},"",{"$nulls":6},"","",null,"",null,null,"",null,"Genelle","N",{"v":49.213867,"d":"49.21387"},{"v":-117.690816,"d":"-117.69082"},"http://www.google.com/maps/place/49.213867,-117.690816",7968,"Rural",1026,499,"Yes","No","No","No ","Genelle","FALSE","FALSE"]
[null,9019,"Georgetown Mills","No","North Coast Regional District","North Coast",{"$nulls":7},"",{"$nulls":6},"","",null,"",null,null,"",null,"Georgetown Mills","N",{"v":54.471563,"d":"54.47156"},{"v":-130.398056,"d":"-130.39806"},"http://www.google.com/maps/place/54.471563,-130.398056",9019,"Rural",10,12,"No","Yes","No","No ","Georgetown Mills","FALSE","FALSE"]
[null,8901,"Germansen Landing","No","Bulkley Nechako Regional District","Nechako",{"$nulls":7},"",{"$nulls":6},"","",null,"",null,null,"",null,"Germansen Landing","N",{"v":55.7833,"d":"55.78330"},{"v":-124.699999,"d":"-124.70000"},"http://www.google.com/maps/place/55.7833,-124.699999",8901,"Rural",29,24,"No","Yes","No","No ","Germansen Landing","FALSE","FALSE"]
[null,8177,"Gibsons","Yes","Sunshine Coast Regional District","Lower Mainland--Southwest",{"$nulls":7},"",{"$nulls":6},"","",null,"",null,null,"",null,"Gibsons","N",{"v":49.401757,"d":"49.40176"},{"v":-123.514423,"d":"-123.51442"},"http://www.google.com/maps/place/49.401757,-123.514423",8177,"Rural",8698,4192,"Yes","No","No","No ","Gibsons","FALSE","FALSE"]
[null,8193,"Gillies Bay","No","qathet Regional District","Vancouver Island and Coast",{"$nulls":7},"",{"$nulls":6},"","",null,"",null,null,"",null,"Gillies Bay","N",{"v":49.6833,"d":"49.68330"},{"v":-124.4833,"d":"-124.48330"},"http://www.google.com/maps/place/49.6833,-124.4833",8193,"Rural",391,252,"No","Yes","No","No ","Gillies Bay","FALSE","FALSE"]
[null,8035,"Gilpin","Yes","Regional District of Kootenay Boundary","Kootenay",{"$nulls":7},"",{"$nulls":6},"","",null,"",null,null,"",null,"Gilpin","N",{"v":49.006334,"d":"49.00633"},{"v":-118.328575,"d":"-118.32858"},"http://www.google.com/maps/place/49.006334,-118.328575",8035,"Rural",64,25,"Yes","No","No","No ","Gilpin","FALSE","FALSE"]
[null,8421,"Giscome","No","Regional District of Fraser-Fort George","Cariboo",{"$nulls":7},"",{"$nulls":6},"","",null,"",null,null,"",null,"Giscome","N",{"v":54.0667,"d":"54.06670"},{"v":-122.366701,"d":"-122.36670"},"http://www.google.com/maps/place/54.0667,-122.366701",8421,"Rural",66,31,"No","Yes","No","No ","Giscome","FALSE","FALSE"]
[null,50537,"Gitanyow*","No","Regional District of Kitimat-Stikine","North Coast",{"$nulls":7},"",{"$nulls":6},"","",null,0,null,null,0,null,"Gitanyow","Y",{"v":55.26763522,"d":"55.26764"},{"v":-128.070618182,"d":"-128.07062"},"http://www.google.com/maps/place/55.26763522,-128.070618182",50537,"Rural First Nations Primary Reserve",436,137,"No","Yes","No","No ","Gitanyow*","FALSE","FALSE"]
[null,50679,"Gitwinksihlkw (Nisga'a Village of Gitwinksihlkw)*","No","Regional District of Kitimat-Stikine","North Coast",{"$nulls":7},"",{"$nulls":6},"","",null,0,null,null,0,null,"Gitwinksihlkw (Nisga'a Village of Gitwinksihlkw)","Y",{"v":55.192522304,"d":"55.19252"},{"v":-129.220901072,"d":"-129.22090"},"http://www.google.com/maps/place/55.192522304,-129.220901072",50679,"Rural First Nations Primary Reserve",193,53,"No","Yes","No","No ","Gitwinksihlkw (Nisga'a Village of Gitwinksihlkw)*","FALSE","FALSE"]
[null,7975,"Glade","Yes","Regional District of Central Kootenay","Kootenay",{"$nulls":7},"",{"$nulls":6},"","",null,"",null,null,"",null,"Glade","N",{"v":49.396358,"d":"49.39636"},{"v":-117.535373,"d":"-117.53537"},"http://www.google.com/maps/place/49.396358,-117.535373",7975,"Rural",418,195,"Yes","No","Yes","No ","Glade","FALSE","FALSE"]
[null,50533,"Glen Vowell*","No","Regional District of Kitimat-Stikine","North Coast",{"$nulls":7},"",{"$nulls":6},"","",null,0,null,null,0,null,"Glen Vowell","Y",{"v":55.309967275,"d":"55.30997"},{"v":-127.674359142,"d":"-127.67436"},"http://www.google.com/maps/place/55.309967275,-127.674359142",50533,"Rural First Nations Primary Reserve",510,184,"No","No","No","No ","Glen Vowell*","FALSE","FALSE"]
[null,8297,"Glenemma","No","Columbia-Shuswap Regional District","Thompson--Okanagan",{"$nulls":7},"",{"$nulls":6},"","",null,"",null,null,"",null,"Glenemma","N",50.46937,{"v":-119.352475,"d":"-119.35248"},"http://www.google.com/maps/place/50.46937,-119.352475",8297,"Rural",310,130,"No","Yes","No","No ","Glenemma","FALSE","FALSE"]
[null,100105,"Glenlily","No","Regional District of Central Kootenay","Kootenay",{"$nulls":7},"",{"$nulls":6},"","",null,"",null,null,"",null,"Glenlily","N",{"v":49.05,"d":"49.05000"},-116.16667,"http://www.google.com/maps/place/49.05,-116.16667",100105,"Rural",83,43,"No","Yes","Yes","No ","Glenlily","FALSE","FALSE"]
[null,7981,"Glenmerry","Yes","Regional District of Kootenay Boundary","Kootenay",{"$nulls":7},"",{"$nulls":6},"","",null,"",null,null,"",null,"Glenmerry","N",{"v":49.100001,"d":"49.10000"},{"v":-117.666699,"d":"-117.66670"},"http://www.google.com/maps/place/49.100001,-117.666699",7981,"Rural",3165,1475,"Yes","No","Yes","No ","Glenmerry","FALSE","FALSE"]
[null,8136,"Glenrosa","Yes","Regional District of Central Okanagan","Thompson--Okanagan",{"$nulls":7},"",{"$nulls":6},"","",null,"",null,null,"",null,"Glenrosa","N",{"v":49.847165,"d":"49.84717"},-119.66732,"http://www.google.com/maps/place/49.847165,-119.66732",8136,"Urban",832,298,"Yes","No","Yes","No ","Glenrosa","FALSE","FALSE"]
[null,8172,"Gold Bridge","No","Squamish-Lillooet Regional District","Lower Mainland--Southwest",{"$nulls":7},"",{"$nulls":6},"","",null,"",null,null,"",null,"Gold Bridge","N",{"v":50.85,"d":"50.85000"},{"v":-122.833301,"d":"-122.83330"},"http://www.google.com/maps/place/50.85,-122.833301",8172,"Rural",67,184,"No","Yes","Yes","No ","Gold Bridge","FALSE","FALSE"]
[null,8626,"Gold River","No","Strathcona Regional District","Vancouver Island and Coast",{"$nulls":7},"",{"$nulls":6},"","",null,"",null,null,"",null,"Gold River","N",{"v":49.780695,"d":"49.78070"},{"v":-126.051864,"d":"-126.05186"},"http://www.google.com/maps/place/49.780695,-126.051864",8626,"Rural",1212,789,"No","Yes","Yes","No ","Gold River","FALSE","FALSE"]
[null,8335,"Golden","No","Columbia-Shuswap Regional District","Thompson--Okanagan",{"$nulls":7},"",{"$nulls":6},"","",null,"",null,null,"",null,"Golden","N",{"v":51.294882,"d":"51.29488"},{"v":-116.963859,"d":"-116.96386"},"http://www.google.com/maps/place/51.294882,-116.963859",8335,"Rural",2959,1403,"No","Yes","Yes","No ","Golden","FALSE","FALSE"]
[null,8538,"Good Hope","No","Central Coast Regional District","Vancouver Island and Coast",{"$nulls":7},"",{"$nulls":6},"","",null,"",null,null,"",null,"Good Hope","N",{"v":51.569548,"d":"51.56955"},{"v":-127.514551,"d":"-127.51455"},"http://www.google.com/maps/place/51.569548,-127.514551",8538,"Rural",1,1,"No","Yes","No","No ","Good Hope","FALSE","FALSE"]
[null,50504,"Good Hope Lake (Dease River)*","No","Stikine Regional District (Unincorporated)","Nechako",{"$nulls":7},"",{"$nulls":6},"","",null,0,null,null,0,null,"Good Hope Lake (Dease River)","Y",{"v":59.294676499,"d":"59.29468"},{"v":-129.288208096,"d":"-129.28821"},"http://www.google.com/maps/place/59.294676499,-129.288208096",50504,"Rural First Nations Primary Reserve",15,6,"No","Yes","Yes","No ","Good Hope Lake (Dease River)*","FALSE","FALSE"]
[null,8945,"Goodlow","No","Peace River Regional District","Northeast",{"$nulls":7},"",{"$nulls":6},"","",null,"",null,null,"",null,"Goodlow","N",{"v":56.333645,"d":"56.33365"},{"v":-120.136478,"d":"-120.13648"},"http://www.google.com/maps/place/56.333645,-120.136478",8945,"Rural",28,12,"No","Yes","No","No ","Goodlow","FALSE","FALSE"]
[null,8537,"Goose Bay","No","Central Coast Regional District","Vancouver Island and Coast",{"$nulls":7},"",{"$nulls":6},"","",null,"",null,null,"",null,"Goose Bay","N",{"v":51.38,"d":"51.38000"},{"v":-127.657176,"d":"-127.65718"},"http://www.google.com/maps/place/51.38,-127.657176",8537,"Rural",1,1,"No","Yes","Yes","No ","Goose Bay","FALSE","FALSE"]
[null,100140,"Grainger Road, Columbia Lake","Yes","Regional District of East Kootenay","Kootenay",{"$nulls":7},"",{"$nulls":6},"","",null,"",null,null,"",null,"Grainger Road, Columbia Lake","N",{"v":50.18045893,"d":"50.18046"},{"v":-115.81673668,"d":"-115.81674"},"http://www.google.com/maps/place/50.18045893,-115.81673668",100140,"Rural",154,85,"Yes","No","Yes","No ","Grainger Road, Columbia Lake","FALSE","FALSE"]
[null,7985,"Grand Forks","Yes","Regional District of Kootenay Boundary","Kootenay",{"$nulls":7},"",{"$nulls":6},"","",null,"",null,null,"",null,"Grand Forks","N",{"v":49.029024,"d":"49.02902"},{"v":-118.453272,"d":"-118.45327"},"http://www.google.com/maps/place/49.029024,-118.453272",7985,"Rural",4259,1992,"Yes","No","Yes","No ","Grand Forks","FALSE","FALSE"]
[null,8932,"Grand Haven","Yes","Peace River Regional District","Northeast",{"$nulls":7},"",{"$nulls":6},"","",null,"",null,null,"",null,"Grand Haven","N",{"v":56.240206,"d":"56.24021"},{"v":-120.898661,"d":"-120.89866"},"http://www.google.com/maps/place/56.240206,-120.898661",8932,"Rural",6893,3566,"Yes","No","Yes","No ","Grand Haven","FALSE","FALSE"]
[null,8794,"Granisle","No","Bulkley Nechako Regional District","Nechako",{"$nulls":7},"",{"$nulls":6},"","",null,"",null,null,"",null,"Granisle","N",{"v":54.884416,"d":"54.88442"},{"v":-126.213078,"d":"-126.21308"},"http://www.google.com/maps/place/54.884416,-126.213078",8794,"Rural",303,285,"No","No","No","No ","Granisle","FALSE","FALSE"]
[null,8762,"Granite Bay","No","Strathcona Regional District","Vancouver Island and Coast",{"$nulls":7},"",{"$nulls":6},"","",null,"",null,null,"",null,"Granite Bay","N",{"v":50.233299,"d":"50.23330"},{"v":-125.3,"d":"-125.30000"},"http://www.google.com/maps/place/50.233299,-125.3",8762,"Rural",26,15,"No","Yes","Yes","No ","Granite Bay","FALSE","FALSE"]
[null,8742,"Grantham","No","Comox Valley Regional District","Vancouver Island and Coast",{"$nulls":7},"",{"$nulls":6},"","",null,"",null,null,"",null,"Grantham","N",{"v":49.762775,"d":"49.76278"},-125.02132,"http://www.google.com/maps/place/49.762775,-125.02132",8742,"Rural",758,325,"No","No","Yes","No ","Grantham","FALSE","FALSE"]
[null,7927,"Grasmere","No","Regional District of East Kootenay","Kootenay",{"$nulls":7},"",{"$nulls":6},"","",null,"",null,null,"",null,"Grasmere","N",{"v":49.1,"d":"49.10000"},{"v":-115.0833,"d":"-115.08330"},"http://www.google.com/maps/place/49.1,-115.0833",7927,"Rural",86,74,"No","Yes","Yes","No ","Grasmere","FALSE","FALSE"]
[null,8812,"Grassy Plains*","No","Bulkley Nechako Regional District","Nechako",{"$nulls":7},"",{"$nulls":6},"","",null,0,null,null,0,null,"Grassy Plains","Y",{"v":53.966992,"d":"53.96699"},{"v":-125.888129,"d":"-125.88813"},"http://www.google.com/maps/place/53.966992,-125.888129",8812,"Rural First Nations Secondary Reserve",99,48,"No","Yes","Yes","No ","Grassy Plains*","FALSE","FALSE"]
[null,8452,"Gravelle Ferry","No","Cariboo Regional District","Cariboo",{"$nulls":7},"",{"$nulls":6},"","",null,"",null,null,"",null,"Gravelle Ferry","N",{"v":52.849999,"d":"52.85000"},{"v":-122.2333,"d":"-122.23330"},"http://www.google.com/maps/place/52.849999,-122.2333",8452,"Rural",14,6,"No","Yes","No","No ","Gravelle Ferry","FALSE","FALSE"]
[null,9036,"Gray Creek","No","Regional District of Central Kootenay","Kootenay",{"$nulls":7},"",{"$nulls":6},"","",null,"",null,null,"",null,"Gray Creek","N",{"v":49.6333,"d":"49.63330"},{"v":-116.783299,"d":"-116.78330"},"http://www.google.com/maps/place/49.6333,-116.783299",9036,"Rural",122,140,"No","Yes","Yes","No ","Gray Creek","FALSE","FALSE"]
[null,7988,"Greenwood","Yes","Regional District of Kootenay Boundary","Kootenay",{"$nulls":7},"",{"$nulls":6},"","",null,"",null,null,"",null,"Greenwood","N",{"v":49.0949,"d":"49.09490"},{"v":-118.676274,"d":"-118.67627"},"http://www.google.com/maps/place/49.0949,-118.676274",7988,"Rural",529,335,"Yes","No","Yes","No ","Greenwood","FALSE","FALSE"]
[null,8304,"Grindrod","No","Regional District of North Okanagan","Thompson--Okanagan",{"$nulls":7},"",{"$nulls":6},"","",null,"",null,null,"",null,"Grindrod","N",{"v":50.627637,"d":"50.62764"},{"v":-119.122547,"d":"-119.12255"},"http://www.google.com/maps/place/50.627637,-119.122547",8304,"Rural",907,421,"No","No","Yes","No ","Grindrod","FALSE","FALSE"]
[null,8917,"Groundbirch","No","Peace River Regional District","Northeast",{"$nulls":7},"",{"$nulls":6},"","",null,"",null,null,"",null,"Groundbirch","N",{"v":55.779964,"d":"55.77996"},{"v":-120.923326,"d":"-120.92333"},"http://www.google.com/maps/place/55.779964,-120.923326",8917,"Rural",45,23,"No","Yes","Yes","No ","Groundbirch","FALSE","FALSE"]
[null,50724,"Gwa'Sala-Nakwaxda'xw*","Yes","Regional District of Mount Waddington","Vancouver Island and Coast",{"$nulls":7},"",{"$nulls":6},"","",null,0,null,null,0,null,"Gwa'Sala-Nakwaxda'xw","Y",{"v":50.734170408,"d":"50.73417"},{"v":-127.49641098,"d":"-127.49641"},"http://www.google.com/maps/place/50.734170408,-127.49641098",50724,"Rural First Nations Primary Reserve",3732,1807,"Yes","No","No","No ","Gwa'Sala-Nakwaxda'xw*","FALSE","FALSE"]
[null,50627,"Gwawaenuk Tribe*","No","Regional District of Mount Waddington","Vancouver Island and Coast",{"$nulls":7},"",{"$nulls":6},"","",null,0,null,null,0,null,"Gwawaenuk Tribe","Y",{"v":50.924020743,"d":"50.92402"},{"v":-126.82213322,"d":"-126.82213"},"http://www.google.com/maps/place/50.924020743,-126.82213322",50627,"Rural First Nations Primary Reserve",5,2,"No","Yes","Yes","No ","Gwawaenuk Tribe*","FALSE","FALSE"]
[null,8523,"Hagensborg","No","Central Coast Regional District","Vancouver Island and Coast",{"$nulls":7},"",{"$nulls":6},"","",null,"",null,null,"",null,"Hagensborg","N",{"v":52.386412,"d":"52.38641"},{"v":-126.556937,"d":"-126.55694"},"http://www.google.com/maps/place/52.386412,-126.556937",8523,"Rural",213,111,"No","Yes","Yes","No ","Hagensborg","FALSE","FALSE"]
[null,50534,"Hagwilget (Hagwilget Village)*","No","Regional District of Kitimat-Stikine","North Coast",{"$nulls":7},"",{"$nulls":6},"","",null,0,null,null,0,null,"Hagwilget (Hagwilget Village)","Y",{"v":55.253538461,"d":"55.25354"},{"v":-127.600300568,"d":"-127.60030"},"http://www.google.com/maps/place/55.253538461,-127.600300568",50534,"Rural First Nations Primary Reserve",755,383,"No","No","Yes","No ","Hagwilget (Hagwilget Village)*","FALSE","FALSE"]
[null,8049,"Haig*","Yes","Fraser Valley Regional District","Lower Mainland--Southwest",{"$nulls":7},"",{"$nulls":6},"","",null,0,null,null,0,null,"Haig","Y",{"v":49.396721,"d":"49.39672"},-121.45304,"http://www.google.com/maps/place/49.396721,-121.45304",8049,"Rural First Nations Secondary Reserve",201,89,"Yes","No","Yes","No ","Haig*","FALSE","FALSE"]
[null,50645,"Halalt*","Yes","Cowichan Valley Regional District","Vancouver Island and Coast",{"$nulls":7},"",{"$nulls":6},"","",null,0,null,null,0,null,"Halalt","Y",{"v":48.873995042,"d":"48.87400"},{"v":-123.696124543,"d":"-123.69612"},"http://www.google.com/maps/place/48.873995042,-123.696124543",50645,"Rural First Nations Primary Reserve",712,273,"Yes","No","No","No ","Halalt*","FALSE","FALSE"]
[null,100106,"Halcyon Hot Springs","No","Regional District of Central Kootenay","Kootenay",{"$nulls":7},"",{"$nulls":6},"","",null,"",null,null,"",null,"Halcyon Hot Springs","N",{"v":50.524723,"d":"50.52472"},{"v":-117.901389,"d":"-117.90139"},"http://www.google.com/maps/place/50.524723,-117.901389",100106,"Rural",25,15,"No","Yes","Yes","No ","Halcyon Hot Springs","FALSE","FALSE"]
[null,8187,"Halfmoon Bay","Yes","Sunshine Coast Regional District","Lower Mainland--Southwest",{"$nulls":7},"",{"$nulls":6},"","",null,"",null,null,"",null,"Halfmoon Bay","N",{"v":49.514568,"d":"49.51457"},-123.90862,"http://www.google.com/maps/place/49.514568,-123.90862",8187,"Rural",659,476,"Yes","No","Yes","No ","Halfmoon Bay","FALSE","FALSE"]
[null,50546,"Halfway River First Nation*","No","Peace River Regional District","Northeast",{"$nulls":7},"",{"$nulls":6},"","",null,0,null,null,0,null,"Halfway River First Nation","Y",{"v":56.513367,"d":"56.51337"},{"v":-121.964969,"d":"-121.96497"},"http://www.google.com/maps/place/56.513367,-121.964969",50546,"Rural First Nations Primary Reserve",172,61,"No","Yes","Yes","No ","Halfway River First Nation*","FALSE","FALSE"]
[null,9037,"Hall","No","Regional District of Central Kootenay","Kootenay",{"$nulls":7},"",{"$nulls":6},"","",null,"",null,null,"",null,"Hall","N",{"v":49.373975,"d":"49.37398"},-117.24261,"http://www.google.com/maps/place/49.373975,-117.24261",9037,"Rural",63,30,"No","Yes","Yes","No ","Hall","FALSE","FALSE"]
[null,100109,"Hall's Landing","No","Columbia-Shuswap Regional District","Thompson--Okanagan",{"$nulls":7},"",{"$nulls":6},"","",null,"",null,null,"",null,"Hall's Landing","N",50.69527,-117.98157,"http://www.google.com/maps/place/50.69527,-117.98157",100109,"Rural",1,1,"No","Yes","Yes","No ","Hall's Landing","FALSE","FALSE"]
[null,8506,"Hanceville","No","Cariboo Regional District","Cariboo",{"$nulls":7},"",{"$nulls":6},"","",null,"",null,null,"",null,"Hanceville","N",{"v":51.941667,"d":"51.94167"},{"v":-123.098612,"d":"-123.09861"},"http://www.google.com/maps/place/51.941667,-123.098612",8506,"Rural",183,50,"No","Yes","Yes","No ","Hanceville","FALSE","FALSE"]
[null,9054,"Hardwicke Island","No","Strathcona Regional District","Vancouver Island and Coast",{"$nulls":7},"",{"$nulls":6},"","",null,"",null,null,"",null,"Hardwicke Island","N",{"v":50.416699,"d":"50.41670"},{"v":-125.916701,"d":"-125.91670"},"http://www.google.com/maps/place/50.416699,-125.916701",9054,"Rural",2,4,"No","Yes","Yes","No ","Hardwicke Island","FALSE","FALSE"]
[null,8047,"Harrison Hot Springs","Yes","Fraser Valley Regional District","Lower Mainland--Southwest",{"$nulls":7},"",{"$nulls":6},"","",null,"",null,null,"",null,"Harrison Hot Springs","N",{"v":49.3,"d":"49.30000"},{"v":-121.783301,"d":"-121.78330"},"http://www.google.com/maps/place/49.3,-121.783301",8047,"Rural",1681,1000,"Yes","No","Yes","No ","Harrison Hot Springs","FALSE","FALSE"]
[null,8052,"Harrison Mills","Yes","Fraser Valley Regional District","Lower Mainland--Southwest",{"$nulls":7},"",{"$nulls":6},"","",null,"",null,null,"",null,"Harrison Mills","N",{"v":49.255887,"d":"49.25589"},{"v":-121.948779,"d":"-121.94878"},"http://www.google.com/maps/place/49.255887,-121.948779",8052,"Rural",517,364,"Yes","No","Yes","No ","Harrison Mills","FALSE","FALSE"]
[null,8338,"Harrogate","No","Columbia-Shuswap Regional District","Thompson--Okanagan",{"$nulls":7},"",{"$nulls":6},"","",null,"",null,null,"",null,"Harrogate","N",{"v":50.9833,"d":"50.98330"},{"v":-116.450001,"d":"-116.45000"},"http://www.google.com/maps/place/50.9833,-116.450001",8338,"Rural",31,19,"No","Yes","No","No ","Harrogate","FALSE","FALSE"]
[null,7952,"Harrop","Yes","Regional District of Central Kootenay","Kootenay",{"$nulls":7},"",{"$nulls":6},"","",null,"",null,null,"",null,"Harrop","N",{"v":49.601643,"d":"49.60164"},{"v":-117.053224,"d":"-117.05322"},"http://www.google.com/maps/place/49.601643,-117.053224",7952,"Rural",96,68,"Yes","No","Yes","No ","Harrop","FALSE","FALSE"]
[null,50675,"Hartley Bay (Gitga'at First Nation)*","No","North Coast Regional District","North Coast",{"$nulls":7},"",{"$nulls":6},"","",null,0,null,null,0,null,"Hartley Bay (Gitga'at First Nation)","Y",{"v":53.424005194,"d":"53.42401"},{"v":-129.253277582,"d":"-129.25328"},"http://www.google.com/maps/place/53.424005194,-129.253277582",50675,"Rural First Nations Primary Reserve",81,73,"No","Yes","Yes","No ","Hartley Bay (Gitga'at First Nation)*","FALSE","FALSE"]
[null,8910,{"$f":"HYPERLINK(AG481,AP481)","v":"Hasler Flat"},"No","Peace River Regional District","Northeast",{"$nulls":7},{"$f":"IF(COUNT(V481)=0, \"\", IF(V481>=0,\"Sufficient Capacity\", IF(V481<0,\"Not Enough Capacity\")))","v":""},{"$nulls":6},{"$f":"IF(OR(ISBLANK(H481),ISBLANK(I481),ISBLANK(J481)), \"\",(H481*I481/J481))","v":""},{"$f":"IF(AND(COUNT(L481,U481)=2, OR($M$10=\"Last-Mile\", $M$10=\"Transport & Last-Mile\")), L481-U481, \"\")","v":""},null,{"$f":"IF(AD481=\"Y\",COUNT(H481), \"\")","v":""},null,null,{"$f":"IF(AD481=\"Y\",COUNT(P481), \"\")","v":""},null,"Hasler Flat","N",{"v":55.611099,"d":"55.61110"},{"v":-121.966949,"d":"-121.96695"},"http://www.google.com/maps/place/55.611099,-121.966949",8910,"Rural",80,37,"No","Yes","No","No ",{"$f":"IF(AD481=\"Y\", CONCATENATE(AC481,\"*\"), AC481)","v":"Hasler Flat"},{"$f":"IF(G481=\"Last-Mile\",\"TRUE\",IF(G481=\"Transport & Last-Mile\",\"TRUE\",\"FALSE\"))","v":"FALSE"},{"$f":"IF(G481=\"Transport\",\"TRUE\",IF(G481=\"Transport & Last-Mile\",\"TRUE\",\"FALSE\"))","v":"FALSE"}]
[null,8100,"Hatzic Island","Yes","Fraser Valley Regional District","Lower Mainland--Southwest",{"$nulls":7},"",{"$nulls":6},"","",null,"",null,null,"",null,"Hatzic Island","N",{"v":49.162449,"d":"49.16245"},{"v":-122.236412,"d":"-122.23641"},"http://www.google.com/maps/place/49.162449,-122.236412",8100,"Rural",5342,2138,"Yes","No","Yes","No ","Hatzic Island","FALSE","FALSE"]
[null,50531,"Hazelton (Gitanmaax)*","Yes","Regional District of Kitimat-Stikine","North Coast",{"$nulls":7},"",{"$nulls":6},"","",null,0,null,null,0,null,"Hazelton (Gitanmaax)","Y",{"v":55.255671125,"d":"55.25567"},{"v":-127.675038195,"d":"-127.67504"},"http://www.google.com/maps/place/55.255671125,-127.675038195",50531,"Rural First Nations Secondary Reserve",818,317,"Yes","No","Yes","No ","Hazelton (Gitanmaax)*","FALSE","FALSE"]
[null,8743,"Headquarters","No","Comox Valley Regional District","Vancouver Island and Coast",{"$nulls":7},"",{"$nulls":6},"","",null,"",null,null,"",null,"Headquarters","N",{"v":49.764649,"d":"49.76465"},{"v":-125.114606,"d":"-125.11461"},"http://www.google.com/maps/place/49.764649,-125.114606",8743,"Rural",651,269,"No","No","No","No ","Headquarters","FALSE","FALSE"]
[null,50625,"Health Bay (Kwikwasut'inuxw Haxwa'mis)*","No","Regional District of Mount Waddington","Vancouver Island and Coast",{"$nulls":7},"",{"$nulls":6},"","",null,0,null,null,0,null,"Health Bay (Kwikwasut'inuxw Haxwa'mis)","Y",{"v":50.696396786,"d":"50.69640"},{"v":-126.600633263,"d":"-126.60063"},"http://www.google.com/maps/place/50.696396786,-126.600633263",50625,"Rural First Nations Primary Reserve",27,20,"No","Yes","No","No ","Health Bay (Kwikwasut'inuxw Haxwa'mis)*","FALSE","FALSE"]
[null,7999,"Hedley","No","Regional District of Okanagan-Similkameen","Thompson--Okanagan",{"$nulls":7},"",{"$nulls":6},"","",null,"",null,null,"",null,"Hedley","N",{"v":49.360365,"d":"49.36037"},{"v":-120.071775,"d":"-120.07178"},"http://www.google.com/maps/place/49.360365,-120.071775",7999,"Rural",53,31,"No","Yes","No","No ","Hedley","FALSE","FALSE"]
[null,8376,"Heffley Creek","Yes","Thompson-Nicola Regional District","Thompson--Okanagan",{"$nulls":7},"",{"$nulls":6},"","",null,"",null,null,"",null,"Heffley Creek","N",{"v":50.858306,"d":"50.85831"},{"v":-120.270636,"d":"-120.27064"},"http://www.google.com/maps/place/50.858306,-120.270636",8376,"Rural",679,346,"Yes","No","No","No ","Heffley Creek","FALSE","FALSE"]
[null,8043,"Hemlock Valley","No","Fraser Valley Regional District","Lower Mainland--Southwest",{"$nulls":7},"",{"$nulls":6},"","",null,"",null,null,"",null,"Hemlock Valley","N",{"v":49.376944,"d":"49.37694"},{"v":-121.935277,"d":"-121.93528"},"http://www.google.com/maps/place/49.376944,-121.935277",8043,"Rural",48,182,"No","Yes","No","No ","Hemlock Valley","FALSE","FALSE"]
[null,8755,"Heriot Bay","No","Strathcona Regional District","Vancouver Island and Coast",{"$nulls":7},"",{"$nulls":6},"","",null,"",null,null,"",null,"Heriot Bay","N",{"v":50.100242,"d":"50.10024"},{"v":-125.212731,"d":"-125.21273"},"http://www.google.com/maps/place/50.100242,-125.212731",8755,"Rural",812,427,"No","Yes","No","No ","Heriot Bay","FALSE","FALSE"]
[null,50661,"Hesquiaht*","No","Regional District of Alberni-Clayoquot","Vancouver Island and Coast",{"$nulls":7},"",{"$nulls":6},"","",null,0,null,null,0,null,"Hesquiaht","Y",{"v":49.366486915,"d":"49.36649"},{"v":-126.273015536,"d":"-126.27302"},"http://www.google.com/maps/place/49.366486915,-126.273015536",50661,"Rural First Nations Primary Reserve",44,40,"No","Yes","Yes","No ","Hesquiaht*","FALSE","FALSE"]
[null,8585,"Hesquiat*","No","Regional District of Alberni-Clayoquot","Vancouver Island and Coast",{"$nulls":7},"",{"$nulls":6},"","",null,0,null,null,0,null,"Hesquiat","Y",49.39585,{"v":-126.470508,"d":"-126.47051"},"http://www.google.com/maps/place/49.39585,-126.470508",8585,"Rural First Nations Secondary Reserve",5,3,"No","Yes","No","No ","Hesquiat*","FALSE","FALSE"]
[null,9053,"Heydon Bay*","No","Strathcona Regional District","Vancouver Island and Coast",{"$nulls":7},"",{"$nulls":6},"","",null,0,null,null,0,null,"Heydon Bay","Y",50.57813,-125.57623,"http://www.google.com/maps/place/50.57813,-125.57623",9053,"Rural First Nations Secondary Reserve",2,4,"No","Yes","Yes","No ","Heydon Bay*","FALSE","FALSE"]
[null,50703,"High Bar*","No","Thompson-Nicola Regional District","Thompson--Okanagan",{"$nulls":7},"",{"$nulls":6},"","",null,0,null,null,0,null,"High Bar","Y",{"v":51.113042994,"d":"51.11304"},{"v":-122.018082129,"d":"-122.01808"},"http://www.google.com/maps/place/51.113042994,-122.018082129",50703,"Rural First Nations Primary Reserve",0,1,"No","Yes","No","No ","High Bar*","FALSE","FALSE"]
[null,8651,"Highlands","Yes","Capital Regional District","Vancouver Island and Coast",{"$nulls":7},"",{"$nulls":6},"","",null,"",null,null,"",null,"Highlands","N",{"v":48.514355,"d":"48.51436"},{"v":-123.516292,"d":"-123.51629"},"http://www.google.com/maps/place/48.514355,-123.516292",8651,"Rural",645,253,"Yes","No","No","No ","Highlands","FALSE","FALSE"]
[null,8714,"Hilliers","Yes","Regional District of Nanaimo","Vancouver Island and Coast",{"$nulls":7},"",{"$nulls":6},"","",null,"",null,null,"",null,"Hilliers","N",{"v":49.306811,"d":"49.30681"},{"v":-124.483006,"d":"-124.48301"},"http://www.google.com/maps/place/49.306811,-124.483006",8714,"Rural",1485,666,"Yes","No","No","No ","Hilliers","FALSE","FALSE"]
[null,8024,"Hills","No","Regional District of Central Kootenay","Kootenay",{"$nulls":7},"",{"$nulls":6},"","",null,"",null,null,"",null,"Hills","N",{"v":50.108881,"d":"50.10888"},{"v":-117.493321,"d":"-117.49332"},"http://www.google.com/maps/place/50.108881,-117.493321",8024,"Rural",14,10,"No","Yes","No","No ","Hills","FALSE","FALSE"]
[null,8434,"Hixon","No","Regional District of Fraser-Fort George","Cariboo",{"$nulls":7},"",{"$nulls":6},"","",null,"",null,null,"",null,"Hixon","N",{"v":53.420422,"d":"53.42042"},{"v":-122.586186,"d":"-122.58619"},"http://www.google.com/maps/place/53.420422,-122.586186",8434,"Rural",75,37,"No","Yes","Yes","No ","Hixon","FALSE","FALSE"]
[null,8542,"Holberg","No","Regional District of Mount Waddington","Vancouver Island and Coast",{"$nulls":7},"",{"$nulls":6},"","",null,"",null,null,"",null,"Holberg","N",{"v":50.662326,"d":"50.66233"},{"v":-128.011014,"d":"-128.01101"},"http://www.google.com/maps/place/50.662326,-128.011014",8542,"Rural",35,50,"No","Yes","Yes","No ","Holberg","FALSE","FALSE"]
[null,8122,"Hollyburn","Yes","Metro Vancouver Regional District","Lower Mainland--Southwest",{"$nulls":7},"",{"$nulls":6},"","",null,"",null,null,"",null,"Hollyburn","N",49.33243,{"v":-123.163312,"d":"-123.16331"},"http://www.google.com/maps/place/49.33243,-123.163312",8122,"Urban",19863,9199,"Yes","No","Yes","No ","Hollyburn","FALSE","FALSE"]
[null,8318,"Holmwood","Yes","Thompson-Nicola Regional District","Thompson--Okanagan",{"$nulls":7},"",{"$nulls":6},"","",null,"",null,null,"",null,"Holmwood","N",{"v":50.618933,"d":"50.61893"},{"v":-119.954043,"d":"-119.95404"},"http://www.google.com/maps/place/50.618933,-119.954043",8318,"Rural",362,170,"Yes","No","Yes","No ","Holmwood","FALSE","FALSE"]
[null,50552,"Homalco*","No","Strathcona Regional District","Vancouver Island and Coast",{"$nulls":7},"",{"$nulls":6},"","",null,0,null,null,0,null,"Homalco","Y",{"v":49.951639738,"d":"49.95164"},{"v":-125.243608422,"d":"-125.24361"},"http://www.google.com/maps/place/49.951639738,-125.243608422",50552,"Rural First Nations Primary Reserve",178,68,"No","Yes","Yes","No ","Homalco*","FALSE","FALSE"]
[null,8611,"Honeymoon Bay","Yes","Cowichan Valley Regional District","Vancouver Island and Coast",{"$nulls":7},"",{"$nulls":6},"","",null,"",null,null,"",null,"Honeymoon Bay","N",{"v":48.815008,"d":"48.81501"},{"v":-124.173055,"d":"-124.17306"},"http://www.google.com/maps/place/48.815008,-124.173055",8611,"Rural",442,289,"Yes","No","Yes","No ","Honeymoon Bay","FALSE","FALSE"]
[null,8044,"Hope","Yes","Fraser Valley Regional District","Lower Mainland--Southwest",{"$nulls":7},"",{"$nulls":6},"","",null,"",null,null,"",null,"Hope","N",{"v":49.380213,"d":"49.38021"},{"v":-121.429856,"d":"-121.42986"},"http://www.google.com/maps/place/49.380213,-121.429856",8044,"Rural",4718,2360,"Yes","No","Yes","No ","Hope","FALSE","FALSE"]
[null,8724,"Hornby Island","No","Comox Valley Regional District","Vancouver Island and Coast",{"$nulls":7},"",{"$nulls":6},"","",null,"",null,null,"",null,"Hornby Island","N",49.52266,{"v":-124.642498,"d":"-124.64250"},"http://www.google.com/maps/place/49.52266,-124.642498",8724,"Rural",414,503,"No","Yes","Yes","No ","Hornby Island","FALSE","FALSE"]
[null,8446,"Horsefly","No","Cariboo Regional District","Cariboo",{"$nulls":7},"",{"$nulls":6},"","",null,"",null,null,"",null,"Horsefly","N",{"v":52.333299,"d":"52.33330"},{"v":-121.416701,"d":"-121.41670"},"http://www.google.com/maps/place/52.333299,-121.416701",8446,"Rural",137,65,"No","Yes","No","No ","Horsefly","FALSE","FALSE"]
[null,8173,"Horseshoe Bay","Yes","Metro Vancouver Regional District","Lower Mainland--Southwest",{"$nulls":7},"",{"$nulls":6},"","",null,"",null,null,"",null,"Horseshoe Bay","N",{"v":49.367379,"d":"49.36738"},{"v":-123.273102,"d":"-123.27310"},"http://www.google.com/maps/place/49.367379,-123.273102",8173,"Urban",5586,2300,"Yes","No","Yes","No ","Horseshoe Bay","FALSE","FALSE"]
[null,7937,"Hosmer","Yes","Regional District of East Kootenay","Kootenay",{"$nulls":7},"",{"$nulls":6},"","",null,"",null,null,"",null,"Hosmer","N",{"v":49.589651,"d":"49.58965"},{"v":-114.964499,"d":"-114.96450"},"http://www.google.com/maps/place/49.589651,-114.964499",7937,"Rural",123,67,"Yes","No","No","No ","Hosmer","FALSE","FALSE"]
[null,8590,"Hot Springs Cove*","No","Regional District of Alberni-Clayoquot","Vancouver Island and Coast",{"$nulls":7},"",{"$nulls":6},"","",null,0,null,null,0,null,"Hot Springs Cove","Y",{"v":49.3683298,"d":"49.36833"},{"v":-126.2723705,"d":"-126.27237"},"http://www.google.com/maps/place/49.3683298,-126.2723705",8590,"Rural First Nations Secondary Reserve",44,40,"No","Yes","No","No ","Hot Springs Cove*","FALSE","FALSE"]
[null,8793,"Houston","Yes","Bulkley Nechako Regional District","Nechako",{"$nulls":7},"",{"$nulls":6},"","",null,"",null,null,"",null,"Houston","N",{"v":54.396987,"d":"54.39699"},{"v":-126.651832,"d":"-126.65183"},"http://www.google.com/maps/place/54.396987,-126.651832",8793,"Rural",2046,1005,"Yes","No","No","No ","Houston","FALSE","FALSE"]
[null,8352,"Howser","No","Regional District of Central Kootenay","Kootenay",{"$nulls":7},"",{"$nulls":6},"","",null,"",null,null,"",null,"Howser","N",{"v":50.3,"d":"50.30000"},{"v":-116.95,"d":"-116.95000"},"http://www.google.com/maps/place/50.3,-116.95",8352,"Rural",1,1,"No","Yes","No","No ","Howser","FALSE","FALSE"]
[null,8924,"Hudson's Hope","Yes","Peace River Regional District","Northeast",{"$nulls":7},"",{"$nulls":6},"","",null,"",null,null,"",null,"Hudson's Hope","N",{"v":56.031944,"d":"56.03194"},{"v":-121.906943,"d":"-121.90694"},"http://www.google.com/maps/place/56.031944,-121.906943",8924,"Rural",464,257,"Yes","No","No","No ","Hudson's Hope","FALSE","FALSE"]
[null,8298,"Hullcar","No","Regional District of North Okanagan","Thompson--Okanagan",{"$nulls":7},"",{"$nulls":6},"","",null,"",null,null,"",null,"Hullcar","N",{"v":50.503031,"d":"50.50303"},{"v":-119.269805,"d":"-119.26981"},"http://www.google.com/maps/place/50.503031,-119.269805",8298,"Rural",187,77,"No","Yes","No","No ","Hullcar","FALSE","FALSE"]
[null,8072,"Huntingdon","Yes","Fraser Valley Regional District","Lower Mainland--Southwest",{"$nulls":7},"",{"$nulls":6},"","",null,"",null,null,"",null,"Huntingdon","N",{"v":49.005104,"d":"49.00510"},{"v":-122.265586,"d":"-122.26559"},"http://www.google.com/maps/place/49.005104,-122.265586",8072,"Rural",15704,6260,"Yes","No","No","No ","Huntingdon","FALSE","FALSE"]
[null,8881,"Hunts Inlet","No","North Coast Regional District","North Coast",{"$nulls":7},"",{"$nulls":6},"","",null,"",null,null,"",null,"Hunts Inlet","N",{"v":54.066837,"d":"54.06684"},{"v":-130.443473,"d":"-130.44347"},"http://www.google.com/maps/place/54.066837,-130.443473",8881,"Rural",10,18,"No","Yes","No","No ","Hunts Inlet","FALSE","FALSE"]
[null,50664,"Hupacasath First Nation*","Yes","Regional District of Alberni-Clayoquot","Vancouver Island and Coast",{"$nulls":7},"",{"$nulls":6},"","",null,0,null,null,0,null,"Hupacasath First Nation","Y",{"v":49.26579844,"d":"49.26580"},{"v":-124.825090475,"d":"-124.82509"},"http://www.google.com/maps/place/49.26579844,-124.825090475",50664,"Rural First Nations Primary Reserve",8294,3960,"Yes","No","No","No ","Hupacasath First Nation*","FALSE","FALSE"]
[null,7947,"Huscroft","No","Regional District of Central Kootenay","Kootenay",{"$nulls":7},"",{"$nulls":6},"","",null,"",null,null,"",null,"Huscroft","N",{"v":49.016701,"d":"49.01670"},{"v":-116.4667,"d":"-116.46670"},"http://www.google.com/maps/place/49.016701,-116.4667",7947,"Rural",544,247,"No","Yes","No","No ","Huscroft","FALSE","FALSE"]
[null,8382,"Hustalen 1 (Adams Lake)*","No","Columbia-Shuswap Regional District","Thompson--Okanagan",{"$nulls":7},"",{"$nulls":6},"","",null,0,null,null,0,null,"Hustalen 1 (Adams Lake)","Y",50.95325,{"v":-119.66673611,"d":"-119.66674"},"http://www.google.com/maps/place/50.95325,-119.66673611",8382,"Rural First Nations Secondary Reserve",21,34,"No","Yes","No","No ","Hustalen 1 (Adams Lake)*","FALSE","FALSE"]
[null,50663,"Huu-ay-aht First Nations*","No","Regional District of Alberni-Clayoquot","Vancouver Island and Coast",{"$nulls":7},"",{"$nulls":6},"","",null,0,null,null,0,null,"Huu-ay-aht First Nations","Y",{"v":48.80207854,"d":"48.80208"},{"v":-125.127155567,"d":"-125.12716"},"http://www.google.com/maps/place/48.80207854,-125.127155567",50663,"Rural First Nations Primary Reserve",94,75,"No","Yes","No","No ","Huu-ay-aht First Nations*","FALSE","FALSE"]
[null,8631,"Huu-ay-aht*","No","Regional District of Alberni-Clayoquot","Vancouver Island and Coast",{"$nulls":7},"",{"$nulls":6},"","",null,0,null,null,0,null,"Huu-ay-aht","Y",{"v":48.9,"d":"48.90000"},{"v":-125.000001,"d":"-125.00000"},"http://www.google.com/maps/place/48.9,-125.000001",8631,"Rural First Nations Secondary Reserve",5,3,"No","Yes","No","No ","Huu-ay-aht*","FALSE","FALSE"]
[null,8555,"Hyde Creek","No","Regional District of Mount Waddington","Vancouver Island and Coast",{"$nulls":7},"",{"$nulls":6},"","",null,"",null,null,"",null,"Hyde Creek","N",{"v":50.580454,"d":"50.58045"},{"v":-127.000329,"d":"-127.00033"},"http://www.google.com/maps/place/50.580454,-127.000329",8555,"Rural",338,143,"No","No","Yes","No ","Hyde Creek","FALSE","FALSE"]
[null,8448,"Hydraulic","No","Cariboo Regional District","Cariboo",{"$nulls":7},"",{"$nulls":6},"","",null,"",null,null,"",null,"Hydraulic","N",{"v":52.614799,"d":"52.61480"},{"v":-121.706996,"d":"-121.70700"},"http://www.google.com/maps/place/52.614799,-121.706996",8448,"Rural",31,30,"No","Yes","Yes","No ","Hydraulic","FALSE","FALSE"]
[null,8491,"Imperial Ranchettes","No","Cariboo Regional District","Cariboo",{"$nulls":7},"",{"$nulls":6},"","",null,"",null,null,"",null,"Imperial Ranchettes","N",{"v":51.613026,"d":"51.61303"},{"v":-121.182952,"d":"-121.18295"},"http://www.google.com/maps/place/51.613026,-121.182952",8491,"Rural",890,445,"No","No","Yes","No ","Imperial Ranchettes","FALSE","FALSE"]
[null,8015,"Invermere","Yes","Regional District of East Kootenay","Kootenay",{"$nulls":7},"",{"$nulls":6},"","",null,"",null,null,"",null,"Invermere","N",{"v":50.5007,"d":"50.50070"},{"v":-116.038191,"d":"-116.03819"},"http://www.google.com/maps/place/50.5007,-116.038191",8015,"Rural",3256,1740,"Yes","No","Yes","No ","Invermere","FALSE","FALSE"]
[null,50683,"Iskut*","No","Regional District of Kitimat-Stikine","North Coast",{"$nulls":7},"",{"$nulls":6},"","",null,0,null,null,0,null,"Iskut","Y",{"v":57.837182435,"d":"57.83718"},{"v":-129.989173096,"d":"-129.98917"},"http://www.google.com/maps/place/57.837182435,-129.989173096",50683,"Rural First Nations Primary Reserve",297,126,"No","Yes","Yes","No ","Iskut*","FALSE","FALSE"]
[null,8832,"Isle Pierre","No","Regional District of Fraser-Fort George","Cariboo",{"$nulls":7},"",{"$nulls":6},"","",null,"",null,null,"",null,"Isle Pierre","N",{"v":53.950001,"d":"53.95000"},{"v":-123.249999,"d":"-123.25000"},"http://www.google.com/maps/place/53.950001,-123.249999",8832,"Rural",54,21,"No","Yes","Yes","No ","Isle Pierre","FALSE","FALSE"]
[null,8982,"Jade City","No","Stikine Regional District (Unincorporated)","Nechako",{"$nulls":7},"",{"$nulls":6},"","",null,"",null,null,"",null,"Jade City","N",{"v":59.246902,"d":"59.24690"},{"v":-129.655043,"d":"-129.65504"},"http://www.google.com/maps/place/59.246902,-129.655043",8982,"Rural",8,4,"No","Yes","No","No ","Jade City","FALSE","FALSE"]
[null,7930,"Jaffray","No","Regional District of East Kootenay","Kootenay",{"$nulls":7},"",{"$nulls":6},"","",null,"",null,null,"",null,"Jaffray","N",{"v":49.374424,"d":"49.37442"},{"v":-115.300036,"d":"-115.30004"},"http://www.google.com/maps/place/49.374424,-115.300036",7930,"Rural",788,550,"No","Yes","No","No ","Jaffray","FALSE","FALSE"]
[null,9040,"Jersey","No","Regional District of Central Kootenay","Kootenay",{"$nulls":7},"",{"$nulls":6},"","",null,"",null,null,"",null,"Jersey","N",{"v":49.1,"d":"49.10000"},{"v":-117.233301,"d":"-117.23330"},"http://www.google.com/maps/place/49.1,-117.233301",9040,"Rural",22,18,"No","Yes","No","No ","Jersey","FALSE","FALSE"]
[null,9032,"Johnsons Landing","No","Regional District of Central Kootenay","Kootenay",{"$nulls":7},"",{"$nulls":6},"","",null,"",null,null,"",null,"Johnsons Landing","N",{"v":50.0833,"d":"50.08330"},{"v":-116.8833,"d":"-116.88330"},"http://www.google.com/maps/place/50.0833,-116.8833",9032,"Rural",69,69,"No","Yes","Yes","No ","Johnsons Landing","FALSE","FALSE"]
[null,9007,"Juskatla","No","North Coast Regional District","North Coast",{"$nulls":7},"",{"$nulls":6},"","",null,"",null,null,"",null,"Juskatla","N",{"v":53.610242,"d":"53.61024"},{"v":-132.311353,"d":"-132.31135"},"http://www.google.com/maps/place/53.610242,-132.311353",9007,"Rural",null,null,"No","No","No","No ","Juskatla","FALSE","FALSE"]
[null,8598,"Kakawis","Yes","Regional District of Alberni-Clayoquot","Vancouver Island and Coast",{"$nulls":7},"",{"$nulls":6},"","",null,"",null,null,"",null,"Kakawis","N",{"v":49.189006,"d":"49.18901"},{"v":-125.910564,"d":"-125.91056"},"http://www.google.com/maps/place/49.189006,-125.910564",8598,"Rural",511,241,"Yes","No","No","No ","Kakawis","FALSE","FALSE"]
[null,8002,"Kaleden","Yes","Regional District of Okanagan-Similkameen","Thompson--Okanagan",{"$nulls":7},"",{"$nulls":6},"","",null,"",null,null,"",null,"Kaleden","N",{"v":49.392767,"d":"49.39277"},{"v":-119.595861,"d":"-119.59586"},"http://www.google.com/maps/place/49.392767,-119.595861",8002,"Rural",1205,529,"Yes","No","Yes","No ","Kaleden","FALSE","FALSE"]
[null,8373,"Kamloops","Yes","Thompson-Nicola Regional District","Thompson--Okanagan",{"$nulls":7},"",{"$nulls":6},"","",null,"",null,null,"",null,"Kamloops","N",{"v":50.678251,"d":"50.67825"},{"v":-120.347731,"d":"-120.34773"},"http://www.google.com/maps/place/50.678251,-120.347731",8373,"Urban",22684,11949,"Yes","No","No","No ","Kamloops","FALSE","FALSE"]
[null,8378,"Kamloops*","Yes","Thompson-Nicola Regional District","Thompson--Okanagan",{"$nulls":7},"",{"$nulls":6},"","",null,0,null,null,0,null,"Kamloops","Y",{"v":50.689234,"d":"50.68923"},{"v":-120.325803,"d":"-120.32580"},"http://www.google.com/maps/place/50.689234,-120.325803",8378,"Rural First Nations Primary Reserve",22684,11949,"Yes","No","No","No ","Kamloops*","FALSE","FALSE"]
[null,50704,"Kanaka Bar*","No","Thompson-Nicola Regional District","Thompson--Okanagan",{"$nulls":7},"",{"$nulls":6},"","",null,0,null,null,0,null,"Kanaka Bar","Y",{"v":50.112176966,"d":"50.11218"},{"v":-121.5620351,"d":"-121.56204"},"http://www.google.com/maps/place/50.112176966,-121.5620351",50704,"Rural First Nations Primary Reserve",85,18,"No","Yes","No","No ","Kanaka Bar*","FALSE","FALSE"]
[null,8011,"Kaslo","No","Regional District of Central Kootenay","Kootenay",{"$nulls":7},"",{"$nulls":6},"","",null,"",null,null,"",null,"Kaslo","N",{"v":49.908588,"d":"49.90859"},-116.91121,"http://www.google.com/maps/place/49.908588,-116.91121",8011,"Rural",1260,749,"No","No","No","No ","Kaslo","FALSE","FALSE"]
[null,50563,"Katzie*","Yes","Metro Vancouver Regional District","Lower Mainland--Southwest",{"$nulls":7},"",{"$nulls":6},"","",null,0,null,null,0,null,"Katzie","Y",{"v":49.201425396,"d":"49.20143"},{"v":-122.676930484,"d":"-122.67693"},"http://www.google.com/maps/place/49.201425396,-122.676930484",50563,"Urban First Nations Primary Reserve",16904,6634,"Yes","No","Yes","No ","Katzie*","FALSE","FALSE"]
[null,8291,"Kedleston","Yes","Regional District of North Okanagan","Thompson--Okanagan",{"$nulls":7},"",{"$nulls":6},"","",null,"",null,null,"",null,"Kedleston","N",{"v":50.316699,"d":"50.31670"},{"v":-119.1833,"d":"-119.18330"},"http://www.google.com/maps/place/50.316699,-119.1833",8291,"Rural",2703,1041,"Yes","No","Yes","No ","Kedleston","FALSE","FALSE"]
[null,9001,"Kelly Lake","No","Peace River Regional District","Northeast",{"$nulls":7},"",{"$nulls":6},"","",null,"",null,null,"",null,"Kelly Lake","N",{"v":55.260183,"d":"55.26018"},{"v":-120.042959,"d":"-120.04296"},"http://www.google.com/maps/place/55.260183,-120.042959",9001,"Rural",49,22,"No","Yes","Yes","No ","Kelly Lake","FALSE","FALSE"]
[null,8133,"Kelowna","Yes","Regional District of Central Okanagan","Thompson--Okanagan",{"$nulls":7},"",{"$nulls":6},"","",null,"",null,null,"",null,"Kelowna","N",{"v":49.883301,"d":"49.88330"},{"v":-119.4833,"d":"-119.48330"},"http://www.google.com/maps/place/49.883301,-119.4833",8133,"Urban",26435,13704,"Yes","No","Yes","No ","Kelowna","FALSE","FALSE"]
[null,8872,"Kemano","No","Regional District of Kitimat-Stikine","North Coast",{"$nulls":7},"",{"$nulls":6},"","",null,"",null,null,"",null,"Kemano","N",{"v":53.557253,"d":"53.55725"},{"v":-127.932969,"d":"-127.93297"},"http://www.google.com/maps/place/53.557253,-127.932969",8872,"Rural",null,null,"No","No","Yes","No ","Kemano","FALSE","FALSE"]
[null,8580,"Kendrick Camp","No","Strathcona Regional District","Vancouver Island and Coast",{"$nulls":7},"",{"$nulls":6},"","",null,"",null,null,"",null,"Kendrick Camp","N",{"v":49.724382,"d":"49.72438"},{"v":-126.650747,"d":"-126.65075"},"http://www.google.com/maps/place/49.724382,-126.650747",8580,"Rural",4,3,"No","Yes","Yes","No ","Kendrick Camp","FALSE","FALSE"]
[null,52635,"Keogh No.2 (Da'naxda'xw First Nation)*","No","Regional District of Mount Waddington","Vancouver Island and Coast",{"$nulls":7},"",{"$nulls":6},"","",null,0,null,null,0,null,"Keogh No.2 (Da'naxda'xw First Nation)","Y",{"v":50.6664693,"d":"50.66647"},{"v":-125.7276757,"d":"-125.72768"},"http://www.google.com/maps/place/50.6664693,-125.7276757",52635,"Rural First Nations Secondary Reserve",null,null,"No","No","Yes","No ","Keogh No.2 (Da'naxda'xw First Nation)*","FALSE","FALSE"]
[null,7998,"Keremeos","No","Regional District of Okanagan-Similkameen","Thompson--Okanagan",{"$nulls":7},"",{"$nulls":6},"","",null,"",null,null,"",null,"Keremeos","N",{"v":49.206431,"d":"49.20643"},{"v":-119.826386,"d":"-119.82639"},"http://www.google.com/maps/place/49.206431,-119.826386",7998,"Rural",1805,941,"No","Yes","Yes","No ","Keremeos","FALSE","FALSE"]
[null,8451,{"$f":"HYPERLINK(AG545,AP545)","v":"Kersley"},"No","Cariboo Regional District","Cariboo",{"$nulls":7},{"$f":"IF(COUNT(V545)=0, \"\", IF(V545>=0,\"Sufficient Capacity\", IF(V545<0,\"Not Enough Capacity\")))","v":""},{"$nulls":6},{"$f":"IF(OR(ISBLANK(H545),ISBLANK(I545),ISBLANK(J545)), \"\",(H545*I545/J545))","v":""},{"$f":"IF(AND(COUNT(L545,U545)=2, OR($M$10=\"Last-Mile\", $M$10=\"Transport & Last-Mile\")), L545-U545, \"\")","v":""},null,{"$f":"IF(AD545=\"Y\",COUNT(H545), \"\")","v":""},null,null,{"$f":"IF(AD545=\"Y\",COUNT(P545), \"\")","v":""},null,"Kersley","N",{"v":52.835805,"d":"52.83581"},{"v":-122.418491,"d":"-122.41849"},"http://www.google.com/maps/place/52.835805,-122.418491",8451,"Rural",395,167,"No","Yes","Yes","No ",{"$f":"IF(AD545=\"Y\", CONCATENATE(AC545,\"*\"), AC545)","v":"Kersley"},{"$f":"IF(G545=\"Last-Mile\",\"TRUE\",IF(G545=\"Transport & Last-Mile\",\"TRUE\",\"FALSE\"))","v":"FALSE"},{"$f":"IF(G545=\"Transport\",\"TRUE\",IF(G545=\"Transport & Last-Mile\",\"TRUE\",\"FALSE\"))","v":"FALSE"}]
[null,8036,"Kettle Valley","No","Regional District of Kootenay Boundary","Kootenay",{"$nulls":7},"",{"$nulls":6},"","",null,"",null,null,"",null,"Kettle Valley","N",{"v":49.053622,"d":"49.05362"},{"v":-118.944897,"d":"-118.94490"},"http://www.google.com/maps/place/49.053622,-118.944897",8036,"Rural",233,120,"No","Yes","Yes","No ","Kettle Valley","FALSE","FALSE"]
[null,8885,"Kildala Arm","No","Regional District of Kitimat-Stikine","North Coast",{"$nulls":7},"",{"$nulls":6},"","",null,"",null,null,"",null,"Kildala Arm","N",{"v":53.8333,"d":"53.83330"},{"v":-128.483301,"d":"-128.48330"},"http://www.google.com/maps/place/53.8333,-128.483301",8885,"Rural",null,null,"No","No","Yes","No ","Kildala Arm","FALSE","FALSE"]
[null,8941,"Kilkerran","No","Peace River Regional District","Northeast",{"$nulls":7},"",{"$nulls":6},"","",null,"",null,null,"",null,"Kilkerran","N",{"v":55.839514,"d":"55.83951"},{"v":-120.271564,"d":"-120.27156"},"http://www.google.com/maps/place/55.839514,-120.271564",8941,"Rural",34,12,"No","Yes","Yes","No ","Kilkerran","FALSE","FALSE"]
[null,8285,"Killiney Beach","Yes","Regional District of Central Okanagan","Thompson--Okanagan",{"$nulls":7},"",{"$nulls":6},"","",null,"",null,null,"",null,"Killiney Beach","N",{"v":50.189921,"d":"50.18992"},{"v":-119.506208,"d":"-119.50621"},"http://www.google.com/maps/place/50.189921,-119.506208",8285,"Rural",757,462,"Yes","No","Yes","No ","Killiney Beach","FALSE","FALSE"]
[null,8004,"Kimberley","Yes","Regional District of East Kootenay","Kootenay",{"$nulls":7},"",{"$nulls":6},"","",null,"",null,null,"",null,"Kimberley","N",{"v":49.687103,"d":"49.68710"},{"v":-115.982918,"d":"-115.98292"},"http://www.google.com/maps/place/49.687103,-115.982918",8004,"Rural",4396,2393,"Yes","No","Yes","No ","Kimberley","FALSE","FALSE"]
[null,8622,"Kimsquit","No","Central Coast Regional District","Vancouver Island and Coast",{"$nulls":7},"",{"$nulls":6},"","",null,"",null,null,"",null,"Kimsquit","N",{"v":52.829634,"d":"52.82963"},-126.96434,"http://www.google.com/maps/place/52.829634,-126.96434",8622,"Rural",3,2,"No","Yes","Yes","No ","Kimsquit","FALSE","FALSE"]
[null,50636,"Kingcome (Dzawada'enuxw First Nation)*","No","Regional District of Mount Waddington","Vancouver Island and Coast",{"$nulls":7},"",{"$nulls":6},"","",null,0,null,null,0,null,"Kingcome (Dzawada'enuxw First Nation)","Y",{"v":50.977275534,"d":"50.97728"},{"v":-126.180201254,"d":"-126.18020"},"http://www.google.com/maps/place/50.977275534,-126.180201254",50636,"Rural First Nations Primary Reserve",78,45,"No","Yes","Yes","No ","Kingcome (Dzawada'enuxw First Nation)*","FALSE","FALSE"]
[null,9056,"Kingcome Inlet","No","Regional District of Mount Waddington","Vancouver Island and Coast",{"$nulls":7},"",{"$nulls":6},"","",null,"",null,null,"",null,"Kingcome Inlet","N",{"v":50.95,"d":"50.95000"},{"v":-126.199999,"d":"-126.20000"},"http://www.google.com/maps/place/50.95,-126.199999",9056,"Rural",5,4,"No","Yes","Yes","No ","Kingcome Inlet","FALSE","FALSE"]
[null,8329,"Kingfisher","No","Regional District of North Okanagan","Thompson--Okanagan",{"$nulls":7},"",{"$nulls":6},"","",null,"",null,null,"",null,"Kingfisher","N",{"v":50.616701,"d":"50.61670"},{"v":-118.733299,"d":"-118.73330"},"http://www.google.com/maps/place/50.616701,-118.733299",8329,"Rural",196,452,"No","Yes","Yes","No ","Kingfisher","FALSE","FALSE"]
[null,9041,"Kingsgate","No","Regional District of Central Kootenay","Kootenay",{"$nulls":7},"",{"$nulls":6},"","",null,"",null,null,"",null,"Kingsgate","N",{"v":49.002431,"d":"49.00243"},{"v":-116.178028,"d":"-116.17803"},"http://www.google.com/maps/place/49.002431,-116.178028",9041,"Rural",98,47,"No","Yes","Yes","No ","Kingsgate","FALSE","FALSE"]
[null,7972,"Kinnaird","Yes","Regional District of Central Kootenay","Kootenay",{"$nulls":7},"",{"$nulls":6},"","",null,"",null,null,"",null,"Kinnaird","N",{"v":49.283415,"d":"49.28342"},{"v":-117.650843,"d":"-117.65084"},"http://www.google.com/maps/place/49.283415,-117.650843",7972,"Rural",2083,838,"Yes","No","Yes","No ","Kinnaird","FALSE","FALSE"]
[null,50532,"Kispiox*","Yes","Regional District of Kitimat-Stikine","North Coast",{"$nulls":7},"",{"$nulls":6},"","",null,0,null,null,0,null,"Kispiox","Y",{"v":55.355299273,"d":"55.35530"},{"v":-127.691096164,"d":"-127.69110"},"http://www.google.com/maps/place/55.355299273,-127.691096164",50532,"Rural First Nations Primary Reserve",357,130,"Yes","No","Yes","No ","Kispiox*","FALSE","FALSE"]
[null,50676,"Kitamaat Village (Haisla Nation)*","Yes","Regional District of Kitimat-Stikine","North Coast",{"$nulls":7},"",{"$nulls":6},"","",null,0,null,null,0,null,"Kitamaat Village (Haisla Nation)","Y",{"v":53.975475403,"d":"53.97548"},{"v":-128.645930028,"d":"-128.64593"},"http://www.google.com/maps/place/53.975475403,-128.645930028",50676,"Rural First Nations Primary Reserve",525,197,"Yes","No","Yes","No ","Kitamaat Village (Haisla Nation)*","FALSE","FALSE"]
[null,7942,"Kitchener","No","Regional District of Central Kootenay","Kootenay",{"$nulls":7},"",{"$nulls":6},"","",null,"",null,null,"",null,"Kitchener","N",{"v":49.156652,"d":"49.15665"},{"v":-116.339452,"d":"-116.33945"},"http://www.google.com/maps/place/49.156652,-116.339452",7942,"Rural",132,64,"No","Yes","No","No ","Kitchener","FALSE","FALSE"]
[null,8874,"Kitimat","Yes","Regional District of Kitimat-Stikine","North Coast",{"$nulls":7},"",{"$nulls":6},"","",null,"",null,null,"",null,"Kitimat","N",{"v":54.050975,"d":"54.05098"},{"v":-128.650837,"d":"-128.65084"},"http://www.google.com/maps/place/54.050975,-128.650837",8874,"Rural",6436,3393,"Yes","No","Yes","No ","Kitimat","FALSE","FALSE"]
[null,50672,"Kitkatla (Gitxaala Nation)*","No","North Coast Regional District","North Coast",{"$nulls":7},"",{"$nulls":6},"","",null,0,null,null,0,null,"Kitkatla (Gitxaala Nation)","Y",{"v":53.796382118,"d":"53.79638"},{"v":-130.433075895,"d":"-130.43308"},"http://www.google.com/maps/place/53.796382118,-130.433075895",50672,"Rural First Nations Primary Reserve",353,143,"No","Yes","Yes","No ","Kitkatla (Gitxaala Nation)*","FALSE","FALSE"]
[null,8893,"Kitsault","No","Regional District of Kitimat-Stikine","North Coast",{"$nulls":7},"",{"$nulls":6},"","",null,"",null,null,"",null,"Kitsault","N",{"v":55.455756,"d":"55.45576"},{"v":-129.470551,"d":"-129.47055"},"http://www.google.com/maps/place/55.455756,-129.470551",8893,"Rural",0,0,"No","Yes","Yes","No ","Kitsault","FALSE","FALSE"]
[null,50535,"Kitseguecla (Gitsegukla)*","No","Regional District of Kitimat-Stikine","North Coast",{"$nulls":7},"",{"$nulls":6},"","",null,0,null,null,0,null,"Kitseguecla (Gitsegukla)","Y",{"v":55.087686089,"d":"55.08769"},{"v":-127.829590143,"d":"-127.82959"},"http://www.google.com/maps/place/55.087686089,-127.829590143",50535,"Rural First Nations Primary Reserve",427,143,"No","Yes","Yes","No ","Kitseguecla (Gitsegukla)*","FALSE","FALSE"]
[null,8863,"Kitselas*","No","Regional District of Kitimat-Stikine","North Coast",{"$nulls":7},"",{"$nulls":6},"","",null,0,null,null,0,null,"Kitselas","Y",{"v":54.616699,"d":"54.61670"},{"v":-128.4167,"d":"-128.41670"},"http://www.google.com/maps/place/54.616699,-128.4167",8863,"Rural First Nations Secondary Reserve",433,156,"No","Yes","Yes","No ","Kitselas*","FALSE","FALSE"]
[null,50680,"Kitselas*","Yes","Regional District of Kitimat-Stikine","North Coast",{"$nulls":7},"",{"$nulls":6},"","",null,0,null,null,0,null,"Kitselas","Y",{"v":54.493313704,"d":"54.49331"},{"v":-128.583467649,"d":"-128.58347"},"http://www.google.com/maps/place/54.493313704,-128.583467649",50680,"Rural First Nations Primary Reserve",594,272,"Yes","No","Yes","No ","Kitselas*","FALSE","FALSE"]
[null,50681,"Kitsumkalum*","Yes","Regional District of Kitimat-Stikine","North Coast",{"$nulls":7},"",{"$nulls":6},"","",null,0,null,null,0,null,"Kitsumkalum","Y",{"v":54.522887,"d":"54.52289"},{"v":-128.667329,"d":"-128.66733"},"http://www.google.com/maps/place/54.522887,-128.667329",50681,"Rural First Nations Primary Reserve",1236,498,"Yes","No","Yes","No ","Kitsumkalum*","FALSE","FALSE"]
[null,50536,"Kitwanga (Gitwangak)*","No","Regional District of Kitimat-Stikine","North Coast",{"$nulls":7},"",{"$nulls":6},"","",null,0,null,null,0,null,"Kitwanga (Gitwangak)","Y",{"v":55.099255217,"d":"55.09926"},{"v":-128.06793311,"d":"-128.06793"},"http://www.google.com/maps/place/55.099255217,-128.06793311",50536,"Rural First Nations Primary Reserve",454,176,"No","Yes","Yes","No ","Kitwanga (Gitwangak)*","FALSE","FALSE"]
[null,50553,"Klahoose First Nation*","No","Strathcona Regional District","Vancouver Island and Coast",{"$nulls":7},"",{"$nulls":6},"","",null,0,null,null,0,null,"Klahoose First Nation","Y",{"v":50.125831272,"d":"50.12583"},{"v":-124.921269027,"d":"-124.92127"},"http://www.google.com/maps/place/50.125831272,-124.921269027",50553,"Rural First Nations Primary Reserve",177,117,"No","Yes","Yes","No ","Klahoose First Nation*","FALSE","FALSE"]
[null,8516,"Kleena Kleene","No","Cariboo Regional District","Cariboo",{"$nulls":7},"",{"$nulls":6},"","",null,"",null,null,"",null,"Kleena Kleene","N",{"v":51.950417,"d":"51.95042"},{"v":-124.846747,"d":"-124.84675"},"http://www.google.com/maps/place/51.950417,-124.846747",8516,"Rural",5,3,"No","Yes","Yes","No ","Kleena Kleene","FALSE","FALSE"]
[null,50540,"Klemtu (Kitasoo)*","No","Regional District of Kitimat-Stikine","North Coast",{"$nulls":7},"",{"$nulls":6},"","",null,0,null,null,0,null,"Klemtu (Kitasoo)","Y",{"v":52.590618481,"d":"52.59062"},{"v":-128.51967353,"d":"-128.51967"},"http://www.google.com/maps/place/52.590618481,-128.51967353",50540,"Rural First Nations Primary Reserve",292,103,"No","Yes","Yes","No ","Klemtu (Kitasoo)*","FALSE","FALSE"]
[null,50721,"Kluskus (Lhoosk'uz Dene Nation)*","No","Cariboo Regional District","Cariboo",{"$nulls":7},"",{"$nulls":6},"","",null,0,null,null,0,null,"Kluskus (Lhoosk'uz Dene Nation)","Y",{"v":53.087346002,"d":"53.08735"},{"v":-124.490161267,"d":"-124.49016"},"http://www.google.com/maps/place/53.087346002,-124.490161267",50721,"Rural First Nations Primary Reserve",36,16,"No","Yes","Yes","No ","Kluskus (Lhoosk'uz Dene Nation)*","FALSE","FALSE"]
[null,8958,"Kobes","No","Peace River Regional District","Northeast",{"$nulls":7},"",{"$nulls":6},"","",null,"",null,null,"",null,"Kobes","N",{"v":56.638899,"d":"56.63890"},{"v":-121.650001,"d":"-121.65000"},"http://www.google.com/maps/place/56.638899,-121.650001",8958,"Rural",1,2,"No","Yes","Yes","No ","Kobes","FALSE","FALSE"]
[null,100130,"Koocanusa Marina","No","Regional District of East Kootenay","Kootenay",{"$nulls":7},"",{"$nulls":6},"","",null,"",null,null,"",null,"Koocanusa Marina","N",{"v":49.26069302,"d":"49.26069"},{"v":-115.28458641,"d":"-115.28459"},"http://www.google.com/maps/place/49.26069302,-115.28458641",100130,"Rural",6,4,"No","Yes","Yes","No ","Koocanusa Marina","FALSE","FALSE"]
[null,9035,"Kootenay Bay","No","Regional District of Central Kootenay","Kootenay",{"$nulls":7},"",{"$nulls":6},"","",null,"",null,null,"",null,"Kootenay Bay","N",{"v":49.684851,"d":"49.68485"},{"v":-116.866411,"d":"-116.86641"},"http://www.google.com/maps/place/49.684851,-116.866411",9035,"Rural",294,207,"No","Yes","Yes","No ","Kootenay Bay","FALSE","FALSE"]
[null,9047,"Kootenay Crossing","No","Regional District of East Kootenay","Kootenay",{"$nulls":7},"",{"$nulls":6},"","",null,"",null,null,"",null,"Kootenay Crossing","N",{"v":50.8833,"d":"50.88330"},{"v":-116.049999,"d":"-116.05000"},"http://www.google.com/maps/place/50.8833,-116.049999",9047,"Rural",2,2,"No","Yes","Yes","No ","Kootenay Crossing","FALSE","FALSE"]
[null,100128,"Kragmont","No","Regional District of East Kootenay","Kootenay",{"$nulls":7},"",{"$nulls":6},"","",null,"",null,null,"",null,"Kragmont","N",{"v":49.175,"d":"49.17500"},-115.21667,"http://www.google.com/maps/place/49.175,-115.21667",100128,"Rural",168,104,"No","Yes","Yes","No ","Kragmont","FALSE","FALSE"]
[null,7978,"Krestova","Yes","Regional District of Central Kootenay","Kootenay",{"$nulls":7},"",{"$nulls":6},"","",null,"",null,null,"",null,"Krestova","N",{"v":49.444738,"d":"49.44474"},{"v":-117.582166,"d":"-117.58217"},"http://www.google.com/maps/place/49.444738,-117.582166",7978,"Rural",1520,723,"Yes","No","Yes","No ","Krestova","FALSE","FALSE"]
[null,8853,"'Ksan*","Yes","Regional District of Kitimat-Stikine","North Coast",{"$nulls":7},"",{"$nulls":6},"","",null,0,null,null,0,null,"'Ksan","Y",{"v":55.249714,"d":"55.24971"},{"v":-127.678414,"d":"-127.67841"},"http://www.google.com/maps/place/55.249714,-127.678414",8853,"Rural First Nations Primary Reserve",818,317,"Yes","No","Yes","No ","'Ksan*","FALSE","FALSE"]
[null,8029,"Kuskonook","No","Regional District of Central Kootenay","Kootenay",{"$nulls":7},"",{"$nulls":6},"","",null,"",null,null,"",null,"Kuskonook","N",{"v":49.3,"d":"49.30000"},{"v":-116.650001,"d":"-116.65000"},"http://www.google.com/maps/place/49.3,-116.650001",8029,"Rural",10,14,"No","Yes","Yes","No ","Kuskonook","FALSE","FALSE"]
[null,50626,"Kwakiutl*","Yes","Regional District of Mount Waddington","Vancouver Island and Coast",{"$nulls":7},"",{"$nulls":6},"","",null,0,null,null,0,null,"Kwakiutl","Y",{"v":50.694496009,"d":"50.69450"},{"v":-127.408677014,"d":"-127.40868"},"http://www.google.com/maps/place/50.694496009,-127.408677014",50626,"Rural First Nations Primary Reserve",453,193,"Yes","No","Yes","No ","Kwakiutl*","FALSE","FALSE"]
[null,50564,"Kwantlen First Nation*","Yes","Metro Vancouver Regional District","Lower Mainland--Southwest",{"$nulls":7},"",{"$nulls":6},"","",null,0,null,null,0,null,"Kwantlen First Nation","Y",{"v":49.171443898,"d":"49.17144"},{"v":-122.56549429,"d":"-122.56549"},"http://www.google.com/maps/place/49.171443898,-122.56549429",50564,"Rural First Nations Primary Reserve",5090,1930,"Yes","No","Yes","No ","Kwantlen First Nation*","FALSE","FALSE"]
[null,50580,"Kwaw-kwaw-Apilt*","Yes","Fraser Valley Regional District","Lower Mainland--Southwest",{"$nulls":7},"",{"$nulls":6},"","",null,0,null,null,0,null,"Kwaw-kwaw-Apilt","Y",{"v":49.166849682,"d":"49.16685"},{"v":-121.975245699,"d":"-121.97525"},"http://www.google.com/maps/place/49.166849682,-121.975245699",50580,"Urban First Nations Primary Reserve",27163,12788,"Yes","No","Yes","No ","Kwaw-kwaw-Apilt*","FALSE","FALSE"]
[null,50628,"Kwiakah*","No","Strathcona Regional District","Vancouver Island and Coast",{"$nulls":7},"",{"$nulls":6},"","",null,0,null,null,0,null,"Kwiakah","Y",{"v":50.422685992,"d":"50.42269"},{"v":-125.157760384,"d":"-125.15776"},"http://www.google.com/maps/place/50.422685992,-125.157760384",50628,"Rural First Nations Secondary Reserve",null,null,"No","No","Yes","No ","Kwiakah*","FALSE","FALSE"]
[null,50560,"Kwikwetlem First Nation*","Yes","Metro Vancouver Regional District","Lower Mainland--Southwest",{"$nulls":7},"",{"$nulls":6},"","",null,0,null,null,0,null,"Kwikwetlem First Nation","Y",{"v":49.230160912,"d":"49.23016"},{"v":-122.805957041,"d":"-122.80596"},"http://www.google.com/maps/place/49.230160912,-122.805957041",50560,"Urban First Nations Primary Reserve",47015,18042,"Yes","No","Yes","No ","Kwikwetlem First Nation*","FALSE","FALSE"]
[null,50638,"Kyuquot (Ka:'yu:'k't'h'/Che:k:tles7et'h' First Nations)*","No","Strathcona Regional District","Vancouver Island and Coast",{"$nulls":7},"",{"$nulls":6},"","",null,0,null,null,0,null,"Kyuquot (Ka:'yu:'k't'h'/Che:k:tles7et'h' First Nations)","Y",{"v":50.030573782,"d":"50.03057"},{"v":-127.37823364,"d":"-127.37823"},"http://www.google.com/maps/place/50.030573782,-127.37823364",50638,"Rural First Nations Primary Reserve",181,53,"No","Yes","Yes","No ","Kyuquot (Ka:'yu:'k't'h'/Che:k:tles7et'h' First Nations)*","FALSE","FALSE"]
[null,8476,"Lac la Hache","No","Cariboo Regional District","Cariboo",{"$nulls":7},"",{"$nulls":6},"","",null,"",null,null,"",null,"Lac la Hache","N",{"v":51.814529,"d":"51.81453"},{"v":-121.465151,"d":"-121.46515"},"http://www.google.com/maps/place/51.814529,-121.465151",8476,"Rural",280,172,"No","Yes","Yes","No ","Lac la Hache","FALSE","FALSE"]
[null,8383,"Lac Le Jeune","No","Thompson-Nicola Regional District","Thompson--Okanagan",{"$nulls":7},"",{"$nulls":6},"","",null,"",null,null,"",null,"Lac Le Jeune","N",{"v":50.481712,"d":"50.48171"},{"v":-120.493017,"d":"-120.49302"},"http://www.google.com/maps/place/50.481712,-120.493017",8383,"Rural",180,111,"No","Yes","Yes","No ","Lac Le Jeune","FALSE","FALSE"]
[null,8091,"Ladner","Yes","Metro Vancouver Regional District","Lower Mainland--Southwest",{"$nulls":7},"",{"$nulls":6},"","",null,"",null,null,"",null,"Ladner","N",{"v":49.091666,"d":"49.09167"},{"v":-123.077777,"d":"-123.07778"},"http://www.google.com/maps/place/49.091666,-123.077777",8091,"Urban",17508,6865,"Yes","No","Yes","No ","Ladner","FALSE","FALSE"]
[null,8691,"Ladysmith","Yes","Cowichan Valley Regional District","Vancouver Island and Coast",{"$nulls":7},"",{"$nulls":6},"","",null,"",null,null,"",null,"Ladysmith","N",{"v":48.992646,"d":"48.99265"},{"v":-123.820178,"d":"-123.82018"},"http://www.google.com/maps/place/48.992646,-123.820178",8691,"Rural",6283,2785,"Yes","No","No","No ","Ladysmith","FALSE","FALSE"]
[null,8045,"Laidlaw","Yes","Fraser Valley Regional District","Lower Mainland--Southwest",{"$nulls":7},"",{"$nulls":6},"","",null,"",null,null,"",null,"Laidlaw","N",{"v":49.322345,"d":"49.32235"},{"v":-121.618136,"d":"-121.61814"},"http://www.google.com/maps/place/49.322345,-121.618136",8045,"Rural",142,39,"Yes","No","Yes","No ","Laidlaw","FALSE","FALSE"]
[null,50607,"Lake Babine Nation*","No","Bulkley Nechako Regional District","Nechako",{"$nulls":7},"",{"$nulls":6},"","",null,0,null,null,0,null,"Lake Babine Nation","Y",{"v":54.238616625,"d":"54.23862"},{"v":-125.762517416,"d":"-125.76252"},"http://www.google.com/maps/place/54.238616625,-125.762517416",50607,"Rural First Nations Primary Reserve",2478,1013,"No","Yes","Yes","No ","Lake Babine Nation*","FALSE","FALSE"]
[null,8795,"Lake Babine*","No","Bulkley Nechako Regional District","Nechako",{"$nulls":7},"",{"$nulls":6},"","",null,0,null,null,0,null,"Lake Babine","Y",{"v":54.817021,"d":"54.81702"},{"v":-126.146656,"d":"-126.14666"},"http://www.google.com/maps/place/54.817021,-126.146656",8795,"Rural First Nations Primary Reserve",122,82,"No","Yes","No","No ","Lake Babine*","FALSE","FALSE"]
[null,8613,"Lake Cowichan","Yes","Cowichan Valley Regional District","Vancouver Island and Coast",{"$nulls":7},"",{"$nulls":6},"","",null,"",null,null,"",null,"Lake Cowichan","N",{"v":48.826067,"d":"48.82607"},{"v":-124.051504,"d":"-124.05150"},"http://www.google.com/maps/place/48.826067,-124.051504",8613,"Rural",2864,1388,"Yes","No","Yes","No ","Lake Cowichan","FALSE","FALSE"]
[null,50643,"Lake Cowichan First Nation*","Yes","Cowichan Valley Regional District","Vancouver Island and Coast",{"$nulls":7},"",{"$nulls":6},"","",null,0,null,null,0,null,"Lake Cowichan First Nation","Y",{"v":48.82604956,"d":"48.82605"},{"v":-124.069746544,"d":"-124.06975"},"http://www.google.com/maps/place/48.82604956,-124.069746544",50643,"Rural First Nations Primary Reserve",2864,1388,"Yes","No","No","No ","Lake Cowichan First Nation*","FALSE","FALSE"]
[null,8097,"Lake Errock","Yes","Fraser Valley Regional District","Lower Mainland--Southwest",{"$nulls":7},"",{"$nulls":6},"","",null,"",null,null,"",null,"Lake Errock","N",{"v":49.229102,"d":"49.22910"},{"v":-122.011596,"d":"-122.01160"},"http://www.google.com/maps/place/49.229102,-122.011596",8097,"Rural",796,432,"Yes","No","Yes","No ","Lake Errock","FALSE","FALSE"]
[null,8876,"Lakelse Lake","No","Regional District of Kitimat-Stikine","North Coast",{"$nulls":7},"",{"$nulls":6},"","",null,"",null,null,"",null,"Lakelse Lake","N",{"v":54.380398,"d":"54.38040"},{"v":-128.545743,"d":"-128.54574"},"http://www.google.com/maps/place/54.380398,-128.545743",8876,"Rural",241,240,"No","Yes","Yes","No ","Lakelse Lake","FALSE","FALSE"]
[null,8197,"Lang Bay","Yes","qathet Regional District","Vancouver Island and Coast",{"$nulls":7},"",{"$nulls":6},"","",null,"",null,null,"",null,"Lang Bay","N",{"v":49.779184,"d":"49.77918"},{"v":-124.345665,"d":"-124.34567"},"http://www.google.com/maps/place/49.779184,-124.345665",8197,"Rural",1213,645,"Yes","No","Yes","No ","Lang Bay","FALSE","FALSE"]
[null,8179,"Langdale","Yes","Sunshine Coast Regional District","Lower Mainland--Southwest",{"$nulls":7},"",{"$nulls":6},"","",null,"",null,null,"",null,"Langdale","N",{"v":49.434078,"d":"49.43408"},{"v":-123.476525,"d":"-123.47653"},"http://www.google.com/maps/place/49.434078,-123.476525",8179,"Rural",1388,786,"Yes","No","Yes","No ","Langdale","FALSE","FALSE"]
[null,8644,"Langford","Yes","Capital Regional District","Vancouver Island and Coast",{"$nulls":7},"",{"$nulls":6},"","",null,"",null,null,"",null,"Langford","N",{"v":48.456603,"d":"48.45660"},{"v":-123.497419,"d":"-123.49742"},"http://www.google.com/maps/place/48.456603,-123.497419",8644,"Urban",25303,10309,"Yes","No","Yes","No ","Langford","FALSE","FALSE"]
[null,8079,"Langley","Yes","Metro Vancouver Regional District","Lower Mainland--Southwest",{"$nulls":7},"",{"$nulls":6},"","",null,"",null,null,"",null,"Langley","N",49.10378,{"v":-122.658835,"d":"-122.65884"},"http://www.google.com/maps/place/49.10378,-122.658835",8079,"Urban",42137,18240,"Yes","No","Yes","No ","Langley","FALSE","FALSE"]
[null,8705,"Lantzville","Yes","Regional District of Nanaimo","Vancouver Island and Coast",{"$nulls":7},"",{"$nulls":6},"","",null,"",null,null,"",null,"Lantzville","N",{"v":49.253205,"d":"49.25321"},{"v":-124.081748,"d":"-124.08175"},"http://www.google.com/maps/place/49.253205,-124.081748",8705,"Urban",363,158,"Yes","No","Yes","No ","Lantzville","FALSE","FALSE"]
[null,8023,"Lardeau","Yes","Regional District of Central Kootenay","Kootenay",{"$nulls":7},"",{"$nulls":6},"","",null,"",null,null,"",null,"Lardeau","N",{"v":50.143019,"d":"50.14302"},{"v":-116.955941,"d":"-116.95594"},"http://www.google.com/maps/place/50.143019,-116.955941",8023,"Rural",35,52,"Yes","No","No","No ","Lardeau","FALSE","FALSE"]
[null,8203,"Lasqueti","No","qathet Regional District","Vancouver Island and Coast",{"$nulls":7},"",{"$nulls":6},"","",null,"",null,null,"",null,"Lasqueti","N",{"v":49.491822,"d":"49.49182"},{"v":-124.346824,"d":"-124.34682"},"http://www.google.com/maps/place/49.491822,-124.346824",8203,"Rural",208,241,"No","Yes","Yes","No ","Lasqueti","FALSE","FALSE"]
[null,8150,"Lavington","Yes","Regional District of North Okanagan","Thompson--Okanagan",{"$nulls":7},"",{"$nulls":6},"","",null,"",null,null,"",null,"Lavington","N",{"v":50.231286,"d":"50.23129"},{"v":-119.106647,"d":"-119.10665"},"http://www.google.com/maps/place/50.231286,-119.106647",8150,"Rural",1218,465,"Yes","No","Yes","No ","Lavington","FALSE","FALSE"]
[null,9010,"Lawnhill","No","North Coast Regional District","North Coast",{"$nulls":7},"",{"$nulls":6},"","",null,"",null,null,"",null,"Lawnhill","N",{"v":53.403575,"d":"53.40358"},{"v":-131.922226,"d":"-131.92223"},"http://www.google.com/maps/place/53.403575,-131.922226",9010,"Rural",19,15,"No","Yes","Yes","No ","Lawnhill","FALSE","FALSE"]
[null,50674,"Lax Kw'alaams*","No","North Coast Regional District","North Coast",{"$nulls":7},"",{"$nulls":6},"","",null,0,null,null,0,null,"Lax Kw'alaams","Y",{"v":54.558568174,"d":"54.55857"},{"v":-130.433140512,"d":"-130.43314"},"http://www.google.com/maps/place/54.558568174,-130.433140512",50674,"Rural First Nations Primary Reserve",476,218,"No","Yes","Yes","No ","Lax Kw'alaams*","FALSE","FALSE"]
[null,50678,"Laxgalts'ap (Nisga'a Village of Laxgalt'sap)*","No","Regional District of Kitimat-Stikine","North Coast",{"$nulls":7},"",{"$nulls":6},"","",null,0,null,null,0,null,"Laxgalts'ap (Nisga'a Village of Laxgalt'sap)","Y",{"v":55.033876528,"d":"55.03388"},{"v":-129.5794391,"d":"-129.57944"},"http://www.google.com/maps/place/55.033876528,-129.5794391",50678,"Rural First Nations Primary Reserve",349,115,"No","Yes","Yes","No ","Laxgalts'ap (Nisga'a Village of Laxgalt'sap)*","FALSE","FALSE"]
[null,8735,"Lazo","Yes","Comox Valley Regional District","Vancouver Island and Coast",{"$nulls":7},"",{"$nulls":6},"","",null,"",null,null,"",null,"Lazo","N",{"v":49.713894,"d":"49.71389"},{"v":-124.909117,"d":"-124.90912"},"http://www.google.com/maps/place/49.713894,-124.909117",8735,"Urban",16722,7466,"Yes","No","Yes","No ","Lazo","FALSE","FALSE"]
[null,100138,{"$f":"HYPERLINK(AG609,AP609)","v":"Lazy Lake"},"No","Regional District of East Kootenay","Kootenay",{"$nulls":7},{"$f":"IF(COUNT(V609)=0, \"\", IF(V609>=0,\"Sufficient Capacity\", IF(V609<0,\"Not Enough Capacity\")))","v":""},{"$nulls":6},{"$f":"IF(OR(ISBLANK(H609),ISBLANK(I609),ISBLANK(J609)), \"\",(H609*I609/J609))","v":""},{"$f":"IF(AND(COUNT(L609,U609)=2, OR($M$10=\"Last-Mile\", $M$10=\"Transport & Last-Mile\")), L609-U609, \"\")","v":""},null,{"$f":"IF(AD609=\"Y\",COUNT(H609), \"\")","v":""},null,null,{"$f":"IF(AD609=\"Y\",COUNT(P609), \"\")","v":""},null,"Lazy Lake","N",{"v":49.81821791,"d":"49.81822"},{"v":-115.62731908,"d":"-115.62732"},"http://www.google.com/maps/place/49.81821791,-115.62731908",100138,"Rural",24,28,"No","Yes","Yes","No ",{"$f":"IF(AD609=\"Y\", CONCATENATE(AC609,\"*\"), AC609)","v":"Lazy Lake"},{"$f":"IF(G609=\"Last-Mile\",\"TRUE\",IF(G609=\"Transport & Last-Mile\",\"TRUE\",\"FALSE\"))","v":"FALSE"},{"$f":"IF(G609=\"Transport\",\"TRUE\",IF(G609=\"Transport & Last-Mile\",\"TRUE\",\"FALSE\"))","v":"FALSE"}]
[null,100120,"Lebahdo","No","Regional District of Central Kootenay","Kootenay",{"$nulls":7},"",{"$nulls":6},"","",null,"",null,null,"",null,"Lebahdo","N",{"v":49.6,"d":"49.60000"},-117.58333,"http://www.google.com/maps/place/49.6,-117.58333",100120,"Rural",374,211,"No","Yes","Yes","No ","Lebahdo","FALSE","FALSE"]
[null,8364,"Lee Creek","Yes","Columbia-Shuswap Regional District","Thompson--Okanagan",{"$nulls":7},"",{"$nulls":6},"","",null,"",null,null,"",null,"Lee Creek","N",{"v":50.907833,"d":"50.90783"},{"v":-119.534093,"d":"-119.53409"},"http://www.google.com/maps/place/50.907833,-119.534093",8364,"Rural",282,236,"Yes","No","Yes","No ","Lee Creek","FALSE","FALSE"]
[null,100116,"Lemon Creek","No","Regional District of Central Kootenay","Kootenay",{"$nulls":7},"",{"$nulls":6},"","",null,"",null,null,"",null,"Lemon Creek","N",{"v":49.7,"d":"49.70000"},-117.48333,"http://www.google.com/maps/place/49.7,-117.48333",100116,"Rural",145,82,"No","Yes","Yes","No ","Lemon Creek","FALSE","FALSE"]
[null,8911,"Lemoray","No","Peace River Regional District","Northeast",{"$nulls":7},"",{"$nulls":6},"","",null,"",null,null,"",null,"Lemoray","N",{"v":55.5389,"d":"55.53890"},{"v":-122.4833,"d":"-122.48330"},"http://www.google.com/maps/place/55.5389,-122.4833",8911,"Rural",2,2,"No","Yes","Yes","No ","Lemoray","FALSE","FALSE"]
[null,9058,"Leo Creek","No","Bulkley Nechako Regional District","Nechako",{"$nulls":7},"",{"$nulls":6},"","",null,"",null,null,"",null,"Leo Creek","N",{"v":55.08302778,"d":"55.08303"},{"v":-125.56010278,"d":"-125.56010"},"http://www.google.com/maps/place/55.08302778,-125.56010278",9058,"Rural",null,null,"No","No","Yes","No ","Leo Creek","FALSE","FALSE"]
[null,8094,"Leq' a: mel","Yes","Fraser Valley Regional District","Lower Mainland--Southwest",{"$nulls":7},"",{"$nulls":6},"","",null,"",null,null,"",null,"Leq' a: mel","N",{"v":49.167069,"d":"49.16707"},{"v":-122.086376,"d":"-122.08638"},"http://www.google.com/maps/place/49.167069,-122.086376",8094,"Rural",470,206,"Yes","No","Yes","No ","Leq' a: mel","FALSE","FALSE"]
[null,8096,"Leq' a: mel*","Yes","Fraser Valley Regional District","Lower Mainland--Southwest",{"$nulls":7},"",{"$nulls":6},"","",null,0,null,null,0,null,"Leq' a: mel","Y",{"v":49.209032,"d":"49.20903"},{"v":-122.023377,"d":"-122.02338"},"http://www.google.com/maps/place/49.209032,-122.023377",8096,"Rural First Nations Primary Reserve",796,432,"Yes","No","Yes","No ","Leq' a: mel*","FALSE","FALSE"]
[null,100145,"Lewis Bay","No","Regional District of Central Kootenay","Kootenay",{"$nulls":7},"",{"$nulls":6},"","",null,"",null,null,"",null,"Lewis Bay","N",49.46982,{"v":-116.7706,"d":"-116.77060"},"http://www.google.com/maps/place/49.46982,-116.7706",100145,"Rural",89,112,"No","Yes","Yes","No ","Lewis Bay","FALSE","FALSE"]
[null,50611,"Lheidli T'enneh*","No","Regional District of Fraser-Fort George","Cariboo",{"$nulls":7},"",{"$nulls":6},"","",null,0,null,null,0,null,"Lheidli T'enneh","Y",{"v":54.008833527,"d":"54.00883"},{"v":-122.614301486,"d":"-122.61430"},"http://www.google.com/maps/place/54.008833527,-122.614301486",50611,"Rural First Nations Primary Reserve",305,119,"No","No","Yes","No ","Lheidli T'enneh*","FALSE","FALSE"]
[null,8977,"Liard River","No","Northern Rockies Regional Municipality","Northeast",{"$nulls":7},"",{"$nulls":6},"","",null,"",null,null,"",null,"Liard River","N",{"v":59.4167,"d":"59.41670"},{"v":-126.083302,"d":"-126.08330"},"http://www.google.com/maps/place/59.4167,-126.083302",8977,"Rural",11,3,"No","Yes","Yes","No ","Liard River","FALSE","FALSE"]
[null,8682,"Lighthouse Point","No","Capital Regional District","Vancouver Island and Coast",{"$nulls":7},"",{"$nulls":6},"","",null,"",null,null,"",null,"Lighthouse Point","N",{"v":48.868675,"d":"48.86868"},{"v":-123.284056,"d":"-123.28406"},"http://www.google.com/maps/place/48.868675,-123.284056",8682,"Rural",192,311,"No","Yes","Yes","No ","Lighthouse Point","FALSE","FALSE"]
[null,8447,"Likely","No","Cariboo Regional District","Cariboo",{"$nulls":7},"",{"$nulls":6},"","",null,"",null,null,"",null,"Likely","N",{"v":52.618679,"d":"52.61868"},{"v":-121.564712,"d":"-121.56471"},"http://www.google.com/maps/place/52.618679,-121.564712",8447,"Rural",69,63,"No","Yes","Yes","No ","Likely","FALSE","FALSE"]
[null,8246,"Lillooet","No","Squamish-Lillooet Regional District","Lower Mainland--Southwest",{"$nulls":7},"",{"$nulls":6},"","",null,"",null,null,"",null,"Lillooet","N",{"v":50.694058,"d":"50.69406"},{"v":-121.938662,"d":"-121.93866"},"http://www.google.com/maps/place/50.694058,-121.938662",8246,"Rural",1790,965,"No","Yes","Yes","No ","Lillooet","FALSE","FALSE"]
[null,8064,"Lindell Beach","Yes","Fraser Valley Regional District","Lower Mainland--Southwest",{"$nulls":7},"",{"$nulls":6},"","",null,"",null,null,"",null,"Lindell Beach","N",{"v":49.033299,"d":"49.03330"},{"v":-122.0167,"d":"-122.01670"},"http://www.google.com/maps/place/49.033299,-122.0167",8064,"Rural",533,542,"Yes","No","Yes","No ","Lindell Beach","FALSE","FALSE"]
[null,8125,"Lions Bay","Yes","Metro Vancouver Regional District","Lower Mainland--Southwest",{"$nulls":7},"",{"$nulls":6},"","",null,"",null,null,"",null,"Lions Bay","N",{"v":49.459058,"d":"49.45906"},{"v":-123.236102,"d":"-123.23610"},"http://www.google.com/maps/place/49.459058,-123.236102",8125,"Rural",670,277,"Yes","No","No","No ","Lions Bay","FALSE","FALSE"]
[null,7945,"Lister","Yes","Regional District of Central Kootenay","Kootenay",{"$nulls":7},"",{"$nulls":6},"","",null,"",null,null,"",null,"Lister","N",{"v":49.047402,"d":"49.04740"},{"v":-116.463073,"d":"-116.46307"},"http://www.google.com/maps/place/49.047402,-116.463073",7945,"Rural",2844,1367,"Yes","No","No","No ","Lister","FALSE","FALSE"]
[null,8396,"Little Fort","No","Thompson-Nicola Regional District","Thompson--Okanagan",{"$nulls":7},"",{"$nulls":6},"","",null,"",null,null,"",null,"Little Fort","N",{"v":51.424856,"d":"51.42486"},-120.20693,"http://www.google.com/maps/place/51.424856,-120.20693",8396,"Rural",132,63,"No","Yes","Yes","No ","Little Fort","FALSE","FALSE"]
[null,8734,"Little River","Yes","Comox Valley Regional District","Vancouver Island and Coast",{"$nulls":7},"",{"$nulls":6},"","",null,"",null,null,"",null,"Little River","N",{"v":49.7377,"d":"49.73770"},{"v":-124.914063,"d":"-124.91406"},"http://www.google.com/maps/place/49.7377,-124.914063",8734,"Urban",1294,666,"Yes","No","Yes","No ","Little River","FALSE","FALSE"]
[null,50689,"Little Shuswap Lake*","No","Columbia-Shuswap Regional District","Thompson--Okanagan",{"$nulls":7},"",{"$nulls":6},"","",null,0,null,null,0,null,"Little Shuswap Lake","Y",{"v":50.870243535,"d":"50.87024"},{"v":-119.599653325,"d":"-119.59965"},"http://www.google.com/maps/place/50.870243535,-119.599653325",50689,"Rural First Nations Primary Reserve",77,93,"No","Yes","Yes","No ","Little Shuswap Lake*","FALSE","FALSE"]
[null,8276,"Logan Lake","No","Thompson-Nicola Regional District","Thompson--Okanagan",{"$nulls":7},"",{"$nulls":6},"","",null,"",null,null,"",null,"Logan Lake","N",{"v":50.491255,"d":"50.49126"},-120.81303,"http://www.google.com/maps/place/50.491255,-120.81303",8276,"Rural",1998,1112,"No","Yes","Yes","No ","Logan Lake","FALSE","FALSE"]
[null,8492,"Lone Butte","No","Cariboo Regional District","Cariboo",{"$nulls":7},"",{"$nulls":6},"","",null,"",null,null,"",null,"Lone Butte","N",51.55789,{"v":-121.216015,"d":"-121.21602"},"http://www.google.com/maps/place/51.55789,-121.216015",8492,"Rural",116,60,"No","Yes","No","No ","Lone Butte","FALSE","FALSE"]
[null,8497,"Loon Lake","No","Thompson-Nicola Regional District","Thompson--Okanagan",{"$nulls":7},"",{"$nulls":6},"","",null,"",null,null,"",null,"Loon Lake","N",{"v":51.0833,"d":"51.08330"},{"v":-121.3,"d":"-121.30000"},"http://www.google.com/maps/place/51.0833,-121.3",8497,"Rural",17,28,"No","Yes","Yes","No ","Loon Lake","FALSE","FALSE"]
[null,8414,"Loos","No","Regional District of Fraser-Fort George","Cariboo",{"$nulls":7},"",{"$nulls":6},"","",null,"",null,null,"",null,"Loos","N",{"v":53.602086,"d":"53.60209"},{"v":-120.718867,"d":"-120.71887"},"http://www.google.com/maps/place/53.602086,-120.718867",8414,"Rural",37,18,"No","Yes","Yes","No ","Loos","FALSE","FALSE"]
[null,8391,"Louis Creek","No","Thompson-Nicola Regional District","Thompson--Okanagan",{"$nulls":7},"",{"$nulls":6},"","",null,"",null,null,"",null,"Louis Creek","N",{"v":51.140109,"d":"51.14011"},{"v":-120.121611,"d":"-120.12161"},"http://www.google.com/maps/place/51.140109,-120.121611",8391,"Rural",93,52,"No","Yes","Yes","No ","Louis Creek","FALSE","FALSE"]
[null,8256,"Lower Hat Creek 2 (Bonaparte)*","No","Thompson-Nicola Regional District","Thompson--Okanagan",{"$nulls":7},"",{"$nulls":6},"","",null,0,null,null,0,null,"Lower Hat Creek 2 (Bonaparte)","Y",{"v":50.88402222,"d":"50.88402"},{"v":-121.493,"d":"-121.49300"},"http://www.google.com/maps/place/50.88402222,-121.493",8256,"Rural First Nations Secondary Reserve",23,17,"No","Yes","Yes","No ","Lower Hat Creek 2 (Bonaparte)*","FALSE","FALSE"]
[null,50606,"Lower Kootenay*","No","Regional District of Central Kootenay","Kootenay",{"$nulls":7},"",{"$nulls":6},"","",null,0,null,null,0,null,"Lower Kootenay","Y",{"v":49.066742628,"d":"49.06674"},{"v":-116.516265401,"d":"-116.51627"},"http://www.google.com/maps/place/49.066742628,-116.516265401",50606,"Rural First Nations Primary Reserve",79,39,"No","No","No","No ","Lower Kootenay*","FALSE","FALSE"]
[null,8239,"Lower Nicola","No","Thompson-Nicola Regional District","Thompson--Okanagan",{"$nulls":7},"",{"$nulls":6},"","",null,"",null,null,"",null,"Lower Nicola","N",{"v":50.159696,"d":"50.15970"},{"v":-120.878304,"d":"-120.87830"},"http://www.google.com/maps/place/50.159696,-120.878304",8239,"Rural",1090,539,"No","Yes","No","No ","Lower Nicola","FALSE","FALSE"]
[null,8992,"Lower Post*","No","Stikine Regional District (Unincorporated)","Nechako",{"$nulls":7},"",{"$nulls":6},"","",null,0,null,null,0,null,"Lower Post","Y",{"v":59.924942,"d":"59.92494"},{"v":-128.485983,"d":"-128.48598"},"http://www.google.com/maps/place/59.924942,-128.485983",8992,"Rural First Nations Primary Reserve",121,63,"No","Yes","No","No ","Lower Post*","FALSE","FALSE"]
[null,50598,"Lower Similkameen*","No","Regional District of Okanagan-Similkameen","Thompson--Okanagan",{"$nulls":7},"",{"$nulls":6},"","",null,0,null,null,0,null,"Lower Similkameen","Y",{"v":49.051432157,"d":"49.05143"},{"v":-119.723798038,"d":"-119.72380"},"http://www.google.com/maps/place/49.051432157,-119.723798038",50598,"Rural First Nations Primary Reserve",87,34,"No","Yes","No","No ","Lower Similkameen*","FALSE","FALSE"]
[null,9042,"Lumberton","No","Regional District of East Kootenay","Kootenay",{"$nulls":7},"",{"$nulls":6},"","",null,"",null,null,"",null,"Lumberton","N",{"v":49.423792,"d":"49.42379"},{"v":-115.876809,"d":"-115.87681"},"http://www.google.com/maps/place/49.423792,-115.876809",9042,"Rural",203,82,"No","No","No","No ","Lumberton","FALSE","FALSE"]
[null,8149,"Lumby","Yes","Regional District of North Okanagan","Thompson--Okanagan",{"$nulls":7},"",{"$nulls":6},"","",null,"",null,null,"",null,"Lumby","N",{"v":50.25,"d":"50.25000"},{"v":-118.9667,"d":"-118.96670"},"http://www.google.com/maps/place/50.25,-118.9667",8149,"Rural",2004,916,"Yes","No","No","No ","Lumby","FALSE","FALSE"]
[null,8213,"Lund","No","qathet Regional District","Vancouver Island and Coast",{"$nulls":7},"",{"$nulls":6},"","",null,"",null,null,"",null,"Lund","N",{"v":49.981775,"d":"49.98178"},{"v":-124.756873,"d":"-124.75687"},"http://www.google.com/maps/place/49.981775,-124.756873",8213,"Rural",442,260,"No","Yes","Yes","No ","Lund","FALSE","FALSE"]
[null,50646,"Lyackson*","No","Cowichan Valley Regional District","Vancouver Island and Coast",{"$nulls":7},"",{"$nulls":6},"","",null,0,null,null,0,null,"Lyackson","Y",{"v":49.042106631,"d":"49.04211"},{"v":-123.643271134,"d":"-123.64327"},"http://www.google.com/maps/place/49.042106631,-123.643271134",50646,"Rural First Nations Primary Reserve",null,null,"No","No","Yes","No ","Lyackson*","FALSE","FALSE"]
[null,8117,"Lynn Valley","Yes","Metro Vancouver Regional District","Lower Mainland--Southwest",{"$nulls":7},"",{"$nulls":6},"","",null,"",null,null,"",null,"Lynn Valley","N",{"v":49.341644,"d":"49.34164"},{"v":-123.032818,"d":"-123.03282"},"http://www.google.com/maps/place/49.341644,-123.032818",8117,"Urban",30611,11419,"Yes","No","Yes","No ","Lynn Valley","FALSE","FALSE"]
[null,8237,"Lytton","Yes","Thompson-Nicola Regional District","Thompson--Okanagan",{"$nulls":7},"",{"$nulls":6},"","",null,"",null,null,"",null,"Lytton","N",{"v":50.231566,"d":"50.23157"},{"v":-121.582557,"d":"-121.58256"},"http://www.google.com/maps/place/50.231566,-121.582557",8237,"Rural",607,276,"Yes","No","Yes","No ","Lytton","FALSE","FALSE"]
[null,8236,"Lytton*","No","Thompson-Nicola Regional District","Thompson--Okanagan",{"$nulls":7},"",{"$nulls":6},"","",null,0,null,null,0,null,"Lytton","Y",{"v":50.200935,"d":"50.20094"},-121.57214,"http://www.google.com/maps/place/50.200935,-121.57214",8236,"Rural First Nations Secondary Reserve",43,18,"No","No","Yes","No ","Lytton*","FALSE","FALSE"]
[null,8244,"Lytton*","No","Thompson-Nicola Regional District","Thompson--Okanagan",{"$nulls":7},"",{"$nulls":6},"","",null,0,null,null,0,null,"Lytton","Y",{"v":50.304382,"d":"50.30438"},{"v":-121.649164,"d":"-121.64916"},"http://www.google.com/maps/place/50.304382,-121.649164",8244,"Rural First Nations Secondary Reserve",27,12,"No","Yes","Yes","No ","Lytton*","FALSE","FALSE"]
[null,8259,"Lytton*","No","Thompson-Nicola Regional District","Thompson--Okanagan",{"$nulls":7},"",{"$nulls":6},"","",null,0,null,null,0,null,"Lytton","Y",{"v":50.441462,"d":"50.44146"},{"v":-121.712542,"d":"-121.71254"},"http://www.google.com/maps/place/50.441462,-121.712542",8259,"Rural First Nations Secondary Reserve",14,10,"No","Yes","Yes","No ","Lytton*","FALSE","FALSE"]
[null,50705,"Lytton*","Yes","Thompson-Nicola Regional District","Thompson--Okanagan",{"$nulls":7},"",{"$nulls":6},"","",null,0,null,null,0,null,"Lytton","Y",{"v":50.237487,"d":"50.23749"},{"v":-121.577555,"d":"-121.57756"},"http://www.google.com/maps/place/50.237487,-121.577555",50705,"Rural First Nations Primary Reserve",607,276,"Yes","No","Yes","No ","Lytton*","FALSE","FALSE"]
[null,8801,"Mackenzie","No","Regional District of Fraser-Fort George","Cariboo",{"$nulls":7},"",{"$nulls":6},"","",null,"",null,null,"",null,"Mackenzie","N",{"v":55.335437,"d":"55.33544"},{"v":-123.095472,"d":"-123.09547"},"http://www.google.com/maps/place/55.335437,-123.095472",8801,"Rural",3505,1760,"No","Yes","Yes","No ","Mackenzie","FALSE","FALSE"]
[null,8189,"Madeira Park","Yes","Sunshine Coast Regional District","Lower Mainland--Southwest",{"$nulls":7},"",{"$nulls":6},"","",null,"",null,null,"",null,"Madeira Park","N",49.61573,{"v":-124.019742,"d":"-124.01974"},"http://www.google.com/maps/place/49.61573,-124.019742",8189,"Rural",1422,1062,"Yes","No","Yes","No ","Madeira Park","FALSE","FALSE"]
[null,8361,"Magna Bay","No","Columbia-Shuswap Regional District","Thompson--Okanagan",{"$nulls":7},"",{"$nulls":6},"","",null,"",null,null,"",null,"Magna Bay","N",{"v":50.961837,"d":"50.96184"},{"v":-119.283581,"d":"-119.28358"},"http://www.google.com/maps/place/50.961837,-119.283581",8361,"Rural",323,558,"No","Yes","Yes","No ","Magna Bay","FALSE","FALSE"]
[null,8544,"Mahatta River","No","Regional District of Mount Waddington","Vancouver Island and Coast",{"$nulls":7},"",{"$nulls":6},"","",null,"",null,null,"",null,"Mahatta River","N",{"v":50.457536,"d":"50.45754"},{"v":-127.8016959,"d":"-127.80170"},"http://www.google.com/maps/place/50.457536,-127.8016959",8544,"Rural",3,41,"No","Yes","Yes","No ","Mahatta River","FALSE","FALSE"]
[null,8489,"Mahood Falls","No","Cariboo Regional District","Cariboo",{"$nulls":7},"",{"$nulls":6},"","",null,"",null,null,"",null,"Mahood Falls","N",{"v":51.842634,"d":"51.84263"},{"v":-120.639335,"d":"-120.63934"},"http://www.google.com/maps/place/51.842634,-120.639335",8489,"Rural",31,66,"No","Yes","Yes","No ","Mahood Falls","FALSE","FALSE"]
[null,100104,"Majestic Subdivision","No","Regional District of Central Kootenay","Kootenay",{"$nulls":7},"",{"$nulls":6},"","",null,"",null,null,"",null,"Majestic Subdivision","N",{"v":49.026575,"d":"49.02658"},{"v":-116.1936556,"d":"-116.19366"},"http://www.google.com/maps/place/49.026575,-116.1936556",100104,"Rural",83,43,"No","Yes","No","No ","Majestic Subdivision","FALSE","FALSE"]
[null,8670,"Malahat","Yes","Cowichan Valley Regional District","Vancouver Island and Coast",{"$nulls":7},"",{"$nulls":6},"","",null,"",null,null,"",null,"Malahat","N",{"v":48.548055,"d":"48.54806"},{"v":-123.565278,"d":"-123.56528"},"http://www.google.com/maps/place/48.548055,-123.565278",8670,"Rural",870,359,"Yes","No","Yes","No ","Malahat","FALSE","FALSE"]
[null,50647,"Malahat Nation*","Yes","Cowichan Valley Regional District","Vancouver Island and Coast",{"$nulls":7},"",{"$nulls":6},"","",null,0,null,null,0,null,"Malahat Nation","Y",{"v":48.613672616,"d":"48.61367"},{"v":-123.520412907,"d":"-123.52041"},"http://www.google.com/maps/place/48.613672616,-123.520412907",50647,"Rural First Nations Primary Reserve",2278,895,"Yes","No","Yes","No ","Malahat Nation*","FALSE","FALSE"]
[null,8325,"Malakwa","No","Columbia-Shuswap Regional District","Thompson--Okanagan",{"$nulls":7},"",{"$nulls":6},"","",null,"",null,null,"",null,"Malakwa","N",{"v":50.939952,"d":"50.93995"},{"v":-118.788805,"d":"-118.78881"},"http://www.google.com/maps/place/50.939952,-118.788805",8325,"Rural",359,202,"No","Yes","No","No ","Malakwa","FALSE","FALSE"]
[null,8214,"Malibu","No","Sunshine Coast Regional District","Lower Mainland--Southwest",{"$nulls":7},"",{"$nulls":6},"","",null,"",null,null,"",null,"Malibu","N",{"v":50.167134,"d":"50.16713"},{"v":-123.851158,"d":"-123.85116"},"http://www.google.com/maps/place/50.167134,-123.851158",8214,"Rural",35,43,"No","Yes","No","No ","Malibu","FALSE","FALSE"]
[null,50629,"Mamalilikulla-Qwe'Qwa'Sot'Em (Mamalilikulla First Nation)*","No","Regional District of Mount Waddington","Vancouver Island and Coast",{"$nulls":7},"",{"$nulls":6},"","",null,0,null,null,0,null,"Mamalilikulla-Qwe'Qwa'Sot'Em (Mamalilikulla First Nation)","Y",{"v":50.59424358,"d":"50.59424"},{"v":-126.682328314,"d":"-126.68233"},"http://www.google.com/maps/place/50.59424358,-126.682328314",50629,"Rural First Nations Primary Reserve",5,4,"No","Yes","No","No ","Mamalilikulla-Qwe'Qwa'Sot'Em (Mamalilikulla First Nation)*","FALSE","FALSE"]
[null,8040,"Manning Park","No","Regional District of Okanagan-Similkameen","Thompson--Okanagan",{"$nulls":7},"",{"$nulls":6},"","",null,"",null,null,"",null,"Manning Park","N",{"v":49.066795,"d":"49.06680"},-120.78156,"http://www.google.com/maps/place/49.066795,-120.78156",8040,"Rural",25,36,"No","Yes","No","No ","Manning Park","FALSE","FALSE"]
[null,8902,"Manson Creek","No","Bulkley Nechako Regional District","Nechako",{"$nulls":7},"",{"$nulls":6},"","",null,"",null,null,"",null,"Manson Creek","N",{"v":55.6667,"d":"55.66670"},{"v":-124.4833,"d":"-124.48330"},"http://www.google.com/maps/place/55.6667,-124.4833",8902,"Rural",29,24,"No","Yes","No","No ","Manson Creek","FALSE","FALSE"]
[null,8216,"Mansons Landing","No","Strathcona Regional District","Vancouver Island and Coast",{"$nulls":7},"",{"$nulls":6},"","",null,"",null,null,"",null,"Mansons Landing","N",{"v":50.058144,"d":"50.05814"},{"v":-124.979574,"d":"-124.97957"},"http://www.google.com/maps/place/50.058144,-124.979574",8216,"Rural",222,173,"No","Yes","No","No ","Mansons Landing","FALSE","FALSE"]
[null,8807,"Mapes","No","Bulkley Nechako Regional District","Nechako",{"$nulls":7},"",{"$nulls":6},"","",null,"",null,null,"",null,"Mapes","N",{"v":53.8833,"d":"53.88330"},{"v":-123.866701,"d":"-123.86670"},"http://www.google.com/maps/place/53.8833,-123.866701",8807,"Rural",89,33,"No","Yes","No","No ","Mapes","FALSE","FALSE"]
[null,8679,"Maple Bay","Yes","Cowichan Valley Regional District","Vancouver Island and Coast",{"$nulls":7},"",{"$nulls":6},"","",null,"",null,null,"",null,"Maple Bay","N",{"v":48.815829,"d":"48.81583"},{"v":-123.612915,"d":"-123.61292"},"http://www.google.com/maps/place/48.815829,-123.612915",8679,"Rural",1598,742,"Yes","No","No","No ","Maple Bay","FALSE","FALSE"]
[null,8127,"Maple Ridge","Yes","Metro Vancouver Regional District","Lower Mainland--Southwest",{"$nulls":7},"",{"$nulls":6},"","",null,"",null,null,"",null,"Maple Ridge","N",{"v":49.217407,"d":"49.21741"},{"v":-122.597946,"d":"-122.59795"},"http://www.google.com/maps/place/49.217407,-122.597946",8127,"Urban",34323,14482,"Yes","No","No","No ","Maple Ridge","FALSE","FALSE"]
[null,8308,"Mara","No","Regional District of North Okanagan","Thompson--Okanagan",{"$nulls":7},"",{"$nulls":6},"","",null,"",null,null,"",null,"Mara","N",{"v":50.685283,"d":"50.68528"},{"v":-119.067452,"d":"-119.06745"},"http://www.google.com/maps/place/50.685283,-119.067452",8308,"Rural",225,104,"No","No","No","No ","Mara","FALSE","FALSE"]
[null,8820,"Marilla","No","Bulkley Nechako Regional District","Nechako",{"$nulls":7},"",{"$nulls":6},"","",null,"",null,null,"",null,"Marilla","N",{"v":53.701279,"d":"53.70128"},{"v":-125.847423,"d":"-125.84742"},"http://www.google.com/maps/place/53.701279,-125.847423",8820,"Rural",4,3,"No","Yes","No","No ","Marilla","FALSE","FALSE"]
[null,8592,"Marktosis*","No","Regional District of Alberni-Clayoquot","Vancouver Island and Coast",{"$nulls":7},"",{"$nulls":6},"","",null,0,null,null,0,null,"Marktosis","Y",{"v":49.278611,"d":"49.27861"},-126.05758,"http://www.google.com/maps/place/49.278611,-126.05758",8592,"Rural First Nations Primary Reserve",15,10,"No","Yes","No","No ","Marktosis*","FALSE","FALSE"]
[null,8195,"Marshall School Junction","No","qathet Regional District","Vancouver Island and Coast",{"$nulls":7},"",{"$nulls":6},"","",null,"",null,null,"",null,"Marshall School Junction","N",{"v":49.7111,"d":"49.71110"},{"v":-124.5086,"d":"-124.50860"},"http://www.google.com/maps/place/49.7111,-124.5086",8195,"Rural",120,84,"No","Yes","No","No ","Marshall School Junction","FALSE","FALSE"]
[null,8320,"Martin Prairie","No","Thompson-Nicola Regional District","Thompson--Okanagan",{"$nulls":7},"",{"$nulls":6},"","",null,"",null,null,"",null,"Martin Prairie","N",{"v":50.662374,"d":"50.66237"},{"v":-119.811827,"d":"-119.81183"},"http://www.google.com/maps/place/50.662374,-119.811827",8320,"Rural",307,133,"No","Yes","No","No ","Martin Prairie","FALSE","FALSE"]
[null,10003,"Martin Valley","No","Central Coast Regional District","Vancouver Island and Coast",{"$nulls":7},"",{"$nulls":6},"","",null,"",null,null,"",null,"Martin Valley","N",{"v":52.361826,"d":"52.36183"},{"v":-127.723285,"d":"-127.72329"},"http://www.google.com/maps/place/52.361826,-127.723285",10003,"Rural",69,40,"No","Yes","No","No ","Martin Valley","FALSE","FALSE"]
[null,8008,"Marysville","Yes","Regional District of East Kootenay","Kootenay",{"$nulls":7},"",{"$nulls":6},"","",null,"",null,null,"",null,"Marysville","N",{"v":49.637257,"d":"49.63726"},{"v":-115.9559,"d":"-115.95590"},"http://www.google.com/maps/place/49.637257,-115.9559",8008,"Rural",967,456,"Yes","No","No","No ","Marysville","FALSE","FALSE"]
[null,9003,{"$f":"HYPERLINK(AG673,AP673)","v":"Masset"},"No","North Coast Regional District","North Coast",{"$nulls":7},{"$f":"IF(COUNT(V673)=0, \"\", IF(V673>=0,\"Sufficient Capacity\", IF(V673<0,\"Not Enough Capacity\")))","v":""},{"$nulls":6},{"$f":"IF(OR(ISBLANK(H673),ISBLANK(I673),ISBLANK(J673)), \"\",(H673*I673/J673))","v":""},{"$f":"IF(AND(COUNT(L673,U673)=2, OR($M$10=\"Last-Mile\", $M$10=\"Transport & Last-Mile\")), L673-U673, \"\")","v":""},null,{"$f":"IF(AD673=\"Y\",COUNT(H673), \"\")","v":""},null,null,{"$f":"IF(AD673=\"Y\",COUNT(P673), \"\")","v":""},null,"Masset","N",{"v":54.017407,"d":"54.01741"},{"v":-132.1466,"d":"-132.14660"},"http://www.google.com/maps/place/54.017407,-132.1466",9003,"Rural",788,412,"No","Yes","No","No ",{"$f":"IF(AD673=\"Y\", CONCATENATE(AC673,\"*\"), AC673)","v":"Masset"},{"$f":"IF(G673=\"Last-Mile\",\"TRUE\",IF(G673=\"Transport & Last-Mile\",\"TRUE\",\"FALSE\"))","v":"FALSE"},{"$f":"IF(G673=\"Transport\",\"TRUE\",IF(G673=\"Transport & Last-Mile\",\"TRUE\",\"FALSE\"))","v":"FALSE"}]
[null,8767,"Matilpi","No","Strathcona Regional District","Vancouver Island and Coast",{"$nulls":7},"",{"$nulls":6},"","",null,"",null,null,"",null,"Matilpi","N",{"v":50.549401,"d":"50.54940"},{"v":-126.184326,"d":"-126.18433"},"http://www.google.com/maps/place/50.549401,-126.184326",8767,"Rural",2,4,"No","Yes","No","No ","Matilpi","FALSE","FALSE"]
[null,8071,"Matsqui","Yes","Fraser Valley Regional District","Lower Mainland--Southwest",{"$nulls":7},"",{"$nulls":6},"","",null,"",null,null,"",null,"Matsqui","N",{"v":49.1083,"d":"49.10830"},{"v":-122.291699,"d":"-122.29170"},"http://www.google.com/maps/place/49.1083,-122.291699",8071,"Urban",2695,1073,"Yes","No","No","No ","Matsqui","FALSE","FALSE"]
[null,50565,"Matsqui*","Yes","Fraser Valley Regional District","Lower Mainland--Southwest",{"$nulls":7},"",{"$nulls":6},"","",null,0,null,null,0,null,"Matsqui","Y",{"v":49.104450849,"d":"49.10445"},{"v":-122.338804672,"d":"-122.33880"},"http://www.google.com/maps/place/49.104450849,-122.338804672",50565,"Rural First Nations Primary Reserve",1756,575,"Yes","No","No","No ","Matsqui*","FALSE","FALSE"]
[null,8076,"Matsqui*","Yes","Metro Vancouver Regional District","Lower Mainland--Southwest",{"$nulls":7},"",{"$nulls":6},"","",null,0,null,null,0,null,"Matsqui","Y",{"v":49.005994,"d":"49.00599"},{"v":-122.476246,"d":"-122.47625"},"http://www.google.com/maps/place/49.005994,-122.476246",8076,"Rural First Nations Secondary Reserve",839,402,"Yes","No","No","No ","Matsqui*","FALSE","FALSE"]
[null,8684,"Mayne","No","Capital Regional District","Vancouver Island and Coast",{"$nulls":7},"",{"$nulls":6},"","",null,"",null,null,"",null,"Mayne","N",{"v":48.850108,"d":"48.85011"},{"v":-123.296975,"d":"-123.29698"},"http://www.google.com/maps/place/48.850108,-123.296975",8684,"Rural",730,854,"No","Yes","No","No ","Mayne","FALSE","FALSE"]
[null,7933,"Mayook","No","Regional District of East Kootenay","Kootenay",{"$nulls":7},"",{"$nulls":6},"","",null,"",null,null,"",null,"Mayook","N",{"v":49.486908,"d":"49.48691"},{"v":-115.576893,"d":"-115.57689"},"http://www.google.com/maps/place/49.486908,-115.576893",7933,"Rural",29,20,"No","Yes","No","No ","Mayook","FALSE","FALSE"]
[null,8412,"McBride","No","Regional District of Fraser-Fort George","Cariboo",{"$nulls":7},"",{"$nulls":6},"","",null,"",null,null,"",null,"McBride","N",{"v":53.299999,"d":"53.30000"},{"v":-120.166701,"d":"-120.16670"},"http://www.google.com/maps/place/53.299999,-120.166701",8412,"Rural",654,342,"No","Yes","No","No ","McBride","FALSE","FALSE"]
[null,9026,"McCulloch","No","Regional District of Central Okanagan","Thompson--Okanagan",{"$nulls":7},"",{"$nulls":6},"","",null,"",null,null,"",null,"McCulloch","N",{"v":49.794756,"d":"49.79476"},{"v":-119.190209,"d":"-119.19021"},"http://www.google.com/maps/place/49.794756,-119.190209",9026,"Rural",11,5,"No","Yes","No","No ","McCulloch","FALSE","FALSE"]
[null,8980,"McDame","No","Stikine Regional District (Unincorporated)","Nechako",{"$nulls":7},"",{"$nulls":6},"","",null,"",null,null,"",null,"McDame","N",{"v":59.185586,"d":"59.18559"},-129.22515,"http://www.google.com/maps/place/59.185586,-129.22515",8980,"Rural",null,null,"No","No","No","No ","McDame","FALSE","FALSE"]
[null,8821,"McDonalds Landing","No","Bulkley Nechako Regional District","Nechako",{"$nulls":7},"",{"$nulls":6},"","",null,"",null,null,"",null,"McDonalds Landing","N",{"v":54,"d":"54.00000"},{"v":-126.033302,"d":"-126.03330"},"http://www.google.com/maps/place/54,-126.033302",8821,"Rural",14,7,"No","Yes","No","No ","McDonalds Landing","FALSE","FALSE"]
[null,8964,"McKearney Ranch","No","Peace River Regional District","Northeast",{"$nulls":7},"",{"$nulls":6},"","",null,"",null,null,"",null,"McKearney Ranch","N",{"v":56.6333,"d":"56.63330"},{"v":-122.466699,"d":"-122.46670"},"http://www.google.com/maps/place/56.6333,-122.466699",8964,"Rural",26,6,"No","Yes","No","No ","McKearney Ranch","FALSE","FALSE"]
[null,8453,"McLeese Lake","No","Cariboo Regional District","Cariboo",{"$nulls":7},"",{"$nulls":6},"","",null,"",null,null,"",null,"McLeese Lake","N",{"v":52.413659,"d":"52.41366"},-122.29621,"http://www.google.com/maps/place/52.413659,-122.29621",8453,"Rural",66,41,"No","Yes","No","No ","McLeese Lake","FALSE","FALSE"]
[null,50618,"McLeod Lake*","No","Regional District of Fraser-Fort George","Cariboo",{"$nulls":7},"",{"$nulls":6},"","",null,0,null,null,0,null,"McLeod Lake","Y",{"v":54.984563978,"d":"54.98456"},{"v":-123.045835417,"d":"-123.04584"},"http://www.google.com/maps/place/54.984563978,-123.045835417",50618,"Rural First Nations Primary Reserve",129,81,"No","Yes","No","No ","McLeod Lake*","FALSE","FALSE"]
[null,8390,"McLure","No","Thompson-Nicola Regional District","Thompson--Okanagan",{"$nulls":7},"",{"$nulls":6},"","",null,"",null,null,"",null,"McLure","N",{"v":51.053898,"d":"51.05390"},-120.22455,"http://www.google.com/maps/place/51.053898,-120.22455",8390,"Rural",113,53,"No","Yes","No","No ","McLure","FALSE","FALSE"]
[null,9044,"Meachen","No","Regional District of East Kootenay","Kootenay",{"$nulls":7},"",{"$nulls":6},"","",null,"",null,null,"",null,"Meachen","N",{"v":49.620739,"d":"49.62074"},{"v":-116.267258,"d":"-116.26726"},"http://www.google.com/maps/place/49.620739,-116.267258",9044,"Rural",1,1,"No","Yes","No","No ","Meachen","FALSE","FALSE"]
[null,8021,"Meadow Creek","No","Regional District of Central Kootenay","Kootenay",{"$nulls":7},"",{"$nulls":6},"","",null,"",null,null,"",null,"Meadow Creek","N",{"v":50.239199,"d":"50.23920"},-116.97254,"http://www.google.com/maps/place/50.239199,-116.97254",8021,"Rural",159,117,"No","Yes","Yes","No ","Meadow Creek","FALSE","FALSE"]
[null,100137,"Meadowbrook","No","Regional District of East Kootenay","Kootenay",{"$nulls":7},"",{"$nulls":6},"","",null,"",null,null,"",null,"Meadowbrook","N",{"v":49.70805423,"d":"49.70805"},{"v":-115.90583966,"d":"-115.90584"},"http://www.google.com/maps/place/49.70805423,-115.90583966",100137,"Rural",265,121,"No","No","No","No ","Meadowbrook","FALSE","FALSE"]
[null,9039,"Meadows","No","Regional District of Central Kootenay","Kootenay",{"$nulls":7},"",{"$nulls":6},"","",null,"",null,null,"",null,"Meadows","N",{"v":49.185902,"d":"49.18590"},{"v":-117.395502,"d":"-117.39550"},"http://www.google.com/maps/place/49.185902,-117.395502",9039,"Rural",46,27,"No","Yes","Yes","No ","Meadows","FALSE","FALSE"]
[null,8240,"Merritt","Yes","Thompson-Nicola Regional District","Thompson--Okanagan",{"$nulls":7},"",{"$nulls":6},"","",null,"",null,null,"",null,"Merritt","N",{"v":50.111408,"d":"50.11141"},{"v":-120.789691,"d":"-120.78969"},"http://www.google.com/maps/place/50.111408,-120.789691",8240,"Rural",2977,1433,"Yes","No","No","No ","Merritt","FALSE","FALSE"]
[null,8744,"Merville","Yes","Comox Valley Regional District","Vancouver Island and Coast",{"$nulls":7},"",{"$nulls":6},"","",null,"",null,null,"",null,"Merville","N",{"v":49.784837,"d":"49.78484"},{"v":-125.057337,"d":"-125.05734"},"http://www.google.com/maps/place/49.784837,-125.057337",8744,"Rural",1205,530,"Yes","No","No","No ","Merville","FALSE","FALSE"]
[null,8612,"Mesachie Lake","Yes","Cowichan Valley Regional District","Vancouver Island and Coast",{"$nulls":7},"",{"$nulls":6},"","",null,"",null,null,"",null,"Mesachie Lake","N",{"v":48.812435,"d":"48.81244"},{"v":-124.124745,"d":"-124.12475"},"http://www.google.com/maps/place/48.812435,-124.124745",8612,"Rural",159,89,"Yes","No","No","No ","Mesachie Lake","FALSE","FALSE"]
[null,8641,"Metchosin","Yes","Capital Regional District","Vancouver Island and Coast",{"$nulls":7},"",{"$nulls":6},"","",null,"",null,null,"",null,"Metchosin","N",{"v":48.375649,"d":"48.37565"},{"v":-123.529048,"d":"-123.52905"},"http://www.google.com/maps/place/48.375649,-123.529048",8641,"Urban",3484,1427,"Yes","No","No","No ","Metchosin","FALSE","FALSE"]
[null,50673,"Metlakatla First Nation*","No","North Coast Regional District","North Coast",{"$nulls":7},"",{"$nulls":6},"","",null,0,null,null,0,null,"Metlakatla First Nation","Y",{"v":54.336949561,"d":"54.33695"},{"v":-130.444229115,"d":"-130.44423"},"http://www.google.com/maps/place/54.336949561,-130.444229115",50673,"Rural First Nations Primary Reserve",83,48,"No","Yes","No","No ","Metlakatla First Nation*","FALSE","FALSE"]
[null,8896,"Meziadin Junction","No","Regional District of Kitimat-Stikine","North Coast",{"$nulls":7},"",{"$nulls":6},"","",null,"",null,null,"",null,"Meziadin Junction","N",{"v":56.099674,"d":"56.09967"},{"v":-129.304736,"d":"-129.30474"},"http://www.google.com/maps/place/56.099674,-129.304736",8896,"Rural",null,null,"No","No","No","No ","Meziadin Junction","FALSE","FALSE"]
[null,8403,"Mica Creek","No","Columbia-Shuswap Regional District","Thompson--Okanagan",{"$nulls":7},"",{"$nulls":6},"","",null,"",null,null,"",null,"Mica Creek","N",{"v":52.005881,"d":"52.00588"},{"v":-118.561519,"d":"-118.56152"},"http://www.google.com/maps/place/52.005881,-118.561519",8403,"Rural",5,56,"No","Yes","No","No ","Mica Creek","FALSE","FALSE"]
[null,8840,"Middle River*","No","Bulkley Nechako Regional District","Nechako",{"$nulls":7},"",{"$nulls":6},"","",null,0,null,null,0,null,"Middle River","Y",{"v":54.876138,"d":"54.87614"},{"v":-125.129788,"d":"-125.12979"},"http://www.google.com/maps/place/54.876138,-125.129788",8840,"Rural First Nations Primary Reserve",10,11,"No","Yes","No","No ","Middle River*","FALSE","FALSE"]
[null,7989,"Midway","Yes","Regional District of Kootenay Boundary","Kootenay",{"$nulls":7},"",{"$nulls":6},"","",null,"",null,null,"",null,"Midway","N",{"v":49.007136,"d":"49.00714"},{"v":-118.773048,"d":"-118.77305"},"http://www.google.com/maps/place/49.007136,-118.773048",7989,"Rural",654,325,"Yes","No","Yes","No ","Midway","FALSE","FALSE"]
[null,8928,"Mile 62 1/2","No","Peace River Regional District","Northeast",{"$nulls":7},"",{"$nulls":6},"","",null,"",null,null,"",null,"Mile 62 1/2","N",{"v":56.408379,"d":"56.40838"},{"v":-121.157301,"d":"-121.15730"},"http://www.google.com/maps/place/56.408379,-121.157301",8928,"Rural",185,71,"No","Yes","No","No ","Mile 62 1/2","FALSE","FALSE"]
[null,8668,"Mill Bay","Yes","Cowichan Valley Regional District","Vancouver Island and Coast",{"$nulls":7},"",{"$nulls":6},"","",null,"",null,null,"",null,"Mill Bay","N",{"v":48.644906,"d":"48.64491"},{"v":-123.556162,"d":"-123.55616"},"http://www.google.com/maps/place/48.644906,-123.556162",8668,"Rural",2278,895,"Yes","No","No","No ","Mill Bay","FALSE","FALSE"]
[null,100587,"Miller Creek","No","North Coast Regional District","North Coast",{"$nulls":7},"",{"$nulls":6},"","",null,"",null,null,"",null,"Miller Creek","N",{"v":53.327952,"d":"53.32795"},{"v":-131.953695,"d":"-131.95370"},"http://www.google.com/maps/place/53.327952,-131.953695",100587,"Rural",4,3,"No","Yes","No","No ","Miller Creek","FALSE","FALSE"]
[null,8568,"Minstrel Island","No","Regional District of Mount Waddington","Vancouver Island and Coast",{"$nulls":7},"",{"$nulls":6},"","",null,"",null,null,"",null,"Minstrel Island","N",{"v":50.615391,"d":"50.61539"},{"v":-126.307808,"d":"-126.30781"},"http://www.google.com/maps/place/50.615391,-126.307808",8568,"Rural",3,9,"No","Yes","No","No ","Minstrel Island","FALSE","FALSE"]
[null,8467,"Miocene","No","Cariboo Regional District","Cariboo",{"$nulls":7},"",{"$nulls":6},"","",null,"",null,null,"",null,"Miocene","N",52.25033,{"v":-121.771385,"d":"-121.77139"},"http://www.google.com/maps/place/52.25033,-121.771385",8467,"Rural",424,186,"No","Yes","No","No ","Miocene","FALSE","FALSE"]
[null,9034,"Mirror Lake","No","Regional District of Central Kootenay","Kootenay",{"$nulls":7},"",{"$nulls":6},"","",null,"",null,null,"",null,"Mirror Lake","N",{"v":49.8829,"d":"49.88290"},{"v":-116.901729,"d":"-116.90173"},"http://www.google.com/maps/place/49.8829,-116.901729",9034,"Rural",189,131,"No","No","No","No ","Mirror Lake","FALSE","FALSE"]
[null,8077,"Mission","Yes","Fraser Valley Regional District","Lower Mainland--Southwest",{"$nulls":7},"",{"$nulls":6},"","",null,"",null,null,"",null,"Mission","N",49.13761,{"v":-122.303696,"d":"-122.30370"},"http://www.google.com/maps/place/49.13761,-122.303696",8077,"Urban",28392,10090,"Yes","No","No","No ","Mission","FALSE","FALSE"]
[null,8557,"Mitchell Bay","No","Regional District of Mount Waddington","Vancouver Island and Coast",{"$nulls":7},"",{"$nulls":6},"","",null,"",null,null,"",null,"Mitchell Bay","N",{"v":50.6333,"d":"50.63330"},{"v":-126.85,"d":"-126.85000"},"http://www.google.com/maps/place/50.6333,-126.85",8557,"Rural",53,44,"No","Yes","Yes","No ","Mitchell Bay","FALSE","FALSE"]
[null,8427,"Miworth","No","Regional District of Fraser-Fort George","Cariboo",{"$nulls":7},"",{"$nulls":6},"","",null,"",null,null,"",null,"Miworth","N",{"v":53.939852,"d":"53.93985"},{"v":-122.949121,"d":"-122.94912"},"http://www.google.com/maps/place/53.939852,-122.949121",8427,"Rural",406,157,"No","No","No","No ","Miworth","FALSE","FALSE"]
[null,8922,"Moberly Lake","No","Peace River Regional District","Northeast",{"$nulls":7},"",{"$nulls":6},"","",null,"",null,null,"",null,"Moberly Lake","N",{"v":55.833345,"d":"55.83335"},{"v":-121.758464,"d":"-121.75846"},"http://www.google.com/maps/place/55.833345,-121.758464",8922,"Rural",102,88,"No","Yes","No","No ","Moberly Lake","FALSE","FALSE"]
[null,100142,"Moberly School Rd.","No","Columbia-Shuswap Regional District","Thompson--Okanagan",{"$nulls":7},"",{"$nulls":6},"","",null,"",null,null,"",null,"Moberly School Rd.","N",{"v":51.41655396,"d":"51.41655"},{"v":-117.01264248,"d":"-117.01264"},"http://www.google.com/maps/place/51.41655396,-117.01264248",100142,"Rural",256,147,"No","Yes","No","No ","Moberly School Rd.","FALSE","FALSE"]
[null,8258,"Moha","No","Squamish-Lillooet Regional District","Lower Mainland--Southwest",{"$nulls":7},"",{"$nulls":6},"","",null,"",null,null,"",null,"Moha","N",{"v":50.864141,"d":"50.86414"},{"v":-122.169651,"d":"-122.16965"},"http://www.google.com/maps/place/50.864141,-122.169651",8258,"Rural",18,14,"No","Yes","No","No ","Moha","FALSE","FALSE"]
[null,8368,"Monte Creek","Yes","Thompson-Nicola Regional District","Thompson--Okanagan",{"$nulls":7},"",{"$nulls":6},"","",null,"",null,null,"",null,"Monte Creek","N",50.64874,{"v":-119.958111,"d":"-119.95811"},"http://www.google.com/maps/place/50.64874,-119.958111",8368,"Rural",362,170,"Yes","No","No","No ","Monte Creek","FALSE","FALSE"]
[null,8316,"Monte Lake","No","Thompson-Nicola Regional District","Thompson--Okanagan",{"$nulls":7},"",{"$nulls":6},"","",null,"",null,null,"",null,"Monte Lake","N",{"v":50.525429,"d":"50.52543"},{"v":-119.832451,"d":"-119.83245"},"http://www.google.com/maps/place/50.525429,-119.832451",8316,"Rural",172,87,"No","Yes","No","No ","Monte Lake","FALSE","FALSE"]
[null,8948,"Montney","No","Peace River Regional District","Northeast",{"$nulls":7},"",{"$nulls":6},"","",null,"",null,null,"",null,"Montney","N",{"v":56.450304,"d":"56.45030"},{"v":-120.926493,"d":"-120.92649"},"http://www.google.com/maps/place/56.450304,-120.926493",8948,"Rural",165,49,"No","Yes","No","No ","Montney","FALSE","FALSE"]
[null,7964,"Montrose","Yes","Regional District of Kootenay Boundary","Kootenay",{"$nulls":7},"",{"$nulls":6},"","",null,"",null,null,"",null,"Montrose","N",{"v":49.078787,"d":"49.07879"},{"v":-117.590692,"d":"-117.59069"},"http://www.google.com/maps/place/49.078787,-117.590692",7964,"Rural",1448,616,"Yes","No","No","No ","Montrose","FALSE","FALSE"]
[null,8629,"Mooyah Bay","No","Strathcona Regional District","Vancouver Island and Coast",{"$nulls":7},"",{"$nulls":6},"","",null,"",null,null,"",null,"Mooyah Bay","N",{"v":49.629531,"d":"49.62953"},{"v":-126.458386,"d":"-126.45839"},"http://www.google.com/maps/place/49.629531,-126.458386",8629,"Rural",null,null,"No","No","No","No ","Mooyah Bay","FALSE","FALSE"]
[null,9017,"Moresby Camp","No","North Coast Regional District","North Coast",{"$nulls":7},"",{"$nulls":6},"","",null,"",null,null,"",null,"Moresby Camp","N",{"v":53.047474,"d":"53.04747"},{"v":-132.028869,"d":"-132.02887"},"http://www.google.com/maps/place/53.047474,-132.028869",9017,"Rural",11,6,"No","Yes","No","No ","Moresby Camp","FALSE","FALSE"]
[null,50530,"Moricetown (Witset First Nation)*","Yes","Regional District of Kitimat-Stikine","North Coast",{"$nulls":7},"",{"$nulls":6},"","",null,0,null,null,0,null,"Moricetown (Witset First Nation)","Y",{"v":55.021566266,"d":"55.02157"},{"v":-127.33091458,"d":"-127.33091"},"http://www.google.com/maps/place/55.021566266,-127.33091458",50530,"Rural First Nations Primary Reserve",651,236,"Yes","No","No","No ","Moricetown (Witset First Nation)*","FALSE","FALSE"]
[null,7992,"Mount Baldy","No","Regional District of Kootenay Boundary","Kootenay",{"$nulls":7},"",{"$nulls":6},"","",null,"",null,null,"",null,"Mount Baldy","N",{"v":49.152222,"d":"49.15222"},{"v":-119.237499,"d":"-119.23750"},"http://www.google.com/maps/place/49.152222,-119.237499",7992,"Rural",24,123,"No","Yes","No","No ","Mount Baldy","FALSE","FALSE"]
[null,8166,"Mount Currie","Yes","Squamish-Lillooet Regional District","Lower Mainland--Southwest",{"$nulls":7},"",{"$nulls":6},"","",null,"",null,null,"",null,"Mount Currie","N",{"v":50.314754,"d":"50.31475"},{"v":-122.717994,"d":"-122.71799"},"http://www.google.com/maps/place/50.314754,-122.717994",8166,"Rural",874,435,"Yes","No","No","No ","Mount Currie","FALSE","FALSE"]
[null,50557,"Mount Currie (Lil'wat Nation)*","Yes","Squamish-Lillooet Regional District","Lower Mainland--Southwest",{"$nulls":7},"",{"$nulls":6},"","",null,0,null,null,0,null,"Mount Currie (Lil'wat Nation)","Y",{"v":50.33212805,"d":"50.33213"},{"v":-122.662688197,"d":"-122.66269"},"http://www.google.com/maps/place/50.33212805,-122.662688197",50557,"Rural First Nations Primary Reserve",753,247,"Yes","No","No","No ","Mount Currie (Lil'wat Nation)*","FALSE","FALSE"]
[null,8410,"Mount Robson","No","Regional District of Fraser-Fort George","Cariboo",{"$nulls":7},"",{"$nulls":6},"","",null,"",null,null,"",null,"Mount Robson","N",{"v":53.030941,"d":"53.03094"},{"v":-119.227711,"d":"-119.22771"},"http://www.google.com/maps/place/53.030941,-119.227711",8410,"Rural",36,19,"No","Yes","No","No ","Mount Robson","FALSE","FALSE"]
[null,50630,"Mowachaht/Muchalaht*","No","Strathcona Regional District","Vancouver Island and Coast",{"$nulls":7},"",{"$nulls":6},"","",null,0,null,null,0,null,"Mowachaht/Muchalaht","Y",{"v":49.811040011,"d":"49.81104"},{"v":-126.07186484,"d":"-126.07186"},"http://www.google.com/maps/place/49.811040011,-126.07186484",50630,"Rural First Nations Primary Reserve",187,61,"No","Yes","No","No ","Mowachaht/Muchalaht*","FALSE","FALSE"]
[null,7940,"Moyie","No","Regional District of East Kootenay","Kootenay",{"$nulls":7},"",{"$nulls":6},"","",null,"",null,null,"",null,"Moyie","N",{"v":49.288788,"d":"49.28879"},-115.83158,"http://www.google.com/maps/place/49.288788,-115.83158",7940,"Rural",125,113,"No","Yes","No","No ","Moyie","FALSE","FALSE"]
[null,8725,"Mud Bay","Yes","Comox Valley Regional District","Vancouver Island and Coast",{"$nulls":7},"",{"$nulls":6},"","",null,"",null,null,"",null,"Mud Bay","N",{"v":49.4667,"d":"49.46670"},{"v":-124.799999,"d":"-124.80000"},"http://www.google.com/maps/place/49.4667,-124.799999",8725,"Rural",927,486,"Yes","No","No","No ","Mud Bay","FALSE","FALSE"]
[null,8834,"Mud River","No","Regional District of Fraser-Fort George","Cariboo",{"$nulls":7},"",{"$nulls":6},"","",null,"",null,null,"",null,"Mud River","N",{"v":53.761239,"d":"53.76124"},{"v":-123.011877,"d":"-123.01188"},"http://www.google.com/maps/place/53.761239,-123.011877",8834,"Rural",24,10,"No","Yes","No","No ","Mud River","FALSE","FALSE"]
[null,8976,"Muncho Lake","No","Northern Rockies Regional Municipality","Northeast",{"$nulls":7},"",{"$nulls":6},"","",null,"",null,null,"",null,"Muncho Lake","N",{"v":58.9333,"d":"58.93330"},{"v":-125.766702,"d":"-125.76670"},"http://www.google.com/maps/place/58.9333,-125.766702",8976,"Rural",9,3,"No","Yes","No","No ","Muncho Lake","FALSE","FALSE"]
[null,8078,"Murrayville","Yes","Metro Vancouver Regional District","Lower Mainland--Southwest",{"$nulls":7},"",{"$nulls":6},"","",null,"",null,null,"",null,"Murrayville","N",{"v":49.090419,"d":"49.09042"},{"v":-122.616176,"d":"-122.61618"},"http://www.google.com/maps/place/49.090419,-122.616176",8078,"Urban",18781,6847,"Yes","No","No","No ","Murrayville","FALSE","FALSE"]
[null,8674,"Musgrave Landing","No","Capital Regional District","Vancouver Island and Coast",{"$nulls":7},"",{"$nulls":6},"","",null,"",null,null,"",null,"Musgrave Landing","N",{"v":48.751133,"d":"48.75113"},{"v":-123.546438,"d":"-123.54644"},"http://www.google.com/maps/place/48.751133,-123.546438",8674,"Rural",46,26,"No","Yes","No","No ","Musgrave Landing","FALSE","FALSE"]
[null,50550,"Musqueam*","Yes","Metro Vancouver Regional District","Lower Mainland--Southwest",{"$nulls":7},"",{"$nulls":6},"","",null,0,null,null,0,null,"Musqueam","Y",49.22494,{"v":-123.1992,"d":"-123.19920"},"http://www.google.com/maps/place/49.22494,-123.1992",50550,"Urban First Nations Primary Reserve",2584,1023,"Yes","No","No","No ","Musqueam*","FALSE","FALSE"]
[null,8199,"Myrtle Point","Yes","qathet Regional District","Vancouver Island and Coast",{"$nulls":7},"",{"$nulls":6},"","",null,"",null,null,"",null,"Myrtle Point","N",{"v":49.801185,"d":"49.80119"},{"v":-124.480551,"d":"-124.48055"},"http://www.google.com/maps/place/49.801185,-124.480551",8199,"Rural",7874,3801,"Yes","No","No","No ","Myrtle Point","FALSE","FALSE"]
[null,50612,"Nadleh Whuten*","No","Bulkley Nechako Regional District","Nechako",{"$nulls":7},"",{"$nulls":6},"","",null,0,null,null,0,null,"Nadleh Whuten","Y",{"v":54.086247902,"d":"54.08625"},{"v":-124.590887052,"d":"-124.59089"},"http://www.google.com/maps/place/54.086247902,-124.590887052",50612,"Rural First Nations Primary Reserve",211,109,"No","Yes","No","No ","Nadleh Whuten*","FALSE","FALSE"]
[null,8288,"Nahun","Yes","Regional District of Central Okanagan","Thompson--Okanagan",{"$nulls":7},"",{"$nulls":6},"","",null,"",null,null,"",null,"Nahun","N",{"v":50.083301,"d":"50.08330"},{"v":-119.499999,"d":"-119.50000"},"http://www.google.com/maps/place/50.083301,-119.499999",8288,"Rural",304,410,"Yes","No","No","No ","Nahun","FALSE","FALSE"]
[null,50614,"Nak'azdli Whut'en*","No","Bulkley Nechako Regional District","Nechako",{"$nulls":7},"",{"$nulls":6},"","",null,0,null,null,0,null,"Nak'azdli Whut'en","Y",{"v":54.438457861,"d":"54.43846"},{"v":-124.250154361,"d":"-124.25015"},"http://www.google.com/maps/place/54.438457861,-124.250154361",50614,"Rural First Nations Primary Reserve",1598,736,"No","Yes","No","No ","Nak'azdli Whut'en*","FALSE","FALSE"]
[null,8838,"Nak'azdli*","No","Bulkley Nechako Regional District","Nechako",{"$nulls":7},"",{"$nulls":6},"","",null,0,null,null,0,null,"Nak'azdli","Y",{"v":54.420834,"d":"54.42083"},{"v":-124.394444,"d":"-124.39444"},"http://www.google.com/maps/place/54.420834,-124.394444",8838,"Rural First Nations Secondary Reserve",139,63,"No","Yes","No","No ","Nak'azdli*","FALSE","FALSE"]
[null,8026,{"$f":"HYPERLINK(AG737,AP737)","v":"Nakusp"},"No","Regional District of Central Kootenay","Kootenay",{"$nulls":7},{"$f":"IF(COUNT(V737)=0, \"\", IF(V737>=0,\"Sufficient Capacity\", IF(V737<0,\"Not Enough Capacity\")))","v":""},{"$nulls":6},{"$f":"IF(OR(ISBLANK(H737),ISBLANK(I737),ISBLANK(J737)), \"\",(H737*I737/J737))","v":""},{"$f":"IF(AND(COUNT(L737,U737)=2, OR($M$10=\"Last-Mile\", $M$10=\"Transport & Last-Mile\")), L737-U737, \"\")","v":""},null,{"$f":"IF(AD737=\"Y\",COUNT(H737), \"\")","v":""},null,null,{"$f":"IF(AD737=\"Y\",COUNT(P737), \"\")","v":""},null,"Nakusp","N",{"v":50.241827,"d":"50.24183"},{"v":-117.799072,"d":"-117.79907"},"http://www.google.com/maps/place/50.241827,-117.799072",8026,"Rural",1470,722,"No","Yes","No","No ",{"$f":"IF(AD737=\"Y\", CONCATENATE(AC737,\"*\"), AC737)","v":"Nakusp"},{"$f":"IF(G737=\"Last-Mile\",\"TRUE\",IF(G737=\"Transport & Last-Mile\",\"TRUE\",\"FALSE\"))","v":"FALSE"},{"$f":"IF(G737=\"Transport\",\"TRUE\",IF(G737=\"Transport & Last-Mile\",\"TRUE\",\"FALSE\"))","v":"FALSE"}]
[null,50631,"Namgis First Nation*","No","Regional District of Mount Waddington","Vancouver Island and Coast",{"$nulls":7},"",{"$nulls":6},"","",null,0,null,null,0,null,"Namgis First Nation","Y",{"v":50.596006166,"d":"50.59601"},{"v":-126.935274432,"d":"-126.93527"},"http://www.google.com/maps/place/50.596006166,-126.935274432",50631,"Rural First Nations Primary Reserve",622,302,"No","Yes","No","No ","Namgis First Nation*","FALSE","FALSE"]
[null,8624,"Namu","No","Central Coast Regional District","Vancouver Island and Coast",{"$nulls":7},"",{"$nulls":6},"","",null,"",null,null,"",null,"Namu","N",{"v":51.861341,"d":"51.86134"},{"v":-127.860426,"d":"-127.86043"},"http://www.google.com/maps/place/51.861341,-127.860426",8624,"Rural",1,1,"No","Yes","No","No ","Namu","FALSE","FALSE"]
[null,8702,"Nanaimo","Yes","Regional District of Nanaimo","Vancouver Island and Coast",{"$nulls":7},"",{"$nulls":6},"","",null,"",null,null,"",null,"Nanaimo","N",{"v":49.165924,"d":"49.16592"},{"v":-123.939147,"d":"-123.93915"},"http://www.google.com/maps/place/49.165924,-123.939147",8702,"Urban",30915,15722,"Yes","No","No","No ","Nanaimo","FALSE","FALSE"]
[null,8707,"Nanoose Bay","Yes","Regional District of Nanaimo","Vancouver Island and Coast",{"$nulls":7},"",{"$nulls":6},"","",null,"",null,null,"",null,"Nanoose Bay","N",{"v":49.266699,"d":"49.26670"},{"v":-124.199999,"d":"-124.20000"},"http://www.google.com/maps/place/49.266699,-124.199999",8707,"Rural",2091,963,"Yes","No","No","No ","Nanoose Bay","FALSE","FALSE"]
[null,50649,"Nanoose First Nation*","Yes","Regional District of Nanaimo","Vancouver Island and Coast",{"$nulls":7},"",{"$nulls":6},"","",null,0,null,null,0,null,"Nanoose First Nation","Y",{"v":49.252999981,"d":"49.25300"},{"v":-124.130031842,"d":"-124.13003"},"http://www.google.com/maps/place/49.252999981,-124.130031842",50649,"Rural First Nations Primary Reserve",1996,914,"Yes","No","No","No ","Nanoose First Nation*","FALSE","FALSE"]
[null,8131,"Naramata","Yes","Regional District of Okanagan-Similkameen","Thompson--Okanagan",{"$nulls":7},"",{"$nulls":6},"","",null,"",null,null,"",null,"Naramata","N",{"v":49.594183,"d":"49.59418"},{"v":-119.587073,"d":"-119.58707"},"http://www.google.com/maps/place/49.594183,-119.587073",8131,"Rural",2369,1184,"Yes","No","No","No ","Naramata","FALSE","FALSE"]
[null,8891,"Nass Camp","No","Regional District of Kitimat-Stikine","North Coast",{"$nulls":7},"",{"$nulls":6},"","",null,"",null,null,"",null,"Nass Camp","N",{"v":55.288422,"d":"55.28842"},{"v":-129.005623,"d":"-129.00562"},"http://www.google.com/maps/place/55.288422,-129.005623",8891,"Rural",13,10,"No","Yes","No","No ","Nass Camp","FALSE","FALSE"]
[null,8528,"Nazko","No","Cariboo Regional District","Cariboo",{"$nulls":7},"",{"$nulls":6},"","",null,"",null,null,"",null,"Nazko","N",{"v":53,"d":"53.00000"},{"v":-123.616699,"d":"-123.61670"},"http://www.google.com/maps/place/53,-123.616699",8528,"Rural",10,5,"No","Yes","No","No ","Nazko","FALSE","FALSE"]
[null,50720,"Nazko First Nation*","No","Cariboo Regional District","Cariboo",{"$nulls":7},"",{"$nulls":6},"","",null,0,null,null,0,null,"Nazko First Nation","Y",{"v":52.941256207,"d":"52.94126"},{"v":-123.580661728,"d":"-123.58066"},"http://www.google.com/maps/place/52.941256207,-123.580661728",50720,"Rural First Nations Primary Reserve",75,28,"No","Yes","No","No ","Nazko First Nation*","FALSE","FALSE"]
[null,8527,"Nazko*","No","Cariboo Regional District","Cariboo",{"$nulls":7},"",{"$nulls":6},"","",null,0,null,null,0,null,"Nazko","Y",{"v":53.217921,"d":"53.21792"},{"v":-123.501972,"d":"-123.50197"},"http://www.google.com/maps/place/53.217921,-123.501972",8527,"Rural First Nations Secondary Reserve",1,0,"No","Yes","No","No ","Nazko*","FALSE","FALSE"]
[null,8815,"Nee-Tahi-Buhn*","No","Bulkley Nechako Regional District","Nechako",{"$nulls":7},"",{"$nulls":6},"","",null,0,null,null,0,null,"Nee-Tahi-Buhn","Y",{"v":54.007445,"d":"54.00745"},{"v":-125.956161,"d":"-125.95616"},"http://www.google.com/maps/place/54.007445,-125.956161",8815,"Rural First Nations Secondary Reserve",11,7,"No","Yes","No","No ","Nee-Tahi-Buhn*","FALSE","FALSE"]
[null,50726,"Nee-Tahi-Buhn*","No","Bulkley Nechako Regional District","Nechako",{"$nulls":7},"",{"$nulls":6},"","",null,0,null,null,0,null,"Nee-Tahi-Buhn","Y",{"v":53.932956956,"d":"53.93296"},{"v":-125.66736571,"d":"-125.66737"},"http://www.google.com/maps/place/53.932956956,-125.66736571",50726,"Rural First Nations Primary Reserve",47,27,"No","Yes","No","No ","Nee-Tahi-Buhn*","FALSE","FALSE"]
[null,7957,"Nelson","Yes","Regional District of Central Kootenay","Kootenay",{"$nulls":7},"",{"$nulls":6},"","",null,"",null,null,"",null,"Nelson","N",{"v":49.497478,"d":"49.49748"},-117.28238,"http://www.google.com/maps/place/49.497478,-117.28238",7957,"Rural",6096,2888,"Yes","No","No","No ","Nelson","FALSE","FALSE"]
[null,8032,"Nelway","No","Regional District of Central Kootenay","Kootenay",{"$nulls":7},"",{"$nulls":6},"","",null,"",null,null,"",null,"Nelway","N",49.01466,{"v":-117.272979,"d":"-117.27298"},"http://www.google.com/maps/place/49.01466,-117.272979",8032,"Rural",35,19,"No","Yes","No","No ","Nelway","FALSE","FALSE"]
[null,8773,"Nemaiah Valley","No","Cariboo Regional District","Cariboo",{"$nulls":7},"",{"$nulls":6},"","",null,"",null,null,"",null,"Nemaiah Valley","N",{"v":51.477637,"d":"51.47764"},{"v":-123.886932,"d":"-123.88693"},"http://www.google.com/maps/place/51.477637,-123.886932",8773,"Rural",30,12,"No","Yes","No","No ","Nemaiah Valley","FALSE","FALSE"]
[null,51637,"Nenagwas (Tlowitsis Nation)*","Yes","Strathcona Regional District","Vancouver Island and Coast",{"$nulls":7},"",{"$nulls":6},"","",null,0,null,null,0,null,"Nenagwas (Tlowitsis Nation)","Y",{"v":49.908593,"d":"49.90859"},{"v":-125.208974,"d":"-125.20897"},"http://www.google.com/maps/place/49.908593,-125.208974",51637,"Rural First Nations Secondary Reserve",3137,1385,"Yes","No","No","No ","Nenagwas (Tlowitsis Nation)*","FALSE","FALSE"]
[null,50690,"Neskonlith*","No","Thompson-Nicola Regional District","Thompson--Okanagan",{"$nulls":7},"",{"$nulls":6},"","",null,0,null,null,0,null,"Neskonlith","Y",{"v":50.773332534,"d":"50.77333"},{"v":-119.730580052,"d":"-119.73058"},"http://www.google.com/maps/place/50.773332534,-119.730580052",50690,"Rural First Nations Primary Reserve",287,118,"No","No","No","No ","Neskonlith*","FALSE","FALSE"]
[null,50677,"New Aiyansh (Nisga'a Village of New Aiyansh)*","No","Regional District of Kitimat-Stikine","North Coast",{"$nulls":7},"",{"$nulls":6},"","",null,0,null,null,0,null,"New Aiyansh (Nisga'a Village of New Aiyansh)","Y",55.20553,{"v":-129.078713,"d":"-129.07871"},"http://www.google.com/maps/place/55.20553,-129.078713",50677,"Rural First Nations Primary Reserve",215,97,"No","Yes","No","No ","New Aiyansh (Nisga'a Village of New Aiyansh)*","FALSE","FALSE"]
[null,8176,"New Brighton","No","Sunshine Coast Regional District","Lower Mainland--Southwest",{"$nulls":7},"",{"$nulls":6},"","",null,"",null,null,"",null,"New Brighton","N",{"v":49.45,"d":"49.45000"},{"v":-123.433299,"d":"-123.43330"},"http://www.google.com/maps/place/49.45,-123.433299",8176,"Rural",101,323,"No","Yes","No","No ","New Brighton","FALSE","FALSE"]
[null,7961,"New Denver","No","Regional District of Central Kootenay","Kootenay",{"$nulls":7},"",{"$nulls":6},"","",null,"",null,null,"",null,"New Denver","N",{"v":49.9917,"d":"49.99170"},{"v":-117.373601,"d":"-117.37360"},"http://www.google.com/maps/place/49.9917,-117.373601",7961,"Rural",554,373,"No","Yes","No","No ","New Denver","FALSE","FALSE"]
[null,8849,"New Hazelton","No","Regional District of Kitimat-Stikine","North Coast",{"$nulls":7},"",{"$nulls":6},"","",null,"",null,null,"",null,"New Hazelton","N",{"v":55.246598,"d":"55.24660"},{"v":-127.585767,"d":"-127.58577"},"http://www.google.com/maps/place/55.246598,-127.585767",8849,"Rural",755,383,"No","No","No","No ","New Hazelton","FALSE","FALSE"]
[null,8106,"New Westminster","Yes","Metro Vancouver Regional District","Lower Mainland--Southwest",{"$nulls":7},"",{"$nulls":6},"","",null,"",null,null,"",null,"New Westminster","N",{"v":49.2167,"d":"49.21670"},{"v":-122.9167,"d":"-122.91670"},"http://www.google.com/maps/place/49.2167,-122.9167",8106,"Urban",85596,39368,"Yes","No","No","No ","New Westminster","FALSE","FALSE"]
[null,50566,"New Westminster*","Yes","Metro Vancouver Regional District","Lower Mainland--Southwest",{"$nulls":7},"",{"$nulls":6},"","",null,0,null,null,0,null,"New Westminster","Y",{"v":49.236323,"d":"49.23632"},{"v":-123.023974,"d":"-123.02397"},"http://www.google.com/maps/place/49.236323,-123.023974",50566,"Urban First Nations Secondary Reserve",155263,63204,"Yes","No","Yes","No ","New Westminster*","FALSE","FALSE"]
[null,7987,"Niagara","No","Regional District of Kootenay Boundary","Kootenay",{"$nulls":7},"",{"$nulls":6},"","",null,"",null,null,"",null,"Niagara","N",{"v":49.107056,"d":"49.10706"},-118.46584,"http://www.google.com/maps/place/49.107056,-118.46584",7987,"Rural",202,88,"No","Yes","No","No ","Niagara","FALSE","FALSE"]
[null,8336,"Nicholson","No","Columbia-Shuswap Regional District","Thompson--Okanagan",{"$nulls":7},"",{"$nulls":6},"","",null,"",null,null,"",null,"Nicholson","N",{"v":51.2481,"d":"51.24810"},{"v":-116.901429,"d":"-116.90143"},"http://www.google.com/maps/place/51.2481,-116.901429",8336,"Rural",694,384,"No","Yes","Yes","No ","Nicholson","FALSE","FALSE"]
[null,50696,"Nicomen*","No","Thompson-Nicola Regional District","Thompson--Okanagan",{"$nulls":7},"",{"$nulls":6},"","",null,0,null,null,0,null,"Nicomen","Y",{"v":50.264437138,"d":"50.26444"},{"v":-121.39824636,"d":"-121.39825"},"http://www.google.com/maps/place/50.264437138,-121.39824636",50696,"Rural First Nations Primary Reserve",68,22,"No","Yes","Yes","No ","Nicomen*","FALSE","FALSE"]
[null,8569,"Nimpkish","No","Regional District of Mount Waddington","Vancouver Island and Coast",{"$nulls":7},"",{"$nulls":6},"","",null,"",null,null,"",null,"Nimpkish","N",{"v":50.3333,"d":"50.33330"},{"v":-126.916701,"d":"-126.91670"},"http://www.google.com/maps/place/50.3333,-126.916701",8569,"Rural",0,0,"No","Yes","Yes","No ","Nimpkish","FALSE","FALSE"]
[null,8520,"Nimpo Lake","No","Cariboo Regional District","Cariboo",{"$nulls":7},"",{"$nulls":6},"","",null,"",null,null,"",null,"Nimpo Lake","N",{"v":52.336387,"d":"52.33639"},{"v":-125.140173,"d":"-125.14017"},"http://www.google.com/maps/place/52.336387,-125.140173",8520,"Rural",52,53,"No","No","Yes","No ","Nimpo Lake","FALSE","FALSE"]
[null,50671,"Nisga'a Village of Gingolx*","No","Regional District of Kitimat-Stikine","North Coast",{"$nulls":7},"",{"$nulls":6},"","",null,0,null,null,0,null,"Nisga'a Village of Gingolx","Y",{"v":54.994412418,"d":"54.99441"},{"v":-129.957333439,"d":"-129.95733"},"http://www.google.com/maps/place/54.994412418,-129.957333439",50671,"Rural First Nations Primary Reserve",365,140,"No","Yes","Yes","No ","Nisga'a Village of Gingolx*","FALSE","FALSE"]
[null,50699,"Nooaitch*","No","Thompson-Nicola Regional District","Thompson--Okanagan",{"$nulls":7},"",{"$nulls":6},"","",null,0,null,null,0,null,"Nooaitch","Y",{"v":50.153435773,"d":"50.15344"},{"v":-121.035106361,"d":"-121.03511"},"http://www.google.com/maps/place/50.153435773,-121.035106361",50699,"Rural First Nations Primary Reserve",153,61,"No","Yes","Yes","No ","Nooaitch*","FALSE","FALSE"]
[null,8579,"Nootka","No","Strathcona Regional District","Vancouver Island and Coast",{"$nulls":7},"",{"$nulls":6},"","",null,"",null,null,"",null,"Nootka","N",{"v":49.624775,"d":"49.62478"},{"v":-126.627196,"d":"-126.62720"},"http://www.google.com/maps/place/49.624775,-126.627196",8579,"Rural",4,3,"No","Yes","Yes","No ","Nootka","FALSE","FALSE"]
[null,8822,"Noralee","No","Bulkley Nechako Regional District","Nechako",{"$nulls":7},"",{"$nulls":6},"","",null,"",null,null,"",null,"Noralee","N",{"v":53.983301,"d":"53.98330"},{"v":-126.4333,"d":"-126.43330"},"http://www.google.com/maps/place/53.983301,-126.4333",8822,"Rural",24,14,"No","Yes","Yes","No ","Noralee","FALSE","FALSE"]
[null,100144,"Norbury Lake","No","Regional District of East Kootenay","Kootenay",{"$nulls":7},"",{"$nulls":6},"","",null,"",null,null,"",null,"Norbury Lake","N",{"v":49.53023111,"d":"49.53023"},{"v":-115.47897146,"d":"-115.47897"},"http://www.google.com/maps/place/49.53023111,-115.47897146",100144,"Rural",29,17,"No","Yes","Yes","No ","Norbury Lake","FALSE","FALSE"]
[null,8231,"North Bend","Yes","Fraser Valley Regional District","Lower Mainland--Southwest",{"$nulls":7},"",{"$nulls":6},"","",null,"",null,null,"",null,"North Bend","N",{"v":49.883299,"d":"49.88330"},{"v":-121.449999,"d":"-121.45000"},"http://www.google.com/maps/place/49.883299,-121.449999",8231,"Rural",96,83,"Yes","No","Yes","No ","North Bend","FALSE","FALSE"]
[null,8090,"North Delta","Yes","Metro Vancouver Regional District","Lower Mainland--Southwest",{"$nulls":7},"",{"$nulls":6},"","",null,"",null,null,"",null,"North Delta","N",{"v":49.154715,"d":"49.15472"},{"v":-122.911401,"d":"-122.91140"},"http://www.google.com/maps/place/49.154715,-122.911401",8090,"Urban",36651,12271,"Yes","No","Yes","No ","North Delta","FALSE","FALSE"]
[null,100139,"North Premier Lake","No","Regional District of East Kootenay","Kootenay",{"$nulls":7},"",{"$nulls":6},"","",null,"",null,null,"",null,"North Premier Lake","N",{"v":49.9749634,"d":"49.97496"},{"v":-115.6741719,"d":"-115.67417"},"http://www.google.com/maps/place/49.9749634,-115.6741719",100139,"Rural",53,33,"No","Yes","Yes","No ","North Premier Lake","FALSE","FALSE"]
[null,8662,"North Saanich","Yes","Capital Regional District","Vancouver Island and Coast",{"$nulls":7},"",{"$nulls":6},"","",null,"",null,null,"",null,"North Saanich","N",{"v":48.621723,"d":"48.62172"},{"v":-123.421463,"d":"-123.42146"},"http://www.google.com/maps/place/48.621723,-123.421463",8662,"Urban",14313,6822,"Yes","No","Yes","No ","North Saanich","FALSE","FALSE"]
[null,8110,"North Vancouver","Yes","Metro Vancouver Regional District","Lower Mainland--Southwest",{"$nulls":7},"",{"$nulls":6},"","",null,"",null,null,"",null,"North Vancouver","N",{"v":49.314238,"d":"49.31424"},{"v":-123.067197,"d":"-123.06720"},"http://www.google.com/maps/place/49.314238,-123.067197",8110,"Urban",65236,32287,"Yes","No","Yes","No ","North Vancouver","FALSE","FALSE"]
[null,8356,"Notch Hill","Yes","Columbia-Shuswap Regional District","Thompson--Okanagan",{"$nulls":7},"",{"$nulls":6},"","",null,"",null,null,"",null,"Notch Hill","N",{"v":50.852836,"d":"50.85284"},{"v":-119.435111,"d":"-119.43511"},"http://www.google.com/maps/place/50.852836,-119.435111",8356,"Rural",1069,651,"Yes","No","Yes","No ","Notch Hill","FALSE","FALSE"]
[null,50556,"N'Quatqua*","No","Squamish-Lillooet Regional District","Lower Mainland--Southwest",{"$nulls":7},"",{"$nulls":6},"","",null,0,null,null,0,null,"N'Quatqua","Y",{"v":50.527549614,"d":"50.52755"},{"v":-122.484196977,"d":"-122.48420"},"http://www.google.com/maps/place/50.527549614,-122.484196977",50556,"Rural First Nations Primary Reserve",185,105,"No","Yes","Yes","No ","N'Quatqua*","FALSE","FALSE"]
[null,50639,"Nuchatlaht*","No","Strathcona Regional District","Vancouver Island and Coast",{"$nulls":7},"",{"$nulls":6},"","",null,0,null,null,0,null,"Nuchatlaht","Y",{"v":49.990261631,"d":"49.99026"},{"v":-126.942083034,"d":"-126.94208"},"http://www.google.com/maps/place/49.990261631,-126.942083034",50639,"Rural First Nations Primary Reserve",23,8,"No","Yes","Yes","No ","Nuchatlaht*","FALSE","FALSE"]
[null,8776,"Nukko Lake","No","Regional District of Fraser-Fort George","Cariboo",{"$nulls":7},"",{"$nulls":6},"","",null,"",null,null,"",null,"Nukko Lake","N",{"v":54.083301,"d":"54.08330"},{"v":-122.983299,"d":"-122.98330"},"http://www.google.com/maps/place/54.083301,-122.983299",8776,"Rural",322,139,"No","Yes","No","No ","Nukko Lake","FALSE","FALSE"]
[null,8829,"Nulki*","No","Bulkley Nechako Regional District","Nechako",{"$nulls":7},"",{"$nulls":6},"","",null,0,null,null,0,null,"Nulki","Y",{"v":53.918487,"d":"53.91849"},{"v":-124.196575,"d":"-124.19658"},"http://www.google.com/maps/place/53.918487,-124.196575",8829,"Rural First Nations Secondary Reserve",28,13,"No","Yes","Yes","No ","Nulki*","FALSE","FALSE"]
[null,100154,"Nursery","Yes","Regional District of Kootenay Boundary","Kootenay",{"$nulls":7},"",{"$nulls":6},"","",null,"",null,null,"",null,"Nursery","N",{"v":49.016667,"d":"49.01667"},{"v":-118.4,"d":"-118.40000"},"http://www.google.com/maps/place/49.016667,-118.4",100154,"Rural",1280,642,"Yes","No","No","No ","Nursery","FALSE","FALSE"]
[null,50539,"Nuxalk Nation*","No","Central Coast Regional District","Vancouver Island and Coast",{"$nulls":7},"",{"$nulls":6},"","",null,0,null,null,0,null,"Nuxalk Nation","Y",{"v":52.363600918,"d":"52.36360"},{"v":-126.710542817,"d":"-126.71054"},"http://www.google.com/maps/place/52.363600918,-126.710542817",50539,"Rural First Nations Secondary Reserve",945,372,"No","Yes","No","No ","Nuxalk Nation*","FALSE","FALSE"]
[null,8645,"Oak Bay","Yes","Capital Regional District","Vancouver Island and Coast",{"$nulls":7},"",{"$nulls":6},"","",null,"",null,null,"",null,"Oak Bay","N",{"v":48.430129,"d":"48.43013"},{"v":-123.308908,"d":"-123.30891"},"http://www.google.com/maps/place/48.430129,-123.308908",8645,"Urban",20055,9167,"Yes","No","Yes","No ","Oak Bay","FALSE","FALSE"]
[null,8532,"Ocean Falls","No","Central Coast Regional District","Vancouver Island and Coast",{"$nulls":7},"",{"$nulls":6},"","",null,"",null,null,"",null,"Ocean Falls","N",{"v":52.347209,"d":"52.34721"},{"v":-127.6885,"d":"-127.68850"},"http://www.google.com/maps/place/52.347209,-127.6885",8532,"Rural",69,40,"No","Yes","No","No ","Ocean Falls","FALSE","FALSE"]
[null,8751,"Ocean Grove","Yes","Strathcona Regional District","Vancouver Island and Coast",{"$nulls":7},"",{"$nulls":6},"","",null,"",null,null,"",null,"Ocean Grove","N",{"v":49.952389,"d":"49.95239"},{"v":-125.201527,"d":"-125.20153"},"http://www.google.com/maps/place/49.952389,-125.201527",8751,"Urban",17608,7587,"Yes","No","Yes","No ","Ocean Grove","FALSE","FALSE"]
[null,8171,"Ogden","No","Squamish-Lillooet Regional District","Lower Mainland--Southwest",{"$nulls":7},"",{"$nulls":6},"","",null,"",null,null,"",null,"Ogden","N",{"v":50.7819,"d":"50.78190"},{"v":-122.8222,"d":"-122.82220"},"http://www.google.com/maps/place/50.7819,-122.8222",8171,"Rural",57,128,"No","Yes","Yes","No ","Ogden","FALSE","FALSE"]
[null,8147,"Okanagan Centre","Yes","Regional District of Central Okanagan","Thompson--Okanagan",{"$nulls":7},"",{"$nulls":6},"","",null,"",null,null,"",null,"Okanagan Centre","N",{"v":50.049999,"d":"50.05000"},{"v":-119.45,"d":"-119.45000"},"http://www.google.com/maps/place/50.049999,-119.45",8147,"Rural",5290,2317,"Yes","No","No","No ","Okanagan Centre","FALSE","FALSE"]
[null,8037,"Okanagan Falls","Yes","Regional District of Okanagan-Similkameen","Thompson--Okanagan",{"$nulls":7},"",{"$nulls":6},"","",null,"",null,null,"",null,"Okanagan Falls","N",{"v":49.342811,"d":"49.34281"},{"v":-119.571233,"d":"-119.57123"},"http://www.google.com/maps/place/49.342811,-119.571233",8037,"Rural",2732,1518,"Yes","No","Yes","No ","Okanagan Falls","FALSE","FALSE"]
[null,8138,"Okanagan Mission","Yes","Regional District of Central Okanagan","Thompson--Okanagan",{"$nulls":7},"",{"$nulls":6},"","",null,"",null,null,"",null,"Okanagan Mission","N",{"v":49.816701,"d":"49.81670"},{"v":-119.4833,"d":"-119.48330"},"http://www.google.com/maps/place/49.816701,-119.4833",8138,"Urban",12549,4342,"Yes","No","Yes","No ","Okanagan Mission","FALSE","FALSE"]
[null,8296,"Okanagan*","No","Columbia-Shuswap Regional District","Thompson--Okanagan",{"$nulls":7},"",{"$nulls":6},"","",null,0,null,null,0,null,"Okanagan","Y",{"v":50.430341,"d":"50.43034"},{"v":-119.341435,"d":"-119.34144"},"http://www.google.com/maps/place/50.430341,-119.341435",8296,"Rural First Nations Secondary Reserve",66,33,"No","Yes","Yes","No ","Okanagan*","FALSE","FALSE"]
[null,8144,"Okanagan*","Yes","Regional District of Central Okanagan","Thompson--Okanagan",{"$nulls":7},"",{"$nulls":6},"","",null,0,null,null,0,null,"Okanagan","Y",{"v":50.007636,"d":"50.00764"},{"v":-119.396944,"d":"-119.39694"},"http://www.google.com/maps/place/50.007636,-119.396944",8144,"Rural First Nations Secondary Reserve",1697,1401,"Yes","No","No","No ","Okanagan*","FALSE","FALSE"]
[null,8284,"Okanagan*","Yes","Regional District of North Okanagan","Thompson--Okanagan",{"$nulls":7},"",{"$nulls":6},"","",null,0,null,null,0,null,"Okanagan","Y",{"v":50.247252,"d":"50.24725"},{"v":-119.337691,"d":"-119.33769"},"http://www.google.com/maps/place/50.247252,-119.337691",8284,"Urban First Nations Secondary Reserve",11899,5307,"Yes","No","No","No ","Okanagan*","FALSE","FALSE"]
[null,8293,"Okanagan*","No","Regional District of North Okanagan","Thompson--Okanagan",{"$nulls":7},"",{"$nulls":6},"","",null,0,null,null,0,null,"Okanagan","Y",{"v":50.234306,"d":"50.23431"},{"v":-119.448288,"d":"-119.44829"},"http://www.google.com/maps/place/50.234306,-119.448288",8293,"Rural First Nations Secondary Reserve",1282,884,"No","No","Yes","No ","Okanagan*","FALSE","FALSE"]
[null,50616,"Okanagan*","Yes","Regional District of North Okanagan","Thompson--Okanagan",{"$nulls":7},"",{"$nulls":6},"","",null,0,null,null,0,null,"Okanagan","Y",{"v":50.356222024,"d":"50.35622"},{"v":-119.318103845,"d":"-119.31810"},"http://www.google.com/maps/place/50.356222024,-119.318103845",50616,"Rural First Nations Primary Reserve",957,481,"Yes","No","No","No ","Okanagan*","FALSE","FALSE"]
[null,8038,"Olalla","No","Regional District of Okanagan-Similkameen","Thompson--Okanagan",{"$nulls":7},"",{"$nulls":6},"","",null,"",null,null,"",null,"Olalla","N",{"v":49.263407,"d":"49.26341"},{"v":-119.829031,"d":"-119.82903"},"http://www.google.com/maps/place/49.263407,-119.829031",8038,"Rural",383,243,"No","Yes","Yes","No ","Olalla","FALSE","FALSE"]
[null,8933,"Old Fort","Yes","Peace River Regional District","Northeast",{"$nulls":7},"",{"$nulls":6},"","",null,"",null,null,"",null,"Old Fort","N",{"v":56.202176,"d":"56.20218"},-120.82327,"http://www.google.com/maps/place/56.202176,-120.82327",8933,"Rural",8797,4393,"Yes","No","Yes","No ","Old Fort","FALSE","FALSE"]
[null,8798,"Old Fort*","No","Bulkley Nechako Regional District","Nechako",{"$nulls":7},"",{"$nulls":6},"","",null,0,null,null,0,null,"Old Fort","Y",{"v":55.037629,"d":"55.03763"},{"v":-126.317515,"d":"-126.31752"},"http://www.google.com/maps/place/55.037629,-126.317515",8798,"Rural First Nations Primary Reserve",null,null,"No","No","Yes","No ","Old Fort*","FALSE","FALSE"]
[null,50669,"Old Massett (Old Massett Village Council)*","No","North Coast Regional District","North Coast",{"$nulls":7},"",{"$nulls":6},"","",null,0,null,null,0,null,"Old Massett (Old Massett Village Council)","Y",{"v":54.034414102,"d":"54.03441"},{"v":-132.175030324,"d":"-132.17503"},"http://www.google.com/maps/place/54.034414102,-132.175030324",50669,"Rural First Nations Primary Reserve",788,412,"No","Yes","No","No ","Old Massett (Old Massett Village Council)*","FALSE","FALSE"]
[null,9043,"Old Town","No","Regional District of East Kootenay","Kootenay",{"$nulls":7},"",{"$nulls":6},"","",null,"",null,null,"",null,"Old Town","N",{"v":49.550001,"d":"49.55000"},{"v":-115.9667,"d":"-115.96670"},"http://www.google.com/maps/place/49.550001,-115.9667",9043,"Rural",30,17,"No","Yes","No","No ","Old Town","FALSE","FALSE"]
[null,7996,"Oliver","Yes","Regional District of Okanagan-Similkameen","Thompson--Okanagan",{"$nulls":7},"",{"$nulls":6},"","",null,"",null,null,"",null,"Oliver","N",{"v":49.182583,"d":"49.18258"},{"v":-119.552692,"d":"-119.55269"},"http://www.google.com/maps/place/49.182583,-119.552692",7996,"Rural",5824,2714,"Yes","No","Yes","No ","Oliver","FALSE","FALSE"]
[null,9050,{"$f":"HYPERLINK(AG801,AP801)","v":"Oliver's Landing"},"No","Squamish-Lillooet Regional District","Lower Mainland--Southwest",{"$nulls":7},{"$f":"IF(COUNT(V801)=0, \"\", IF(V801>=0,\"Sufficient Capacity\", IF(V801<0,\"Not Enough Capacity\")))","v":""},{"$nulls":6},{"$f":"IF(OR(ISBLANK(H801),ISBLANK(I801),ISBLANK(J801)), \"\",(H801*I801/J801))","v":""},{"$f":"IF(AND(COUNT(L801,U801)=2, OR($M$10=\"Last-Mile\", $M$10=\"Transport & Last-Mile\")), L801-U801, \"\")","v":""},null,{"$f":"IF(AD801=\"Y\",COUNT(H801), \"\")","v":""},null,null,{"$f":"IF(AD801=\"Y\",COUNT(P801), \"\")","v":""},null,"Oliver's Landing","N",{"v":49.583301,"d":"49.58330"},{"v":-123.220801,"d":"-123.22080"},"http://www.google.com/maps/place/49.583301,-123.220801",9050,"Rural",254,132,"No","No","Yes","No ",{"$f":"IF(AD801=\"Y\", CONCATENATE(AC801,\"*\"), AC801)","v":"Oliver's Landing"},{"$f":"IF(G801=\"Last-Mile\",\"TRUE\",IF(G801=\"Transport & Last-Mile\",\"TRUE\",\"FALSE\"))","v":"FALSE"},{"$f":"IF(G801=\"Transport\",\"TRUE\",IF(G801=\"Transport & Last-Mile\",\"TRUE\",\"FALSE\"))","v":"FALSE"}]
[null,8880,"Oona River","No","North Coast Regional District","North Coast",{"$nulls":7},"",{"$nulls":6},"","",null,"",null,null,"",null,"Oona River","N",{"v":53.946875,"d":"53.94688"},{"v":-130.255822,"d":"-130.25582"},"http://www.google.com/maps/place/53.946875,-130.255822",8880,"Rural",10,18,"No","Yes","Yes","No ","Oona River","FALSE","FALSE"]
[null,7969,"Ootischenia","Yes","Regional District of Central Kootenay","Kootenay",{"$nulls":7},"",{"$nulls":6},"","",null,"",null,null,"",null,"Ootischenia","N",{"v":49.2833,"d":"49.28330"},{"v":-117.6333,"d":"-117.63330"},"http://www.google.com/maps/place/49.2833,-117.6333",7969,"Rural",2797,1298,"Yes","No","No","No ","Ootischenia","FALSE","FALSE"]
[null,8824,"Ootsa Lake","No","Bulkley Nechako Regional District","Nechako",{"$nulls":7},"",{"$nulls":6},"","",null,"",null,null,"",null,"Ootsa Lake","N",53.80677,{"v":-126.041852,"d":"-126.04185"},"http://www.google.com/maps/place/53.80677,-126.041852",8824,"Rural",12,10,"No","Yes","Yes","No ","Ootsa Lake","FALSE","FALSE"]
[null,50660,"Opitsat (Tla-o-qui-aht First Nations)*","Yes","Regional District of Alberni-Clayoquot","Vancouver Island and Coast",{"$nulls":7},"",{"$nulls":6},"","",null,0,null,null,0,null,"Opitsat (Tla-o-qui-aht First Nations)","Y",{"v":49.173348235,"d":"49.17335"},{"v":-125.912071784,"d":"-125.91207"},"http://www.google.com/maps/place/49.173348235,-125.912071784",50660,"Rural First Nations Primary Reserve",511,241,"Yes","No","Yes","No ","Opitsat (Tla-o-qui-aht First Nations)*","FALSE","FALSE"]
[null,8270,"Oregon Jack Creek*","No","Thompson-Nicola Regional District","Thompson--Okanagan",{"$nulls":7},"",{"$nulls":6},"","",null,0,null,null,0,null,"Oregon Jack Creek","Y",{"v":50.666701,"d":"50.66670"},{"v":-121.266699,"d":"-121.26670"},"http://www.google.com/maps/place/50.666701,-121.266699",8270,"Rural First Nations Secondary Reserve",54,19,"No","Yes","Yes","No ","Oregon Jack Creek*","FALSE","FALSE"]
[null,8950,"Osborn","No","Peace River Regional District","Northeast",{"$nulls":7},"",{"$nulls":6},"","",null,"",null,null,"",null,"Osborn","N",{"v":56.604199,"d":"56.60420"},{"v":-120.377801,"d":"-120.37780"},"http://www.google.com/maps/place/56.604199,-120.377801",8950,"Rural",57,21,"No","Yes","Yes","No ","Osborn","FALSE","FALSE"]
[null,8878,"Osland","No","North Coast Regional District","North Coast",{"$nulls":7},"",{"$nulls":6},"","",null,"",null,null,"",null,"Osland","N",{"v":54.137204,"d":"54.13720"},{"v":-130.160619,"d":"-130.16062"},"http://www.google.com/maps/place/54.137204,-130.160619",8878,"Rural",10,18,"No","Yes","Yes","No ","Osland","FALSE","FALSE"]
[null,7993,"Osoyoos","Yes","Regional District of Okanagan-Similkameen","Thompson--Okanagan",{"$nulls":7},"",{"$nulls":6},"","",null,"",null,null,"",null,"Osoyoos","N",{"v":49.031096,"d":"49.03110"},{"v":-119.464802,"d":"-119.46480"},"http://www.google.com/maps/place/49.031096,-119.464802",7993,"Rural",4370,2282,"Yes","No","Yes","No ","Osoyoos","FALSE","FALSE"]
[null,50596,"Osoyoos*","Yes","Regional District of Okanagan-Similkameen","Thompson--Okanagan",{"$nulls":7},"",{"$nulls":6},"","",null,0,null,null,0,null,"Osoyoos","Y",{"v":49.184677743,"d":"49.18468"},{"v":-119.536597194,"d":"-119.53660"},"http://www.google.com/maps/place/49.184677743,-119.536597194",50596,"Rural First Nations Primary Reserve",5824,2714,"Yes","No","Yes","No ","Osoyoos*","FALSE","FALSE"]
[null,50541,"Oweekeno (Wuikinuxv Nation)*","No","Central Coast Regional District","Vancouver Island and Coast",{"$nulls":7},"",{"$nulls":6},"","",null,0,null,null,0,null,"Oweekeno (Wuikinuxv Nation)","Y",{"v":51.680112586,"d":"51.68011"},{"v":-127.23206379,"d":"-127.23206"},"http://www.google.com/maps/place/51.680112586,-127.23206379",50541,"Rural First Nations Primary Reserve",36,21,"No","Yes","Yes","No ","Oweekeno (Wuikinuxv Nation)*","FALSE","FALSE"]
[null,9057,"Owen Bay","No","Strathcona Regional District","Vancouver Island and Coast",{"$nulls":7},"",{"$nulls":6},"","",null,"",null,null,"",null,"Owen Bay","N",{"v":50.316879,"d":"50.31688"},{"v":-125.214114,"d":"-125.21411"},"http://www.google.com/maps/place/50.316879,-125.214114",9057,"Rural",12,23,"No","Yes","Yes","No ","Owen Bay","FALSE","FALSE"]
[null,8148,"Oyama","Yes","Regional District of Central Okanagan","Thompson--Okanagan",{"$nulls":7},"",{"$nulls":6},"","",null,"",null,null,"",null,"Oyama","N",{"v":50.111076,"d":"50.11108"},{"v":-119.367611,"d":"-119.36761"},"http://www.google.com/maps/place/50.111076,-119.367611",8148,"Rural",1396,654,"Yes","No","Yes","No ","Oyama","FALSE","FALSE"]
[null,8746,"Oyster River","Yes","Strathcona Regional District","Vancouver Island and Coast",{"$nulls":7},"",{"$nulls":6},"","",null,"",null,null,"",null,"Oyster River","N",49.87375,{"v":-125.129065,"d":"-125.12907"},"http://www.google.com/maps/place/49.87375,-125.129065",8746,"Rural",1501,701,"Yes","No","Yes","No ","Oyster River","FALSE","FALSE"]
[null,50658,"Pacheedaht First Nation*","No","Capital Regional District","Vancouver Island and Coast",{"$nulls":7},"",{"$nulls":6},"","",null,0,null,null,0,null,"Pacheedaht First Nation","Y",{"v":48.576773609,"d":"48.57677"},{"v":-124.407701127,"d":"-124.40770"},"http://www.google.com/maps/place/48.576773609,-124.407701127",50658,"Rural First Nations Primary Reserve",72,36,"No","Yes","Yes","No ","Pacheedaht First Nation*","FALSE","FALSE"]
[null,8018,"Panorama","No","Regional District of East Kootenay","Kootenay",{"$nulls":7},"",{"$nulls":6},"","",null,"",null,null,"",null,"Panorama","N",{"v":50.458333,"d":"50.45833"},{"v":-116.2375,"d":"-116.23750"},"http://www.google.com/maps/place/50.458333,-116.2375",8018,"Rural",128,82,"No","Yes","Yes","No ","Panorama","FALSE","FALSE"]
[null,7983,"Park Siding","No","Regional District of Kootenay Boundary","Kootenay",{"$nulls":7},"",{"$nulls":6},"","",null,"",null,null,"",null,"Park Siding","N",{"v":49.172462,"d":"49.17246"},{"v":-117.493484,"d":"-117.49348"},"http://www.google.com/maps/place/49.172462,-117.493484",7983,"Rural",165,71,"No","No","Yes","No ","Park Siding","FALSE","FALSE"]
[null,8709,"Parksville","Yes","Regional District of Nanaimo","Vancouver Island and Coast",{"$nulls":7},"",{"$nulls":6},"","",null,"",null,null,"",null,"Parksville","N",{"v":49.322695,"d":"49.32270"},-124.32666,"http://www.google.com/maps/place/49.322695,-124.32666",8709,"Rural",12372,6119,"Yes","No","Yes","No ","Parksville","FALSE","FALSE"]
[null,8337,"Parson","No","Columbia-Shuswap Regional District","Thompson--Okanagan",{"$nulls":7},"",{"$nulls":6},"","",null,"",null,null,"",null,"Parson","N",{"v":51.070818,"d":"51.07082"},{"v":-116.632488,"d":"-116.63249"},"http://www.google.com/maps/place/51.070818,-116.632488",8337,"Rural",85,42,"No","Yes","Yes","No ","Parson","FALSE","FALSE"]
[null,100149,"Pass Creek","No","Regional District of East Kootenay","Kootenay",{"$nulls":7},"",{"$nulls":6},"","",null,"",null,null,"",null,"Pass Creek","N",{"v":49.38848056,"d":"49.38848"},{"v":-114.679275,"d":"-114.67928"},"http://www.google.com/maps/place/49.38848056,-114.679275",100149,"Rural",0,0,"No","Yes","Yes","No ","Pass Creek","FALSE","FALSE"]
[null,100122,"Passmore","No","Regional District of Central Kootenay","Kootenay",{"$nulls":7},"",{"$nulls":6},"","",null,"",null,null,"",null,"Passmore","N",{"v":49.533333,"d":"49.53333"},{"v":-117.65,"d":"-117.65000"},"http://www.google.com/maps/place/49.533333,-117.65",100122,"Rural",286,144,"No","Yes","Yes","No ","Passmore","FALSE","FALSE"]
[null,8033,"Paterson","No","Regional District of Kootenay Boundary","Kootenay",{"$nulls":7},"",{"$nulls":6},"","",null,"",null,null,"",null,"Paterson","N",49.00668,-117.83111,"http://www.google.com/maps/place/49.00668,-117.83111",8033,"Rural",21,11,"No","Yes","Yes","No ","Paterson","FALSE","FALSE"]
[null,50652,"Pauquachin*","Yes","Capital Regional District","Vancouver Island and Coast",{"$nulls":7},"",{"$nulls":6},"","",null,0,null,null,0,null,"Pauquachin","Y",{"v":48.627153456,"d":"48.62715"},{"v":-123.458456922,"d":"-123.45846"},"http://www.google.com/maps/place/48.627153456,-123.458456922",50652,"Urban First Nations Primary Reserve",1713,710,"Yes","No","Yes","No ","Pauquachin*","FALSE","FALSE"]
[null,50594,"Pavilion (Ts'kw'aylaxw First Nation)*","No","Squamish-Lillooet Regional District","Lower Mainland--Southwest",{"$nulls":7},"",{"$nulls":6},"","",null,0,null,null,0,null,"Pavilion (Ts'kw'aylaxw First Nation)","Y",{"v":50.885892747,"d":"50.88589"},{"v":-121.818992986,"d":"-121.81899"},"http://www.google.com/maps/place/50.885892747,-121.818992986",50594,"Rural First Nations Primary Reserve",52,25,"No","Yes","Yes","No ","Pavilion (Ts'kw'aylaxw First Nation)*","FALSE","FALSE"]
[null,8132,"Peachland","Yes","Regional District of Central Okanagan","Thompson--Okanagan",{"$nulls":7},"",{"$nulls":6},"","",null,"",null,null,"",null,"Peachland","N",{"v":49.778638,"d":"49.77864"},{"v":-119.736108,"d":"-119.73611"},"http://www.google.com/maps/place/49.778638,-119.736108",8132,"Urban",3247,1704,"Yes","No","Yes","No ","Peachland","FALSE","FALSE"]
[null,8951,"Peejay","No","Peace River Regional District","Northeast",{"$nulls":7},"",{"$nulls":6},"","",null,"",null,null,"",null,"Peejay","N",{"v":56.883299,"d":"56.88330"},{"v":-120.6167,"d":"-120.61670"},"http://www.google.com/maps/place/56.883299,-120.6167",8951,"Rural",17,6,"No","Yes","Yes","No ","Peejay","FALSE","FALSE"]
[null,8165,"Pemberton","Yes","Squamish-Lillooet Regional District","Lower Mainland--Southwest",{"$nulls":7},"",{"$nulls":6},"","",null,"",null,null,"",null,"Pemberton","N",{"v":50.318067,"d":"50.31807"},{"v":-122.798189,"d":"-122.79819"},"http://www.google.com/maps/place/50.318067,-122.798189",8165,"Rural",790,331,"Yes","No","Yes","No ","Pemberton","FALSE","FALSE"]
[null,8170,"Pemberton Meadows","Yes","Squamish-Lillooet Regional District","Lower Mainland--Southwest",{"$nulls":7},"",{"$nulls":6},"","",null,"",null,null,"",null,"Pemberton Meadows","N",{"v":50.4417,"d":"50.44170"},{"v":-122.9167,"d":"-122.91670"},"http://www.google.com/maps/place/50.4417,-122.9167",8170,"Rural",53,30,"Yes","No","Yes","No ","Pemberton Meadows","FALSE","FALSE"]
[null,8842,"Pendleton Bay","No","Bulkley Nechako Regional District","Nechako",{"$nulls":7},"",{"$nulls":6},"","",null,"",null,null,"",null,"Pendleton Bay","N",{"v":54.516701,"d":"54.51670"},{"v":-125.716699,"d":"-125.71670"},"http://www.google.com/maps/place/54.516701,-125.716699",8842,"Rural",28,60,"No","Yes","Yes","No ","Pendleton Bay","FALSE","FALSE"]
[null,50650,"Penelakut (Penelakut Tribe)*","No","Cowichan Valley Regional District","Vancouver Island and Coast",{"$nulls":7},"",{"$nulls":6},"","",null,0,null,null,0,null,"Penelakut (Penelakut Tribe)","Y",{"v":48.97149163,"d":"48.97149"},{"v":-123.658393775,"d":"-123.65839"},"http://www.google.com/maps/place/48.97149163,-123.658393775",50650,"Rural First Nations Primary Reserve",724,348,"No","No","Yes","No ","Penelakut (Penelakut Tribe)*","FALSE","FALSE"]
[null,8416,"Penny","No","Regional District of Fraser-Fort George","Cariboo",{"$nulls":7},"",{"$nulls":6},"","",null,"",null,null,"",null,"Penny","N",{"v":53.847405,"d":"53.84741"},{"v":-121.283521,"d":"-121.28352"},"http://www.google.com/maps/place/53.847405,-121.283521",8416,"Rural",0,0,"No","Yes","Yes","No ","Penny","FALSE","FALSE"]
[null,8001,"Penticton","Yes","Regional District of Okanagan-Similkameen","Thompson--Okanagan",{"$nulls":7},"",{"$nulls":6},"","",null,"",null,null,"",null,"Penticton","N",{"v":49.482156,"d":"49.48216"},{"v":-119.584947,"d":"-119.58495"},"http://www.google.com/maps/place/49.482156,-119.584947",8001,"Urban",18171,9566,"Yes","No","Yes","No ","Penticton","FALSE","FALSE"]
[null,50597,"Penticton*","Yes","Regional District of Okanagan-Similkameen","Thompson--Okanagan",{"$nulls":7},"",{"$nulls":6},"","",null,0,null,null,0,null,"Penticton","Y",{"v":49.49136808,"d":"49.49137"},{"v":-119.644762842,"d":"-119.64476"},"http://www.google.com/maps/place/49.49136808,-119.644762842",50597,"Rural First Nations Primary Reserve",18171,9566,"Yes","No","Yes","No ","Penticton*","FALSE","FALSE"]
[null,8792,"Perow","No","Bulkley Nechako Regional District","Nechako",{"$nulls":7},"",{"$nulls":6},"","",null,"",null,null,"",null,"Perow","N",54.52018,{"v":-126.440459,"d":"-126.44046"},"http://www.google.com/maps/place/54.52018,-126.440459",8792,"Rural",68,28,"No","Yes","Yes","No ","Perow","FALSE","FALSE"]
[null,100117,"Perrys","No","Regional District of Central Kootenay","Kootenay",{"$nulls":7},"",{"$nulls":6},"","",null,"",null,null,"",null,"Perrys","N",{"v":49.65833333,"d":"49.65833"},{"v":-117.5111111,"d":"-117.51111"},"http://www.google.com/maps/place/49.65833333,-117.5111111",100117,"Rural",341,184,"No","Yes","Yes","No ","Perrys","FALSE","FALSE"]
[null,50586,"Peters First Nation*","No","Fraser Valley Regional District","Lower Mainland--Southwest",{"$nulls":7},"",{"$nulls":6},"","",null,0,null,null,0,null,"Peters First Nation","Y",{"v":49.293865117,"d":"49.29387"},{"v":-121.657945525,"d":"-121.65795"},"http://www.google.com/maps/place/49.293865117,-121.657945525",50586,"Rural First Nations Primary Reserve",38,18,"No","No","Yes","No ","Peters First Nation*","FALSE","FALSE"]
[null,9052,"Phillips Arm","No","Strathcona Regional District","Vancouver Island and Coast",{"$nulls":7},"",{"$nulls":6},"","",null,"",null,null,"",null,"Phillips Arm","N",{"v":50.545928,"d":"50.54593"},{"v":-125.356483,"d":"-125.35648"},"http://www.google.com/maps/place/50.545928,-125.356483",9052,"Rural",6,20,"No","Yes","No","No ","Phillips Arm","FALSE","FALSE"]
[null,8367,"Pinantan Lake","No","Thompson-Nicola Regional District","Thompson--Okanagan",{"$nulls":7},"",{"$nulls":6},"","",null,"",null,null,"",null,"Pinantan Lake","N",{"v":50.726423,"d":"50.72642"},{"v":-120.036217,"d":"-120.03622"},"http://www.google.com/maps/place/50.726423,-120.036217",8367,"Rural",650,264,"No","Yes","Yes","No ","Pinantan Lake","FALSE","FALSE"]
[null,8804,"Pinchi Lake","No","Bulkley Nechako Regional District","Nechako",{"$nulls":7},"",{"$nulls":6},"","",null,"",null,null,"",null,"Pinchi Lake","N",54.62715,{"v":-124.404205,"d":"-124.40421"},"http://www.google.com/maps/place/54.62715,-124.404205",8804,"Rural",13,7,"No","Yes","No","No ","Pinchi Lake","FALSE","FALSE"]
[null,8805,"Pinchi*","No","Bulkley Nechako Regional District","Nechako",{"$nulls":7},"",{"$nulls":6},"","",null,0,null,null,0,null,"Pinchi","Y",{"v":54.570593,"d":"54.57059"},{"v":-124.493298,"d":"-124.49330"},"http://www.google.com/maps/place/54.570593,-124.493298",8805,"Rural First Nations Secondary Reserve",178,79,"No","Yes","No","No ","Pinchi*","FALSE","FALSE"]
[null,8463,"Pine Valley","No","Cariboo Regional District","Cariboo",{"$nulls":7},"",{"$nulls":6},"","",null,"",null,null,"",null,"Pine Valley","N",{"v":52.175254,"d":"52.17525"},{"v":-122.089671,"d":"-122.08967"},"http://www.google.com/maps/place/52.175254,-122.089671",8463,"Rural",727,280,"No","No","No","No ","Pine Valley","FALSE","FALSE"]
[null,8908,"Pine Valley","No","Peace River Regional District","Northeast",{"$nulls":7},"",{"$nulls":6},"","",null,"",null,null,"",null,"Pine Valley","N",{"v":55.636062,"d":"55.63606"},{"v":-122.114868,"d":"-122.11487"},"http://www.google.com/maps/place/55.636062,-122.114868",8908,"Rural",2,1,"No","Yes","No","No ","Pine Valley","FALSE","FALSE"]
[null,8201,"Pinetree","Yes","qathet Regional District","Vancouver Island and Coast",{"$nulls":7},"",{"$nulls":6},"","",null,"",null,null,"",null,"Pinetree","N",{"v":49.775021,"d":"49.77502"},{"v":-124.418874,"d":"-124.41887"},"http://www.google.com/maps/place/49.775021,-124.418874",8201,"Rural",943,472,"Yes","No","No","No ","Pinetree","FALSE","FALSE"]
[null,8431,"Pineview","No","Regional District of Fraser-Fort George","Cariboo",{"$nulls":7},"",{"$nulls":6},"","",null,"",null,null,"",null,"Pineview","N",{"v":53.836664,"d":"53.83666"},-122.65769,"http://www.google.com/maps/place/53.836664,-122.65769",8431,"Rural",1068,476,"No","No","Yes","No ","Pineview","FALSE","FALSE"]
[null,8960,"Pink Mountain","No","Peace River Regional District","Northeast",{"$nulls":7},"",{"$nulls":6},"","",null,"",null,null,"",null,"Pink Mountain","N",{"v":57.035654,"d":"57.03565"},{"v":-122.507348,"d":"-122.50735"},"http://www.google.com/maps/place/57.035654,-122.507348",8960,"Rural",39,14,"No","Yes","Yes","No ","Pink Mountain","FALSE","FALSE"]
[null,8126,"Pitt Meadows","Yes","Metro Vancouver Regional District","Lower Mainland--Southwest",{"$nulls":7},"",{"$nulls":6},"","",null,"",null,null,"",null,"Pitt Meadows","N",{"v":49.217152,"d":"49.21715"},{"v":-122.686296,"d":"-122.68630"},"http://www.google.com/maps/place/49.217152,-122.686296",8126,"Urban",16904,6634,"Yes","No","Yes","No ","Pitt Meadows","FALSE","FALSE"]
[null,100125,"Playmor Junction","Yes","Regional District of Central Kootenay","Kootenay",{"$nulls":7},"",{"$nulls":6},"","",null,"",null,null,"",null,"Playmor Junction","N",{"v":49.45,"d":"49.45000"},-117.53333,"http://www.google.com/maps/place/49.45,-117.53333",100125,"Rural",920,389,"Yes","No","Yes","No ","Playmor Junction","FALSE","FALSE"]
[null,8994,"Pleasant Camp","No","Stikine Regional District (Unincorporated)","Nechako",{"$nulls":7},"",{"$nulls":6},"","",null,"",null,null,"",null,"Pleasant Camp","N",{"v":59.454639,"d":"59.45464"},{"v":-136.365147,"d":"-136.36515"},"http://www.google.com/maps/place/59.454639,-136.365147",8994,"Rural",3,5,"No","Yes","Yes","No ","Pleasant Camp","FALSE","FALSE"]
[null,8113,"Pleasantside","Yes","Metro Vancouver Regional District","Lower Mainland--Southwest",{"$nulls":7},"",{"$nulls":6},"","",null,"",null,null,"",null,"Pleasantside","N",{"v":49.293415,"d":"49.29342"},{"v":-122.847407,"d":"-122.84741"},"http://www.google.com/maps/place/49.293415,-122.847407",8113,"Urban",43149,17723,"Yes","No","No","No ","Pleasantside","FALSE","FALSE"]
[null,8190,"Pope Landing","Yes","Sunshine Coast Regional District","Lower Mainland--Southwest",{"$nulls":7},"",{"$nulls":6},"","",null,"",null,null,"",null,"Pope Landing","N",{"v":49.614544,"d":"49.61454"},{"v":-124.048368,"d":"-124.04837"},"http://www.google.com/maps/place/49.614544,-124.048368",8190,"Rural",1422,1062,"Yes","No","No","No ","Pope Landing","FALSE","FALSE"]
[null,8055,"Popkum","No","Fraser Valley Regional District","Lower Mainland--Southwest",{"$nulls":7},"",{"$nulls":6},"","",null,"",null,null,"",null,"Popkum","N",49.20022,{"v":-121.736082,"d":"-121.73608"},"http://www.google.com/maps/place/49.20022,-121.736082",8055,"Rural",253,113,"No","No","No","No ","Popkum","FALSE","FALSE"]
[null,50585,"Popkum*","No","Fraser Valley Regional District","Lower Mainland--Southwest",{"$nulls":7},"",{"$nulls":6},"","",null,0,null,null,0,null,"Popkum","Y",{"v":49.209512856,"d":"49.20951"},{"v":-121.710082836,"d":"-121.71008"},"http://www.google.com/maps/place/49.209512856,-121.710082836",50585,"Rural First Nations Primary Reserve",253,113,"No","No","Yes","No ","Popkum*","FALSE","FALSE"]
[null,8882,"Porcher Island","No","North Coast Regional District","North Coast",{"$nulls":7},"",{"$nulls":6},"","",null,"",null,null,"",null,"Porcher Island","N",{"v":54.086718,"d":"54.08672"},{"v":-130.392354,"d":"-130.39235"},"http://www.google.com/maps/place/54.086718,-130.392354",8882,"Rural",10,18,"No","Yes","No","No ","Porcher Island","FALSE","FALSE"]
[null,8737,"Port Alberni","Yes","Regional District of Alberni-Clayoquot","Vancouver Island and Coast",{"$nulls":7},"",{"$nulls":6},"","",null,"",null,null,"",null,"Port Alberni","N",{"v":49.2417,"d":"49.24170"},{"v":-124.800001,"d":"-124.80000"},"http://www.google.com/maps/place/49.2417,-124.800001",8737,"Rural",10966,5274,"Yes","No","Yes","No ","Port Alberni","FALSE","FALSE"]
[null,8561,"Port Alice","No","Regional District of Mount Waddington","Vancouver Island and Coast",{"$nulls":7},"",{"$nulls":6},"","",null,"",null,null,"",null,"Port Alice","N",{"v":50.3833,"d":"50.38330"},{"v":-127.449998,"d":"-127.45000"},"http://www.google.com/maps/place/50.3833,-127.449998",8561,"Rural",1,0,"No","Yes","No","No ","Port Alice","FALSE","FALSE"]
[null,9006,"Port Clements","No","North Coast Regional District","North Coast",{"$nulls":7},"",{"$nulls":6},"","",null,"",null,null,"",null,"Port Clements","N",{"v":53.685201,"d":"53.68520"},{"v":-132.178755,"d":"-132.17876"},"http://www.google.com/maps/place/53.685201,-132.178755",9006,"Rural",120,79,"No","Yes","Yes","No ","Port Clements","FALSE","FALSE"]
[null,8114,"Port Coquitlam","Yes","Metro Vancouver Regional District","Lower Mainland--Southwest",{"$nulls":7},"",{"$nulls":6},"","",null,"",null,null,"",null,"Port Coquitlam","N",49.25668,-122.76166,"http://www.google.com/maps/place/49.25668,-122.76166",8114,"Urban",47641,16928,"Yes","No","No","No ","Port Coquitlam","FALSE","FALSE"]
[null,8870,"Port Edward","Yes","North Coast Regional District","North Coast",{"$nulls":7},"",{"$nulls":6},"","",null,"",null,null,"",null,"Port Edward","N",{"v":54.222428,"d":"54.22243"},{"v":-130.288055,"d":"-130.28806"},"http://www.google.com/maps/place/54.222428,-130.288055",8870,"Rural",463,217,"Yes","No","Yes","No ","Port Edward","FALSE","FALSE"]
[null,8550,"Port Hardy","Yes","Regional District of Mount Waddington","Vancouver Island and Coast",{"$nulls":7},"",{"$nulls":6},"","",null,"",null,null,"",null,"Port Hardy","N",50.71889,{"v":-127.506636,"d":"-127.50664"},"http://www.google.com/maps/place/50.71889,-127.506636",8550,"Rural",3732,1807,"Yes","No","Yes","No ","Port Hardy","FALSE","FALSE"]
[null,8553,"Port McNeill","Yes","Regional District of Mount Waddington","Vancouver Island and Coast",{"$nulls":7},"",{"$nulls":6},"","",null,"",null,null,"",null,"Port McNeill","N",{"v":50.585995,"d":"50.58600"},{"v":-127.079118,"d":"-127.07912"},"http://www.google.com/maps/place/50.585995,-127.079118",8553,"Rural",2328,1105,"Yes","No","Yes","No ","Port McNeill","FALSE","FALSE"]
[null,8107,"Port Moody","Yes","Metro Vancouver Regional District","Lower Mainland--Southwest",{"$nulls":7},"",{"$nulls":6},"","",null,"",null,null,"",null,"Port Moody","N",{"v":49.278646,"d":"49.27865"},{"v":-122.867626,"d":"-122.86763"},"http://www.google.com/maps/place/49.278646,-122.867626",8107,"Urban",43149,17723,"Yes","No","Yes","No ","Port Moody","FALSE","FALSE"]
[null,8768,"Port Neville","No","Strathcona Regional District","Vancouver Island and Coast",{"$nulls":7},"",{"$nulls":6},"","",null,"",null,null,"",null,"Port Neville","N",{"v":50.4929341,"d":"50.49293"},{"v":-126.0858154,"d":"-126.08582"},"http://www.google.com/maps/place/50.4929341,-126.0858154",8768,"Rural",2,4,"No","Yes","Yes","No ","Port Neville","FALSE","FALSE"]
[null,8608,"Port Renfrew","No","Capital Regional District","Vancouver Island and Coast",{"$nulls":7},"",{"$nulls":6},"","",null,"",null,null,"",null,"Port Renfrew","N",{"v":48.557441,"d":"48.55744"},{"v":-124.404856,"d":"-124.40486"},"http://www.google.com/maps/place/48.557441,-124.404856",8608,"Rural",165,109,"No","Yes","Yes","No ","Port Renfrew","FALSE","FALSE"]
[null,8685,"Port Washington","Yes","Capital Regional District","Vancouver Island and Coast",{"$nulls":7},"",{"$nulls":6},"","",null,"",null,null,"",null,"Port Washington","N",{"v":48.816603,"d":"48.81660"},{"v":-123.321192,"d":"-123.32119"},"http://www.google.com/maps/place/48.816603,-123.321192",8685,"Rural",184,176,"Yes","No","Yes","No ","Port Washington","FALSE","FALSE"]
[null,8909,{"$f":"HYPERLINK(AG865,AP865)","v":"Powder King"},"No","Regional District of Fraser-Fort George","Cariboo",{"$nulls":7},{"$f":"IF(COUNT(V865)=0, \"\", IF(V865>=0,\"Sufficient Capacity\", IF(V865<0,\"Not Enough Capacity\")))","v":""},{"$nulls":6},{"$f":"IF(OR(ISBLANK(H865),ISBLANK(I865),ISBLANK(J865)), \"\",(H865*I865/J865))","v":""},{"$f":"IF(AND(COUNT(L865,U865)=2, OR($M$10=\"Last-Mile\", $M$10=\"Transport & Last-Mile\")), L865-U865, \"\")","v":""},null,{"$f":"IF(AD865=\"Y\",COUNT(H865), \"\")","v":""},null,null,{"$f":"IF(AD865=\"Y\",COUNT(P865), \"\")","v":""},null,"Powder King","N",{"v":55.350502,"d":"55.35050"},{"v":-122.614545,"d":"-122.61455"},"http://www.google.com/maps/place/55.350502,-122.614545",8909,"Rural",0,0,"No","Yes","Yes","No ",{"$f":"IF(AD865=\"Y\", CONCATENATE(AC865,\"*\"), AC865)","v":"Powder King"},{"$f":"IF(G865=\"Last-Mile\",\"TRUE\",IF(G865=\"Transport & Last-Mile\",\"TRUE\",\"FALSE\"))","v":"FALSE"},{"$f":"IF(G865=\"Transport\",\"TRUE\",IF(G865=\"Transport & Last-Mile\",\"TRUE\",\"FALSE\"))","v":"FALSE"}]
[null,8208,"Powell River","Yes","qathet Regional District","Vancouver Island and Coast",{"$nulls":7},"",{"$nulls":6},"","",null,"",null,null,"",null,"Powell River","N",{"v":49.871999,"d":"49.87200"},{"v":-124.546497,"d":"-124.54650"},"http://www.google.com/maps/place/49.871999,-124.546497",8208,"Rural",2342,1183,"Yes","No","Yes","No ","Powell River","FALSE","FALSE"]
[null,9046,"Premier Lake","No","Regional District of East Kootenay","Kootenay",{"$nulls":7},"",{"$nulls":6},"","",null,"",null,null,"",null,"Premier Lake","N",{"v":49.951705,"d":"49.95171"},{"v":-115.658678,"d":"-115.65868"},"http://www.google.com/maps/place/49.951705,-115.658678",9046,"Rural",7,4,"No","Yes","Yes","No ","Premier Lake","FALSE","FALSE"]
[null,8953,"Prespatou","No","Peace River Regional District","Northeast",{"$nulls":7},"",{"$nulls":6},"","",null,"",null,null,"",null,"Prespatou","N",{"v":56.922264,"d":"56.92226"},{"v":-121.062581,"d":"-121.06258"},"http://www.google.com/maps/place/56.922264,-121.062581",8953,"Rural",322,84,"No","Yes","Yes","No ","Prespatou","FALSE","FALSE"]
[null,8422,"Prince George","Yes","Regional District of Fraser-Fort George","Cariboo",{"$nulls":7},"",{"$nulls":6},"","",null,"",null,null,"",null,"Prince George","N",{"v":53.911582,"d":"53.91158"},{"v":-122.775661,"d":"-122.77566"},"http://www.google.com/maps/place/53.911582,-122.775661",8422,"Urban",14186,7134,"Yes","No","Yes","No ","Prince George","FALSE","FALSE"]
[null,8868,"Prince Rupert","Yes","North Coast Regional District","North Coast",{"$nulls":7},"",{"$nulls":6},"","",null,"",null,null,"",null,"Prince Rupert","N",{"v":54.315031,"d":"54.31503"},{"v":-130.315415,"d":"-130.31542"},"http://www.google.com/maps/place/54.315031,-130.315415",8868,"Rural",4046,2001,"Yes","No","Yes","No ","Prince Rupert","FALSE","FALSE"]
[null,8039,"Princeton","Yes","Regional District of Okanagan-Similkameen","Thompson--Okanagan",{"$nulls":7},"",{"$nulls":6},"","",null,"",null,null,"",null,"Princeton","N",{"v":49.4524,"d":"49.45240"},-120.51419,"http://www.google.com/maps/place/49.4524,-120.51419",8039,"Rural",2832,1553,"Yes","No","Yes","No ","Princeton","FALSE","FALSE"]
[null,8321,"Pritchard","No","Thompson-Nicola Regional District","Thompson--Okanagan",{"$nulls":7},"",{"$nulls":6},"","",null,"",null,null,"",null,"Pritchard","N",{"v":50.685139,"d":"50.68514"},{"v":-119.812186,"d":"-119.81219"},"http://www.google.com/maps/place/50.685139,-119.812186",8321,"Rural",307,133,"No","Yes","Yes","Yes ","Pritchard","FALSE","FALSE"]
[null,7951,"Procter","Yes","Regional District of Central Kootenay","Kootenay",{"$nulls":7},"",{"$nulls":6},"","",null,"",null,null,"",null,"Procter","N",{"v":49.615578,"d":"49.61558"},-116.95582,"http://www.google.com/maps/place/49.615578,-116.95582",7951,"Rural",892,611,"Yes","No","Yes","No ","Procter","FALSE","FALSE"]
[null,8919,"Progress","No","Peace River Regional District","Northeast",{"$nulls":7},"",{"$nulls":6},"","",null,"",null,null,"",null,"Progress","N",{"v":55.781707,"d":"55.78171"},{"v":-120.716192,"d":"-120.71619"},"http://www.google.com/maps/place/55.781707,-120.716192",8919,"Rural",73,29,"No","No","Yes","No ","Progress","FALSE","FALSE"]
[null,8060,"Promontory","Yes","Fraser Valley Regional District","Lower Mainland--Southwest",{"$nulls":7},"",{"$nulls":6},"","",null,"",null,null,"",null,"Promontory","N",{"v":49.100616,"d":"49.10062"},{"v":-121.937262,"d":"-121.93726"},"http://www.google.com/maps/place/49.100616,-121.937262",8060,"Urban",27513,10888,"Yes","No","Yes","No ","Promontory","FALSE","FALSE"]
[null,50544,"Prophet River First Nation*","No","Northern Rockies Regional Municipality","Northeast",{"$nulls":7},"",{"$nulls":6},"","",null,0,null,null,0,null,"Prophet River First Nation","Y",{"v":58.092540436,"d":"58.09254"},{"v":-122.697530337,"d":"-122.69753"},"http://www.google.com/maps/place/58.092540436,-122.697530337",50544,"Rural First Nations Primary Reserve",106,76,"No","Yes","Yes","No ","Prophet River First Nation*","FALSE","FALSE"]
[null,8530,"Punchaw","No","Regional District of Fraser-Fort George","Cariboo",{"$nulls":7},"",{"$nulls":6},"","",null,"",null,null,"",null,"Punchaw","N",{"v":53.430648,"d":"53.43065"},{"v":-123.182408,"d":"-123.18241"},"http://www.google.com/maps/place/53.430648,-123.182408",8530,"Rural",9,5,"No","Yes","Yes","No ","Punchaw","FALSE","FALSE"]
[null,8721,"Qualicum Bay","Yes","Regional District of Nanaimo","Vancouver Island and Coast",{"$nulls":7},"",{"$nulls":6},"","",null,"",null,null,"",null,"Qualicum Bay","N",{"v":49.404524,"d":"49.40452"},{"v":-124.632782,"d":"-124.63278"},"http://www.google.com/maps/place/49.404524,-124.632782",8721,"Rural",1027,593,"Yes","No","Yes","No ","Qualicum Bay","FALSE","FALSE"]
[null,8711,"Qualicum Beach","Yes","Regional District of Nanaimo","Vancouver Island and Coast",{"$nulls":7},"",{"$nulls":6},"","",null,"",null,null,"",null,"Qualicum Beach","N",{"v":49.347534,"d":"49.34753"},{"v":-124.442359,"d":"-124.44236"},"http://www.google.com/maps/place/49.347534,-124.442359",8711,"Rural",5301,2598,"Yes","No","No","No ","Qualicum Beach","FALSE","FALSE"]
[null,50651,"Qualicum First Nation*","Yes","Regional District of Nanaimo","Vancouver Island and Coast",{"$nulls":7},"",{"$nulls":6},"","",null,0,null,null,0,null,"Qualicum First Nation","Y",{"v":49.394389896,"d":"49.39439"},{"v":-124.61630108,"d":"-124.61630"},"http://www.google.com/maps/place/49.394389896,-124.61630108",50651,"Rural First Nations Primary Reserve",1027,593,"Yes","No","Yes","No ","Qualicum First Nation*","FALSE","FALSE"]
[null,8754,"Quathiaski Cove","Yes","Strathcona Regional District","Vancouver Island and Coast",{"$nulls":7},"",{"$nulls":6},"","",null,"",null,null,"",null,"Quathiaski Cove","N",{"v":50.045421,"d":"50.04542"},{"v":-125.210343,"d":"-125.21034"},"http://www.google.com/maps/place/50.045421,-125.210343",8754,"Rural",6241,3178,"Yes","No","Yes","No ","Quathiaski Cove","FALSE","FALSE"]
[null,8546,"Quatsino","No","Regional District of Mount Waddington","Vancouver Island and Coast",{"$nulls":7},"",{"$nulls":6},"","",null,"",null,null,"",null,"Quatsino","N",{"v":50.535722,"d":"50.53572"},-127.65214,"http://www.google.com/maps/place/50.535722,-127.65214",8546,"Rural",40,40,"No","Yes","Yes","No ","Quatsino","FALSE","FALSE"]
[null,50633,"Quatsino First Nation*","No","Regional District of Mount Waddington","Vancouver Island and Coast",{"$nulls":7},"",{"$nulls":6},"","",null,0,null,null,0,null,"Quatsino First Nation","Y",{"v":50.614095,"d":"50.61410"},-127.57128,"http://www.google.com/maps/place/50.614095,-127.57128",50633,"Rural First Nations Primary Reserve",227,82,"No","Yes","Yes","No ","Quatsino First Nation*","FALSE","FALSE"]
[null,100118,"Queens Bay","No","Regional District of Central Kootenay","Kootenay",{"$nulls":7},"",{"$nulls":6},"","",null,"",null,null,"",null,"Queens Bay","N",{"v":49.65673889,"d":"49.65674"},{"v":-116.932875,"d":"-116.93288"},"http://www.google.com/maps/place/49.65673889,-116.932875",100118,"Rural",142,147,"No","No","No","No ","Queens Bay","FALSE","FALSE"]
[null,8575,"Queens Cove","No","Strathcona Regional District","Vancouver Island and Coast",{"$nulls":7},"",{"$nulls":6},"","",null,"",null,null,"",null,"Queens Cove","N",{"v":49.884993,"d":"49.88499"},{"v":-126.985584,"d":"-126.98558"},"http://www.google.com/maps/place/49.884993,-126.985584",8575,"Rural",4,13,"No","Yes","Yes","No ","Queens Cove","FALSE","FALSE"]
[null,8439,"Quesnel","Yes","Cariboo Regional District","Cariboo",{"$nulls":7},"",{"$nulls":6},"","",null,"",null,null,"",null,"Quesnel","N",{"v":52.980551,"d":"52.98055"},-122.50429,"http://www.google.com/maps/place/52.980551,-122.50429",8439,"Rural",7927,3944,"Yes","No","Yes","No ","Quesnel","FALSE","FALSE"]
[null,8450,"Quesnel Forks","No","Cariboo Regional District","Cariboo",{"$nulls":7},"",{"$nulls":6},"","",null,"",null,null,"",null,"Quesnel Forks","N",{"v":52.656395,"d":"52.65640"},{"v":-121.662565,"d":"-121.66257"},"http://www.google.com/maps/place/52.656395,-121.662565",8450,"Rural",2,4,"No","Yes","Yes","No ","Quesnel Forks","FALSE","FALSE"]
[null,100360,"Quilchena*","No","Thompson-Nicola Regional District","Thompson--Okanagan",{"$nulls":7},"",{"$nulls":6},"","",null,0,null,null,0,null,"Quilchena","Y",{"v":50.16623333,"d":"50.16623"},{"v":-120.49958333,"d":"-120.49958"},"http://www.google.com/maps/place/50.16623333,-120.49958333",100360,"Rural First Nations Secondary Reserve",104,106,"No","No","Yes","No ","Quilchena*","FALSE","FALSE"]
[null,8019,"Radium Hot Springs","Yes","Regional District of East Kootenay","Kootenay",{"$nulls":7},"",{"$nulls":6},"","",null,"",null,null,"",null,"Radium Hot Springs","N",{"v":50.623004,"d":"50.62300"},{"v":-116.080487,"d":"-116.08049"},"http://www.google.com/maps/place/50.623004,-116.080487",8019,"Rural",917,996,"Yes","No","Yes","No ","Radium Hot Springs","FALSE","FALSE"]
[null,8305,"Ranchero","Yes","Columbia-Shuswap Regional District","Thompson--Okanagan",{"$nulls":7},"",{"$nulls":6},"","",null,"",null,null,"",null,"Ranchero","N",{"v":50.657044,"d":"50.65704"},{"v":-119.198328,"d":"-119.19833"},"http://www.google.com/maps/place/50.657044,-119.198328",8305,"Rural",1244,533,"Yes","No","Yes","No ","Ranchero","FALSE","FALSE"]
[null,7973,"Raspberry","Yes","Regional District of Central Kootenay","Kootenay",{"$nulls":7},"",{"$nulls":6},"","",null,"",null,null,"",null,"Raspberry","N",{"v":49.335768,"d":"49.33577"},{"v":-117.657419,"d":"-117.65742"},"http://www.google.com/maps/place/49.335768,-117.657419",7973,"Rural",4290,2036,"Yes","No","Yes","No ","Raspberry","FALSE","FALSE"]
[null,8374,"Rayleigh","Yes","Thompson-Nicola Regional District","Thompson--Okanagan",{"$nulls":7},"",{"$nulls":6},"","",null,"",null,null,"",null,"Rayleigh","N",{"v":50.797384,"d":"50.79738"},{"v":-120.319733,"d":"-120.31973"},"http://www.google.com/maps/place/50.797384,-120.319733",8374,"Urban",5176,1931,"Yes","No","Yes","No ","Rayleigh","FALSE","FALSE"]
[null,8219,"Read Island","No","Strathcona Regional District","Vancouver Island and Coast",{"$nulls":7},"",{"$nulls":6},"","",null,"",null,null,"",null,"Read Island","N",{"v":50.181173,"d":"50.18117"},{"v":-125.085931,"d":"-125.08593"},"http://www.google.com/maps/place/50.181173,-125.085931",8219,"Rural",33,28,"No","Yes","Yes","No ","Read Island","FALSE","FALSE"]
[null,8440,"Red Bluff","Yes","Cariboo Regional District","Cariboo",{"$nulls":7},"",{"$nulls":6},"","",null,"",null,null,"",null,"Red Bluff","N",{"v":52.965374,"d":"52.96537"},{"v":-122.460751,"d":"-122.46075"},"http://www.google.com/maps/place/52.965374,-122.460751",8440,"Rural",3835,1670,"Yes","No","No","No ","Red Bluff","FALSE","FALSE"]
[null,50715,"Red Bluff (Lhtako Dene Nation)*","Yes","Cariboo Regional District","Cariboo",{"$nulls":7},"",{"$nulls":6},"","",null,0,null,null,0,null,"Red Bluff (Lhtako Dene Nation)","Y",{"v":52.954894358,"d":"52.95489"},{"v":-122.451089423,"d":"-122.45109"},"http://www.google.com/maps/place/52.954894358,-122.451089423",50715,"Rural First Nations Primary Reserve",3835,1670,"Yes","No","Yes","No ","Red Bluff (Lhtako Dene Nation)*","FALSE","FALSE"]
[null,100148,"Red Mountain Rd","No","Regional District of Central Kootenay","Kootenay",{"$nulls":7},"",{"$nulls":6},"","",null,"",null,null,"",null,"Red Mountain Rd","N",{"v":49.90469722,"d":"49.90470"},{"v":-117.36173333,"d":"-117.36173"},"http://www.google.com/maps/place/49.90469722,-117.36173333",100148,"Rural",72,41,"No","Yes","Yes","No ","Red Mountain Rd","FALSE","FALSE"]
[null,8432,"Red Rock","No","Regional District of Fraser-Fort George","Cariboo",{"$nulls":7},"",{"$nulls":6},"","",null,"",null,null,"",null,"Red Rock","N",53.68862,{"v":-122.670865,"d":"-122.67087"},"http://www.google.com/maps/place/53.68862,-122.670865",8432,"Rural",154,69,"No","Yes","Yes","No ","Red Rock","FALSE","FALSE"]
[null,9060,"Redstone","No","Cariboo Regional District","Cariboo",{"$nulls":7},"",{"$nulls":6},"","",null,"",null,null,"",null,"Redstone","N",{"v":52.1333,"d":"52.13330"},{"v":-123.699999,"d":"-123.70000"},"http://www.google.com/maps/place/52.1333,-123.699999",9060,"Rural",null,null,"No","No","No","No ","Redstone","FALSE","FALSE"]
[null,8759,"Refuge Cove","No","Strathcona Regional District","Vancouver Island and Coast",{"$nulls":7},"",{"$nulls":6},"","",null,"",null,null,"",null,"Refuge Cove","N",{"v":50.1237487,"d":"50.12375"},{"v":-124.8390156,"d":"-124.83902"},"http://www.google.com/maps/place/50.1237487,-124.8390156",8759,"Rural",6,20,"No","Yes","Yes","No ","Refuge Cove","FALSE","FALSE"]
[null,8836,"Reid Lake","No","Regional District of Fraser-Fort George","Cariboo",{"$nulls":7},"",{"$nulls":6},"","",null,"",null,null,"",null,"Reid Lake","N",{"v":53.9667,"d":"53.96670"},{"v":-123.099998,"d":"-123.10000"},"http://www.google.com/maps/place/53.9667,-123.099998",8836,"Rural",95,39,"No","Yes","No","No ","Reid Lake","FALSE","FALSE"]
[null,8877,"Remo","No","Regional District of Kitimat-Stikine","North Coast",{"$nulls":7},"",{"$nulls":6},"","",null,"",null,null,"",null,"Remo","N",{"v":54.500695,"d":"54.50070"},{"v":-128.718544,"d":"-128.71854"},"http://www.google.com/maps/place/54.500695,-128.718544",8877,"Rural",160,78,"No","No","No","No ","Remo","FALSE","FALSE"]
[null,9020,"Renata","No","Regional District of Central Kootenay","Kootenay",{"$nulls":7},"",{"$nulls":6},"","",null,"",null,null,"",null,"Renata","N",{"v":49.426789,"d":"49.42679"},{"v":-118.106963,"d":"-118.10696"},"http://www.google.com/maps/place/49.426789,-118.106963",9020,"Rural",0,0,"No","Yes","No","No ","Renata","FALSE","FALSE"]
[null,9028,"Retallack","No","Regional District of Central Kootenay","Kootenay",{"$nulls":7},"",{"$nulls":6},"","",null,"",null,null,"",null,"Retallack","N",{"v":50.041437,"d":"50.04144"},{"v":-117.139516,"d":"-117.13952"},"http://www.google.com/maps/place/50.041437,-117.139516",9028,"Rural",2,2,"No","Yes","Yes","No ","Retallack","FALSE","FALSE"]
[null,8328,"Revelstoke","Yes","Columbia-Shuswap Regional District","Thompson--Okanagan",{"$nulls":7},"",{"$nulls":6},"","",null,"",null,null,"",null,"Revelstoke","N",{"v":51.001215,"d":"51.00122"},{"v":-118.196239,"d":"-118.19624"},"http://www.google.com/maps/place/51.001215,-118.196239",8328,"Rural",3377,1602,"Yes","No","Yes","No ","Revelstoke","FALSE","FALSE"]
[null,9023,"Rhone","No","Regional District of Kootenay Boundary","Kootenay",{"$nulls":7},"",{"$nulls":6},"","",null,"",null,null,"",null,"Rhone","N",{"v":49.219018,"d":"49.21902"},{"v":-119.018312,"d":"-119.01831"},"http://www.google.com/maps/place/49.219018,-119.018312",9023,"Rural",38,19,"No","Yes","No","No ","Rhone","FALSE","FALSE"]
[null,8442,"Rich Bar","Yes","Cariboo Regional District","Cariboo",{"$nulls":7},"",{"$nulls":6},"","",null,"",null,null,"",null,"Rich Bar","N",{"v":52.914898,"d":"52.91490"},-122.45647,"http://www.google.com/maps/place/52.914898,-122.45647",8442,"Rural",3835,1670,"Yes","No","No","No ","Rich Bar","FALSE","FALSE"]
[null,8092,"Richmond","Yes","Metro Vancouver Regional District","Lower Mainland--Southwest",{"$nulls":7},"",{"$nulls":6},"","",null,"",null,null,"",null,"Richmond","N",{"v":49.153856,"d":"49.15386"},{"v":-123.158203,"d":"-123.15820"},"http://www.google.com/maps/place/49.153856,-123.158203",8092,"Urban",87485,32467,"Yes","No","No","No ","Richmond","FALSE","FALSE"]
[null,7953,"Riondel","No","Regional District of Central Kootenay","Kootenay",{"$nulls":7},"",{"$nulls":6},"","",null,"",null,null,"",null,"Riondel","N",{"v":49.761771,"d":"49.76177"},{"v":-116.856238,"d":"-116.85624"},"http://www.google.com/maps/place/49.761771,-116.856238",7953,"Rural",271,222,"No","Yes","No","No ","Riondel","FALSE","FALSE"]
[null,8471,"Riske Creek","No","Cariboo Regional District","Cariboo",{"$nulls":7},"",{"$nulls":6},"","",null,"",null,null,"",null,"Riske Creek","N",{"v":51.959617,"d":"51.95962"},{"v":-122.518247,"d":"-122.51825"},"http://www.google.com/maps/place/51.959617,-122.518247",8471,"Rural",23,12,"No","Yes","Yes","No ","Riske Creek","FALSE","FALSE"]
[null,8619,"River Jordan","No","Capital Regional District","Vancouver Island and Coast",{"$nulls":7},"",{"$nulls":6},"","",null,"",null,null,"",null,"River Jordan","N",48.42207,{"v":-124.050469,"d":"-124.05047"},"http://www.google.com/maps/place/48.42207,-124.050469",8619,"Rural",58,37,"No","Yes","Yes","No ","River Jordan","FALSE","FALSE"]
[null,8535,"Rivers Inlet","No","Central Coast Regional District","Vancouver Island and Coast",{"$nulls":7},"",{"$nulls":6},"","",null,"",null,null,"",null,"Rivers Inlet","N",{"v":51.684164,"d":"51.68416"},{"v":-127.259337,"d":"-127.25934"},"http://www.google.com/maps/place/51.684164,-127.259337",8535,"Rural",36,21,"No","Yes","Yes","No ","Rivers Inlet","FALSE","FALSE"]
[null,8180,"Roberts Creek","Yes","Sunshine Coast Regional District","Lower Mainland--Southwest",{"$nulls":7},"",{"$nulls":6},"","",null,"",null,null,"",null,"Roberts Creek","N",{"v":49.426045,"d":"49.42605"},{"v":-123.645618,"d":"-123.64562"},"http://www.google.com/maps/place/49.426045,-123.645618",8180,"Rural",1330,725,"Yes","No","Yes","No ","Roberts Creek","FALSE","FALSE"]
[null,7974,"Robson","Yes","Regional District of Central Kootenay","Kootenay",{"$nulls":7},"",{"$nulls":6},"","",null,"",null,null,"",null,"Robson","N",{"v":49.337472,"d":"49.33747"},{"v":-117.691433,"d":"-117.69143"},"http://www.google.com/maps/place/49.337472,-117.691433",7974,"Rural",4290,2036,"Yes","No","Yes","No ","Robson","FALSE","FALSE"]
[null,8765,"Rock Bay","No","Strathcona Regional District","Vancouver Island and Coast",{"$nulls":7},"",{"$nulls":6},"","",null,"",null,null,"",null,"Rock Bay","N",{"v":50.332308,"d":"50.33231"},{"v":-125.486283,"d":"-125.48628"},"http://www.google.com/maps/place/50.332308,-125.486283",8765,"Rural",1,0,"No","Yes","Yes","No ","Rock Bay","FALSE","FALSE"]
[null,7990,"Rock Creek","No","Regional District of Kootenay Boundary","Kootenay",{"$nulls":7},"",{"$nulls":6},"","",null,"",null,null,"",null,"Rock Creek","N",{"v":49.059618,"d":"49.05962"},{"v":-118.999025,"d":"-118.99903"},"http://www.google.com/maps/place/49.059618,-118.999025",7990,"Rural",193,106,"No","Yes","Yes","No ","Rock Creek","FALSE","FALSE"]
[null,8495,"Roe Lake","No","Cariboo Regional District","Cariboo",{"$nulls":7},"",{"$nulls":6},"","",null,"",null,null,"",null,"Roe Lake","N",{"v":51.520843,"d":"51.52084"},{"v":-120.831329,"d":"-120.83133"},"http://www.google.com/maps/place/51.520843,-120.831329",8495,"Rural",57,52,"No","Yes","Yes","No ","Roe Lake","FALSE","FALSE"]
[null,8332,"Rogers Pass","No","Columbia-Shuswap Regional District","Thompson--Okanagan",{"$nulls":7},"",{"$nulls":6},"","",null,"",null,null,"",null,"Rogers Pass","N",{"v":51.300856,"d":"51.30086"},{"v":-117.521284,"d":"-117.52128"},"http://www.google.com/maps/place/51.300856,-117.521284",8332,"Rural",0,0,"No","Yes","Yes","No ","Rogers Pass","FALSE","FALSE"]
[null,8939,"Rolla","No","Peace River Regional District","Northeast",{"$nulls":7},"",{"$nulls":6},"","",null,"",null,null,"",null,"Rolla","N",55.89861,{"v":-120.142591,"d":"-120.14259"},"http://www.google.com/maps/place/55.89861,-120.142591",8939,"Rural",136,62,"No","Yes","Yes","No ","Rolla","FALSE","FALSE"]
[null,7926,"Roosville","No","Regional District of East Kootenay","Kootenay",{"$nulls":7},"",{"$nulls":6},"","",null,"",null,null,"",null,"Roosville","N",{"v":49.023629,"d":"49.02363"},{"v":-115.046938,"d":"-115.04694"},"http://www.google.com/maps/place/49.023629,-115.046938",7926,"Rural",61,24,"No","Yes","Yes","No ","Roosville","FALSE","FALSE"]
[null,9016,"Rose Harbour","No","North Coast Regional District","North Coast",{"$nulls":7},"",{"$nulls":6},"","",null,"",null,null,"",null,"Rose Harbour","N",52.14638,{"v":-131.0765649,"d":"-131.07656"},"http://www.google.com/maps/place/52.14638,-131.0765649",9016,"Rural",11,6,"No","Yes","Yes","No ","Rose Harbour","FALSE","FALSE"]
[null,8949,"Rose Prairie","No","Peace River Regional District","Northeast",{"$nulls":7},"",{"$nulls":6},"","",null,"",null,null,"",null,"Rose Prairie","N",56.50867,{"v":-120.783026,"d":"-120.78303"},"http://www.google.com/maps/place/56.50867,-120.783026",8949,"Rural",40,16,"No","Yes","Yes","No ","Rose Prairie","FALSE","FALSE"]
[null,8351,"Rosebery","No","Regional District of Central Kootenay","Kootenay",{"$nulls":7},"",{"$nulls":6},"","",null,"",null,null,"",null,"Rosebery","N",{"v":50.0333,"d":"50.03330"},{"v":-117.411099,"d":"-117.41110"},"http://www.google.com/maps/place/50.0333,-117.411099",8351,"Rural",175,129,"No","Yes","Yes","No ","Rosebery","FALSE","FALSE"]
[null,8057,"Rosedale","Yes","Fraser Valley Regional District","Lower Mainland--Southwest",{"$nulls":7},"",{"$nulls":6},"","",null,"",null,null,"",null,"Rosedale","N",{"v":49.182012,"d":"49.18201"},{"v":-121.804383,"d":"-121.80438"},"http://www.google.com/maps/place/49.182012,-121.804383",8057,"Rural",2923,1074,"Yes","No","Yes","No ","Rosedale","FALSE","FALSE"]
[null,100131,"Rosen Lake","No","Regional District of East Kootenay","Kootenay",{"$nulls":7},"",{"$nulls":6},"","",null,"",null,null,"",null,"Rosen Lake","N",{"v":49.394167,"d":"49.39417"},{"v":-115.254167,"d":"-115.25417"},"http://www.google.com/maps/place/49.394167,-115.254167",100131,"Rural",788,550,"No","Yes","No","No ","Rosen Lake","FALSE","FALSE"]
[null,7967,"Rossland","Yes","Regional District of Kootenay Boundary","Kootenay",{"$nulls":7},"",{"$nulls":6},"","",null,"",null,null,"",null,"Rossland","N",49.07746,{"v":-117.800782,"d":"-117.80078"},"http://www.google.com/maps/place/49.07746,-117.800782",7967,"Rural",3657,1752,"Yes","No","Yes","No ","Rossland","FALSE","FALSE"]
[null,8886,"Rosswood","No","Regional District of Kitimat-Stikine","North Coast",{"$nulls":7},"",{"$nulls":6},"","",null,"",null,null,"",null,"Rosswood","N",{"v":54.8,"d":"54.80000"},{"v":-128.7667,"d":"-128.76670"},"http://www.google.com/maps/place/54.8,-128.7667",8886,"Rural",6,3,"No","Yes","Yes","No ","Rosswood","FALSE","FALSE"]
[null,8845,"Round Lake","No","Bulkley Nechako Regional District","Nechako",{"$nulls":7},"",{"$nulls":6},"","",null,"",null,null,"",null,"Round Lake","N",{"v":54.664828,"d":"54.66483"},{"v":-126.922589,"d":"-126.92259"},"http://www.google.com/maps/place/54.664828,-126.922589",8845,"Rural",103,45,"No","Yes","No","No ","Round Lake","FALSE","FALSE"]
[null,8729,"Royston","Yes","Comox Valley Regional District","Vancouver Island and Coast",{"$nulls":7},"",{"$nulls":6},"","",null,"",null,null,"",null,"Royston","N",{"v":49.645411,"d":"49.64541"},{"v":-124.945195,"d":"-124.94520"},"http://www.google.com/maps/place/49.645411,-124.945195",8729,"Rural",1914,868,"Yes","No","Yes","No ","Royston","FALSE","FALSE"]
[null,8046,{"$f":"HYPERLINK(AG929,AP929)","v":"Ruby Creek"},"No","Fraser Valley Regional District","Lower Mainland--Southwest",{"$nulls":7},{"$f":"IF(COUNT(V929)=0, \"\", IF(V929>=0,\"Sufficient Capacity\", IF(V929<0,\"Not Enough Capacity\")))","v":""},{"$nulls":6},{"$f":"IF(OR(ISBLANK(H929),ISBLANK(I929),ISBLANK(J929)), \"\",(H929*I929/J929))","v":""},{"$f":"IF(AND(COUNT(L929,U929)=2, OR($M$10=\"Last-Mile\", $M$10=\"Transport & Last-Mile\")), L929-U929, \"\")","v":""},null,{"$f":"IF(AD929=\"Y\",COUNT(H929), \"\")","v":""},null,null,{"$f":"IF(AD929=\"Y\",COUNT(P929), \"\")","v":""},null,"Ruby Creek","N",49.34684,{"v":-121.596578,"d":"-121.59658"},"http://www.google.com/maps/place/49.34684,-121.596578",8046,"Rural",217,88,"No","No","Yes","No ",{"$f":"IF(AD929=\"Y\", CONCATENATE(AC929,\"*\"), AC929)","v":"Ruby Creek"},{"$f":"IF(G929=\"Last-Mile\",\"TRUE\",IF(G929=\"Transport & Last-Mile\",\"TRUE\",\"FALSE\"))","v":"FALSE"},{"$f":"IF(G929=\"Transport\",\"TRUE\",IF(G929=\"Transport & Last-Mile\",\"TRUE\",\"FALSE\"))","v":"FALSE"}]
[null,8560,"Rumble Beach","No","Regional District of Mount Waddington","Vancouver Island and Coast",{"$nulls":7},"",{"$nulls":6},"","",null,"",null,null,"",null,"Rumble Beach","N",{"v":50.426493,"d":"50.42649"},-127.48156,"http://www.google.com/maps/place/50.426493,-127.48156",8560,"Rural",598,512,"No","Yes","Yes","No ","Rumble Beach","FALSE","FALSE"]
[null,8141,"Rutland","Yes","Regional District of Central Okanagan","Thompson--Okanagan",{"$nulls":7},"",{"$nulls":6},"","",null,"",null,null,"",null,"Rutland","N",{"v":49.888253,"d":"49.88825"},{"v":-119.391029,"d":"-119.39103"},"http://www.google.com/maps/place/49.888253,-119.391029",8141,"Urban",22752,9624,"Yes","No","Yes","No ","Rutland","FALSE","FALSE"]
[null,8646,"Saanich","Yes","Capital Regional District","Vancouver Island and Coast",{"$nulls":7},"",{"$nulls":6},"","",null,"",null,null,"",null,"Saanich","N",{"v":48.487848,"d":"48.48785"},{"v":-123.387968,"d":"-123.38797"},"http://www.google.com/maps/place/48.487848,-123.387968",8646,"Urban",26203,10352,"Yes","No","Yes","No ","Saanich","FALSE","FALSE"]
[null,8657,"Saanichton","Yes","Capital Regional District","Vancouver Island and Coast",{"$nulls":7},"",{"$nulls":6},"","",null,"",null,null,"",null,"Saanichton","N",{"v":48.6,"d":"48.60000"},{"v":-123.416699,"d":"-123.41670"},"http://www.google.com/maps/place/48.6,-123.416699",8657,"Urban",9159,3979,"Yes","No","Yes","No ","Saanichton","FALSE","FALSE"]
[null,50615,"Saik'uz First Nation*","No","Bulkley Nechako Regional District","Nechako",{"$nulls":7},"",{"$nulls":6},"","",null,0,null,null,0,null,"Saik'uz First Nation","Y",{"v":53.943390537,"d":"53.94339"},{"v":-124.114033181,"d":"-124.11403"},"http://www.google.com/maps/place/53.943390537,-124.114033181",50615,"Rural First Nations Primary Reserve",245,96,"No","Yes","Yes","No ","Saik'uz First Nation*","FALSE","FALSE"]
[null,7962,"Salmo","No","Regional District of Central Kootenay","Kootenay",{"$nulls":7},"",{"$nulls":6},"","",null,"",null,null,"",null,"Salmo","N",{"v":49.191615,"d":"49.19162"},{"v":-117.276785,"d":"-117.27679"},"http://www.google.com/maps/place/49.191615,-117.276785",7962,"Rural",1450,721,"No","Yes","Yes","No ","Salmo","FALSE","FALSE"]
[null,8311,"Salmon Arm","Yes","Columbia-Shuswap Regional District","Thompson--Okanagan",{"$nulls":7},"",{"$nulls":6},"","",null,"",null,null,"",null,"Salmon Arm","N",{"v":50.7,"d":"50.70000"},{"v":-119.2667,"d":"-119.26670"},"http://www.google.com/maps/place/50.7,-119.2667",8311,"Rural",11456,5026,"Yes","No","No","No ","Salmon Arm","FALSE","FALSE"]
[null,8435,"Salmon Valley","No","Regional District of Fraser-Fort George","Cariboo",{"$nulls":7},"",{"$nulls":6},"","",null,"",null,null,"",null,"Salmon Valley","N",{"v":54.0833,"d":"54.08330"},{"v":-122.699998,"d":"-122.70000"},"http://www.google.com/maps/place/54.0833,-122.699998",8435,"Rural",59,24,"No","Yes","Yes","No ","Salmon Valley","FALSE","FALSE"]
[null,8692,"Saltair","Yes","Cowichan Valley Regional District","Vancouver Island and Coast",{"$nulls":7},"",{"$nulls":6},"","",null,"",null,null,"",null,"Saltair","N",{"v":48.957099,"d":"48.95710"},{"v":-123.773655,"d":"-123.77366"},"http://www.google.com/maps/place/48.957099,-123.773655",8692,"Rural",2796,1300,"Yes","No","Yes","No ","Saltair","FALSE","FALSE"]
[null,8207,"Saltery Bay","No","qathet Regional District","Vancouver Island and Coast",{"$nulls":7},"",{"$nulls":6},"","",null,"",null,null,"",null,"Saltery Bay","N",{"v":49.7833,"d":"49.78330"},{"v":-124.183299,"d":"-124.18330"},"http://www.google.com/maps/place/49.7833,-124.183299",8207,"Rural",181,90,"No","Yes","Yes","No ","Saltery Bay","FALSE","FALSE"]
[null,8220,"Samahquam*","No","Fraser Valley Regional District","Lower Mainland--Southwest",{"$nulls":7},"",{"$nulls":6},"","",null,0,null,null,0,null,"Samahquam","Y",{"v":50.051308,"d":"50.05131"},{"v":-122.539473,"d":"-122.53947"},"http://www.google.com/maps/place/50.051308,-122.539473",8220,"Rural First Nations Secondary Reserve",80,24,"No","Yes","No","No ","Samahquam*","FALSE","FALSE"]
[null,50567,"Samahquam*","No","Fraser Valley Regional District","Lower Mainland--Southwest",{"$nulls":7},"",{"$nulls":6},"","",null,0,null,null,0,null,"Samahquam","Y",{"v":49.990575735,"d":"49.99058"},{"v":-122.458107698,"d":"-122.45811"},"http://www.google.com/maps/place/49.990575735,-122.458107698",50567,"Rural First Nations Primary Reserve",10,3,"No","Yes","Yes","No ","Samahquam*","FALSE","FALSE"]
[null,8030,"Sanca","No","Regional District of Central Kootenay","Kootenay",{"$nulls":7},"",{"$nulls":6},"","",null,"",null,null,"",null,"Sanca","N",{"v":49.391667,"d":"49.39167"},{"v":-116.735,"d":"-116.73500"},"http://www.google.com/maps/place/49.391667,-116.735",8030,"Rural",22,38,"No","Yes","No","No ","Sanca","FALSE","FALSE"]
[null,9031,"Sandon","No","Regional District of Central Kootenay","Kootenay",{"$nulls":7},"",{"$nulls":6},"","",null,"",null,null,"",null,"Sandon","N",{"v":49.9833,"d":"49.98330"},{"v":-117.233299,"d":"-117.23330"},"http://www.google.com/maps/place/49.9833,-117.233299",9031,"Rural",0,0,"No","Yes","No","No ","Sandon","FALSE","FALSE"]
[null,9011,"Sandspit","No","North Coast Regional District","North Coast",{"$nulls":7},"",{"$nulls":6},"","",null,"",null,null,"",null,"Sandspit","N",{"v":53.247917,"d":"53.24792"},-131.81443,"http://www.google.com/maps/place/53.247917,-131.81443",9011,"Rural",215,140,"No","Yes","No","No ","Sandspit","FALSE","FALSE"]
[null,8747,"Saratoga Beach","Yes","Comox Valley Regional District","Vancouver Island and Coast",{"$nulls":7},"",{"$nulls":6},"","",null,"",null,null,"",null,"Saratoga Beach","N",{"v":49.859496,"d":"49.85950"},-125.11572,"http://www.google.com/maps/place/49.859496,-125.11572",8747,"Rural",1501,701,"Yes","No","Yes","No ","Saratoga Beach","FALSE","FALSE"]
[null,8059,"Sardis","Yes","Fraser Valley Regional District","Lower Mainland--Southwest",{"$nulls":7},"",{"$nulls":6},"","",null,"",null,null,"",null,"Sardis","N",{"v":49.136678,"d":"49.13668"},{"v":-121.959138,"d":"-121.95914"},"http://www.google.com/maps/place/49.136678,-121.959138",8059,"Urban",27163,12788,"Yes","No","Yes","No ","Sardis","FALSE","FALSE"]
[null,8632,"Sarita","No","Regional District of Alberni-Clayoquot","Vancouver Island and Coast",{"$nulls":7},"",{"$nulls":6},"","",null,"",null,null,"",null,"Sarita","N",{"v":48.8833,"d":"48.88330"},{"v":-125.0333,"d":"-125.03330"},"http://www.google.com/maps/place/48.8833,-125.0333",8632,"Rural",4,10,"No","Yes","Yes","No ","Sarita","FALSE","FALSE"]
[null,8671,"Saseenos","Yes","Capital Regional District","Vancouver Island and Coast",{"$nulls":7},"",{"$nulls":6},"","",null,"",null,null,"",null,"Saseenos","N",{"v":48.390762,"d":"48.39076"},{"v":-123.668557,"d":"-123.66856"},"http://www.google.com/maps/place/48.390762,-123.668557",8671,"Rural",2050,1004,"Yes","No","Yes","No ","Saseenos","FALSE","FALSE"]
[null,8686,"Saturna","No","Capital Regional District","Vancouver Island and Coast",{"$nulls":7},"",{"$nulls":6},"","",null,"",null,null,"",null,"Saturna","N",{"v":48.794533,"d":"48.79453"},{"v":-123.194647,"d":"-123.19465"},"http://www.google.com/maps/place/48.794533,-123.194647",8686,"Rural",244,283,"No","Yes","Yes","No ","Saturna","FALSE","FALSE"]
[null,50542,"Saulteau First Nations*","No","Peace River Regional District","Northeast",{"$nulls":7},"",{"$nulls":6},"","",null,0,null,null,0,null,"Saulteau First Nations","Y",{"v":55.852219195,"d":"55.85222"},{"v":-121.653003729,"d":"-121.65300"},"http://www.google.com/maps/place/55.852219195,-121.653003729",50542,"Rural First Nations Primary Reserve",291,101,"No","Yes","Yes","No ","Saulteau First Nations*","FALSE","FALSE"]
[null,8380,"Savona","No","Thompson-Nicola Regional District","Thompson--Okanagan",{"$nulls":7},"",{"$nulls":6},"","",null,"",null,null,"",null,"Savona","N",50.75111,{"v":-120.840527,"d":"-120.84053"},"http://www.google.com/maps/place/50.75111,-120.840527",8380,"Rural",473,257,"No","Yes","Yes","No ","Savona","FALSE","FALSE"]
[null,8757,"Sayward","No","Strathcona Regional District","Vancouver Island and Coast",{"$nulls":7},"",{"$nulls":6},"","",null,"",null,null,"",null,"Sayward","N",{"v":50.377036,"d":"50.37704"},{"v":-125.951954,"d":"-125.95195"},"http://www.google.com/maps/place/50.377036,-125.951954",8757,"Rural",286,164,"No","Yes","Yes","No ","Sayward","FALSE","FALSE"]
[null,8358,"Scotch Creek","Yes","Columbia-Shuswap Regional District","Thompson--Okanagan",{"$nulls":7},"",{"$nulls":6},"","",null,"",null,null,"",null,"Scotch Creek","N",{"v":50.901374,"d":"50.90137"},{"v":-119.450878,"d":"-119.45088"},"http://www.google.com/maps/place/50.901374,-119.450878",8358,"Rural",594,932,"Yes","No","No","No ","Scotch Creek","FALSE","FALSE"]
[null,50568,"Scowlitz (Sq'éwlets)*","Yes","Fraser Valley Regional District","Lower Mainland--Southwest",{"$nulls":7},"",{"$nulls":6},"","",null,0,null,null,0,null,"Scowlitz (Sq'éwlets)","Y",{"v":49.2359419,"d":"49.23594"},{"v":-122.00245605,"d":"-122.00246"},"http://www.google.com/maps/place/49.2359419,-122.00245605",50568,"Rural First Nations Primary Reserve",796,432,"Yes","No","Yes","No ","Scowlitz (Sq'éwlets)*","FALSE","FALSE"]
[null,50581,"Seabird Island*","No","Fraser Valley Regional District","Lower Mainland--Southwest",{"$nulls":7},"",{"$nulls":6},"","",null,0,null,null,0,null,"Seabird Island","Y",{"v":49.255121717,"d":"49.25512"},{"v":-121.730396716,"d":"-121.73040"},"http://www.google.com/maps/place/49.255121717,-121.730396716",50581,"Rural First Nations Primary Reserve",730,245,"No","No","Yes","No ","Seabird Island*","FALSE","FALSE"]
[null,8771,"Seaford","No","Strathcona Regional District","Vancouver Island and Coast",{"$nulls":7},"",{"$nulls":6},"","",null,"",null,null,"",null,"Seaford","N",{"v":50.0833,"d":"50.08330"},{"v":-124.899999,"d":"-124.90000"},"http://www.google.com/maps/place/50.0833,-124.899999",8771,"Rural",177,117,"No","Yes","Yes","No ","Seaford","FALSE","FALSE"]
[null,8182,"Sechelt","Yes","Sunshine Coast Regional District","Lower Mainland--Southwest",{"$nulls":7},"",{"$nulls":6},"","",null,"",null,null,"",null,"Sechelt","N",{"v":49.479394,"d":"49.47939"},{"v":-123.762234,"d":"-123.76223"},"http://www.google.com/maps/place/49.479394,-123.762234",8182,"Rural",5865,2977,"Yes","No","Yes","No ","Sechelt","FALSE","FALSE"]
[null,50551,"Sechelt Indian Government District (Sechelt)*","Yes","Sunshine Coast Regional District","Lower Mainland--Southwest",{"$nulls":7},"",{"$nulls":6},"","",null,0,null,null,0,null,"Sechelt Indian Government District (Sechelt)","Y",{"v":49.473899608,"d":"49.47390"},{"v":-123.749955536,"d":"-123.74996"},"http://www.google.com/maps/place/49.473899608,-123.749955536",50551,"Rural First Nations Primary Reserve",5865,2977,"Yes","No","Yes","No ","Sechelt Indian Government District (Sechelt)*","FALSE","FALSE"]
[null,8188,"Secret Cove","Yes","Sunshine Coast Regional District","Lower Mainland--Southwest",{"$nulls":7},"",{"$nulls":6},"","",null,"",null,null,"",null,"Secret Cove","N",{"v":49.536264,"d":"49.53626"},{"v":-123.951887,"d":"-123.95189"},"http://www.google.com/maps/place/49.536264,-123.951887",8188,"Rural",340,279,"Yes","No","Yes","No ","Secret Cove","FALSE","FALSE"]
[null,8185,"Selma Park","Yes","Sunshine Coast Regional District","Lower Mainland--Southwest",{"$nulls":7},"",{"$nulls":6},"","",null,"",null,null,"",null,"Selma Park","N",{"v":49.458471,"d":"49.45847"},{"v":-123.733333,"d":"-123.73333"},"http://www.google.com/maps/place/49.458471,-123.733333",8185,"Rural",5865,2977,"Yes","No","No","No ","Selma Park","FALSE","FALSE"]
[null,50569,"Semiahmoo*","Yes","Metro Vancouver Regional District","Lower Mainland--Southwest",{"$nulls":7},"",{"$nulls":6},"","",null,0,null,null,0,null,"Semiahmoo","Y",{"v":49.014531999,"d":"49.01453"},{"v":-122.77774078,"d":"-122.77774"},"http://www.google.com/maps/place/49.014531999,-122.77774078",50569,"Rural First Nations Primary Reserve",13775,5676,"Yes","No","Yes","No ","Semiahmoo*","FALSE","FALSE"]
[null,8253,"Seton Lake*","No","Squamish-Lillooet Regional District","Lower Mainland--Southwest",{"$nulls":7},"",{"$nulls":6},"","",null,0,null,null,0,null,"Seton Lake","Y",{"v":50.704731,"d":"50.70473"},{"v":-122.281307,"d":"-122.28131"},"http://www.google.com/maps/place/50.704731,-122.281307",8253,"Rural First Nations Primary Reserve",79,48,"No","Yes","Yes","No ","Seton Lake*","FALSE","FALSE"]
[null,8252,"Seton Portage","No","Squamish-Lillooet Regional District","Lower Mainland--Southwest",{"$nulls":7},"",{"$nulls":6},"","",null,"",null,null,"",null,"Seton Portage","N",{"v":50.706903,"d":"50.70690"},{"v":-122.288958,"d":"-122.28896"},"http://www.google.com/maps/place/50.706903,-122.288958",8252,"Rural",79,48,"No","Yes","No","No ","Seton Portage","FALSE","FALSE"]
[null,8943,"Seven Mile Corner","No","Peace River Regional District","Northeast",{"$nulls":7},"",{"$nulls":6},"","",null,"",null,null,"",null,"Seven Mile Corner","N",{"v":55.897555,"d":"55.89756"},-120.32426,"http://www.google.com/maps/place/55.897555,-120.32426",8943,"Rural",26,12,"No","Yes","No","No ","Seven Mile Corner","FALSE","FALSE"]
[null,9008,"Sewall","No","North Coast Regional District","North Coast",{"$nulls":7},"",{"$nulls":6},"","",null,"",null,null,"",null,"Sewall","N",{"v":53.762475,"d":"53.76248"},{"v":-132.298066,"d":"-132.29807"},"http://www.google.com/maps/place/53.762475,-132.298066",9008,"Rural",10,1,"No","Yes","No","No ","Sewall","FALSE","FALSE"]
[null,9015,"Sewell Inlet","No","North Coast Regional District","North Coast",{"$nulls":7},"",{"$nulls":6},"","",null,"",null,null,"",null,"Sewell Inlet","N",{"v":52.874898,"d":"52.87490"},{"v":-131.987129,"d":"-131.98713"},"http://www.google.com/maps/place/52.874898,-131.987129",9015,"Rural",11,6,"No","Yes","Yes","No ","Sewell Inlet","FALSE","FALSE"]
[null,8330,"Seymour Arm","No","Columbia-Shuswap Regional District","Thompson--Okanagan",{"$nulls":7},"",{"$nulls":6},"","",null,"",null,null,"",null,"Seymour Arm","N",{"v":51.248414,"d":"51.24841"},{"v":-118.939566,"d":"-118.93957"},"http://www.google.com/maps/place/51.248414,-118.939566",8330,"Rural",94,366,"No","Yes","Yes","No ","Seymour Arm","FALSE","FALSE"]
[null,8120,"Seymour Heights","Yes","Metro Vancouver Regional District","Lower Mainland--Southwest",{"$nulls":7},"",{"$nulls":6},"","",null,"",null,null,"",null,"Seymour Heights","N",{"v":49.319242,"d":"49.31924"},{"v":-123.001638,"d":"-123.00164"},"http://www.google.com/maps/place/49.319242,-123.001638",8120,"Urban",18670,6990,"Yes","No","No","No ","Seymour Heights","FALSE","FALSE"]
[null,50698,"Shackan*","No","Thompson-Nicola Regional District","Thompson--Okanagan",{"$nulls":7},"",{"$nulls":6},"","",null,0,null,null,0,null,"Shackan","Y",{"v":50.29338822,"d":"50.29339"},{"v":-121.175373007,"d":"-121.17537"},"http://www.google.com/maps/place/50.29338822,-121.175373007",50698,"Rural First Nations Primary Reserve",39,22,"No","Yes","Yes","No ","Shackan*","FALSE","FALSE"]
[null,8837,"Shady Valley","Yes","Regional District of Fraser-Fort George","Cariboo",{"$nulls":7},"",{"$nulls":6},"","",null,"",null,null,"",null,"Shady Valley","N",{"v":53.979329,"d":"53.97933"},{"v":-122.726887,"d":"-122.72689"},"http://www.google.com/maps/place/53.979329,-122.726887",8837,"Rural",3651,1497,"Yes","No","Yes","No ","Shady Valley","FALSE","FALSE"]
[null,50595,"Shalalth (Tsal'alh)*","No","Squamish-Lillooet Regional District","Lower Mainland--Southwest",{"$nulls":7},"",{"$nulls":6},"","",null,0,null,null,0,null,"Shalalth (Tsal'alh)","Y",{"v":50.72916019,"d":"50.72916"},{"v":-122.214439072,"d":"-122.21444"},"http://www.google.com/maps/place/50.72916019,-122.214439072",50595,"Rural First Nations Secondary Reserve",133,55,"No","Yes","No","No ","Shalalth (Tsal'alh)*","FALSE","FALSE"]
[null,8564,"Shawl Bay","No","Regional District of Mount Waddington","Vancouver Island and Coast",{"$nulls":7},"",{"$nulls":6},"","",null,"",null,null,"",null,"Shawl Bay","N",{"v":50.843285,"d":"50.84329"},{"v":-126.560418,"d":"-126.56042"},"http://www.google.com/maps/place/50.843285,-126.560418",8564,"Rural",5,4,"No","Yes","Yes","No ","Shawl Bay","FALSE","FALSE"]
[null,8667,"Shawnigan Lake","Yes","Cowichan Valley Regional District","Vancouver Island and Coast",{"$nulls":7},"",{"$nulls":6},"","",null,"",null,null,"",null,"Shawnigan Lake","N",{"v":48.653523,"d":"48.65352"},{"v":-123.621993,"d":"-123.62199"},"http://www.google.com/maps/place/48.653523,-123.621993",8667,"Rural",4827,2013,"Yes","No","Yes","No ","Shawnigan Lake","FALSE","FALSE"]
[null,8534,"Shearwater","No","Central Coast Regional District","Vancouver Island and Coast",{"$nulls":7},"",{"$nulls":6},"","",null,"",null,null,"",null,"Shearwater","N",{"v":52.146602,"d":"52.14660"},{"v":-128.091995,"d":"-128.09200"},"http://www.google.com/maps/place/52.146602,-128.091995",8534,"Rural",944,436,"No","Yes","Yes","No ","Shearwater","FALSE","FALSE"]
[null,8423,"Shelley","No","Regional District of Fraser-Fort George","Cariboo",{"$nulls":7},"",{"$nulls":6},"","",null,"",null,null,"",null,"Shelley","N",{"v":54,"d":"54.00000"},{"v":-122.616699,"d":"-122.61670"},"http://www.google.com/maps/place/54,-122.616699",8423,"Rural",305,119,"No","No","Yes","No ","Shelley","FALSE","FALSE"]
[null,8343,"Shelter Bay","No","Columbia-Shuswap Regional District","Thompson--Okanagan",{"$nulls":7},"",{"$nulls":6},"","",null,"",null,null,"",null,"Shelter Bay","N",{"v":50.635234,"d":"50.63523"},{"v":-117.925232,"d":"-117.92523"},"http://www.google.com/maps/place/50.635234,-117.925232",8343,"Rural",0,0,"No","Yes","Yes","No ","Shelter Bay","FALSE","FALSE"]
[null,100108,"Shelter Bay","No","Columbia-Shuswap Regional District","Thompson--Okanagan",{"$nulls":7},"",{"$nulls":6},"","",null,"",null,null,"",null,"Shelter Bay","N",50.65839,-117.94079,"http://www.google.com/maps/place/50.65839,-117.94079",100108,"Rural",0,0,"No","Yes","Yes","No ","Shelter Bay","FALSE","FALSE"]
[null,8750,"Shelter Point","Yes","Strathcona Regional District","Vancouver Island and Coast",{"$nulls":7},"",{"$nulls":6},"","",null,"",null,null,"",null,"Shelter Point","N",{"v":49.940279,"d":"49.94028"},{"v":-125.190691,"d":"-125.19069"},"http://www.google.com/maps/place/49.940279,-125.190691",8750,"Urban",253,126,"Yes","No","Yes","No ","Shelter Point","FALSE","FALSE"]
[null,8635,"Shirley","Yes","Capital Regional District","Vancouver Island and Coast",{"$nulls":7},"",{"$nulls":6},"","",null,"",null,null,"",null,"Shirley","N",{"v":48.389793,"d":"48.38979"},{"v":-123.904422,"d":"-123.90442"},"http://www.google.com/maps/place/48.389793,-123.904422",8635,"Rural",153,87,"Yes","No","Yes","No ","Shirley","FALSE","FALSE"]
[null,7976,"Shoreacres","Yes","Regional District of Central Kootenay","Kootenay",{"$nulls":7},"",{"$nulls":6},"","",null,"",null,null,"",null,"Shoreacres","N",{"v":49.430727,"d":"49.43073"},-117.52685,"http://www.google.com/maps/place/49.430727,-117.52685",7976,"Rural",1520,723,"Yes","No","Yes","No ","Shoreacres","FALSE","FALSE"]
[null,8405,"Shoreholme","No","Regional District of Central Kootenay","Kootenay",{"$nulls":7},"",{"$nulls":6},"","",null,"",null,null,"",null,"Shoreholme","N",{"v":50.299999,"d":"50.30000"},{"v":-117.850001,"d":"-117.85000"},"http://www.google.com/maps/place/50.299999,-117.850001",8405,"Rural",1,1,"No","Yes","Yes","No ","Shoreholme","FALSE","FALSE"]
[null,50695,"Shulus (Lower Nicola)*","No","Thompson-Nicola Regional District","Thompson--Okanagan",{"$nulls":7},"",{"$nulls":6},"","",null,0,null,null,0,null,"Shulus (Lower Nicola)","Y",{"v":50.138327736,"d":"50.13833"},{"v":-120.857681537,"d":"-120.85768"},"http://www.google.com/maps/place/50.138327736,-120.857681537",50695,"Rural First Nations Primary Reserve",1090,539,"No","Yes","Yes","No ","Shulus (Lower Nicola)*","FALSE","FALSE"]
[null,8322,"Shuswap","No","Thompson-Nicola Regional District","Thompson--Okanagan",{"$nulls":7},"",{"$nulls":6},"","",null,"",null,null,"",null,"Shuswap","N",{"v":50.789607,"d":"50.78961"},{"v":-119.708753,"d":"-119.70875"},"http://www.google.com/maps/place/50.789607,-119.708753",8322,"Rural",287,118,"No","No","Yes","No ","Shuswap","FALSE","FALSE"]
[null,8152,"Shuswap Falls","No","Regional District of North Okanagan","Thompson--Okanagan",{"$nulls":7},"",{"$nulls":6},"","",null,"",null,null,"",null,"Shuswap Falls","N",{"v":50.294024,"d":"50.29402"},{"v":-118.805096,"d":"-118.80510"},"http://www.google.com/maps/place/50.294024,-118.805096",8152,"Rural",119,56,"No","Yes","Yes","No ","Shuswap Falls","FALSE","FALSE"]
[null,50605,"Shuswap*","Yes","Regional District of East Kootenay","Kootenay",{"$nulls":7},"",{"$nulls":6},"","",null,0,null,null,0,null,"Shuswap","Y",{"v":50.51585948,"d":"50.51586"},{"v":-116.007264788,"d":"-116.00726"},"http://www.google.com/maps/place/50.51585948,-116.007264788",50605,"Rural First Nations Primary Reserve",633,571,"Yes","No","Yes","No ","Shuswap*","FALSE","FALSE"]
[null,9030,"Shutty Bench","No","Regional District of Central Kootenay","Kootenay",{"$nulls":7},"",{"$nulls":6},"","",null,"",null,null,"",null,"Shutty Bench","N",{"v":49.962867,"d":"49.96287"},{"v":-116.907333,"d":"-116.90733"},"http://www.google.com/maps/place/49.962867,-116.907333",9030,"Rural",52,43,"No","Yes","Yes","No ","Shutty Bench","FALSE","FALSE"]
[null,50570,"Shxwhá:y Village*","Yes","Fraser Valley Regional District","Lower Mainland--Southwest",{"$nulls":7},"",{"$nulls":6},"","",null,0,null,null,0,null,"Shxwhá:y Village","Y",{"v":49.168969803,"d":"49.16897"},{"v":-121.988923606,"d":"-121.98892"},"http://www.google.com/maps/place/49.168969803,-121.988923606",50570,"Rural First Nations Primary Reserve",27163,12788,"Yes","No","Yes","No ","Shxwhá:y Village*","FALSE","FALSE"]
[null,50587,"Shxw'ow'hamel First Nation*","No","Fraser Valley Regional District","Lower Mainland--Southwest",{"$nulls":7},"",{"$nulls":6},"","",null,0,null,null,0,null,"Shxw'ow'hamel First Nation","Y",{"v":49.343025919,"d":"49.34303"},{"v":-121.606664649,"d":"-121.60666"},"http://www.google.com/maps/place/49.343025919,-121.606664649",50587,"Rural First Nations Primary Reserve",217,88,"No","No","Yes","No ","Shxw'ow'hamel First Nation*","FALSE","FALSE"]
[null,8310,"Sicamous","No","Columbia-Shuswap Regional District","Thompson--Okanagan",{"$nulls":7},"",{"$nulls":6},"","",null,"",null,null,"",null,"Sicamous","N",{"v":50.835017,"d":"50.83502"},{"v":-118.980232,"d":"-118.98023"},"http://www.google.com/maps/place/50.835017,-118.980232",8310,"Rural",1779,1297,"No","No","Yes","No ","Sicamous","FALSE","FALSE"]
[null,8656,"Sidney","Yes","Capital Regional District","Vancouver Island and Coast",{"$nulls":7},"",{"$nulls":6},"","",null,"",null,null,"",null,"Sidney","N",{"v":48.65,"d":"48.65000"},{"v":-123.399999,"d":"-123.40000"},"http://www.google.com/maps/place/48.65,-123.399999",8656,"Urban",14313,6822,"Yes","No","Yes","No ","Sidney","FALSE","FALSE"]
[null,8967,"Sikanni Chief","No","Peace River Regional District","Northeast",{"$nulls":7},"",{"$nulls":6},"","",null,"",null,null,"",null,"Sikanni Chief","N",{"v":57.234626,"d":"57.23463"},{"v":-122.694743,"d":"-122.69474"},"http://www.google.com/maps/place/57.234626,-122.694743",8967,"Rural",null,null,"No","No","No","No ","Sikanni Chief","FALSE","FALSE"]
[null,8302,"Silver Creek","No","Columbia-Shuswap Regional District","Thompson--Okanagan",{"$nulls":7},"",{"$nulls":6},"","",null,"",null,null,"",null,"Silver Creek","N",{"v":50.596111,"d":"50.59611"},{"v":-119.365439,"d":"-119.36544"},"http://www.google.com/maps/place/50.596111,-119.365439",8302,"Rural",636,294,"No","No","No","No ","Silver Creek","FALSE","FALSE"]
[null,8048,{"$f":"HYPERLINK(AG993,AP993)","v":"Silver Creek"},"Yes","Fraser Valley Regional District","Lower Mainland--Southwest",{"$nulls":7},{"$f":"IF(COUNT(V993)=0, \"\", IF(V993>=0,\"Sufficient Capacity\", IF(V993<0,\"Not Enough Capacity\")))","v":""},{"$nulls":6},{"$f":"IF(OR(ISBLANK(H993),ISBLANK(I993),ISBLANK(J993)), \"\",(H993*I993/J993))","v":""},{"$f":"IF(AND(COUNT(L993,U993)=2, OR($M$10=\"Last-Mile\", $M$10=\"Transport & Last-Mile\")), L993-U993, \"\")","v":""},null,{"$f":"IF(AD993=\"Y\",COUNT(H993), \"\")","v":""},null,null,{"$f":"IF(AD993=\"Y\",COUNT(P993), \"\")","v":""},null,"Silver Creek","N",{"v":49.363362,"d":"49.36336"},{"v":-121.455623,"d":"-121.45562"},"http://www.google.com/maps/place/49.363362,-121.455623",8048,"Rural",1206,612,"Yes","No","No","No ",{"$f":"IF(AD993=\"Y\", CONCATENATE(AC993,\"*\"), AC993)","v":"Silver Creek"},{"$f":"IF(G993=\"Last-Mile\",\"TRUE\",IF(G993=\"Transport & Last-Mile\",\"TRUE\",\"FALSE\"))","v":"FALSE"},{"$f":"IF(G993=\"Transport\",\"TRUE\",IF(G993=\"Transport & Last-Mile\",\"TRUE\",\"FALSE\"))","v":"FALSE"}]
[null,8224,"Silver River","No","Fraser Valley Regional District","Lower Mainland--Southwest",{"$nulls":7},"",{"$nulls":6},"","",null,"",null,null,"",null,"Silver River","N",49.57559,{"v":-121.818071,"d":"-121.81807"},"http://www.google.com/maps/place/49.57559,-121.818071",8224,"Rural",1,5,"No","Yes","Yes","No ","Silver River","FALSE","FALSE"]
[null,8153,"Silver Star","Yes","Regional District of North Okanagan","Thompson--Okanagan",{"$nulls":7},"",{"$nulls":6},"","",null,"",null,null,"",null,"Silver Star","N",{"v":50.357223,"d":"50.35722"},{"v":-119.059444,"d":"-119.05944"},"http://www.google.com/maps/place/50.357223,-119.059444",8153,"Rural",134,755,"Yes","No","Yes","No ","Silver Star","FALSE","FALSE"]
[null,7960,"Silverton","No","Regional District of Central Kootenay","Kootenay",{"$nulls":7},"",{"$nulls":6},"","",null,"",null,null,"",null,"Silverton","N",{"v":49.952799,"d":"49.95280"},{"v":-117.3583,"d":"-117.35830"},"http://www.google.com/maps/place/49.952799,-117.3583",7960,"Rural",259,184,"No","Yes","Yes","No ","Silverton","FALSE","FALSE"]
[null,50691,"Simpcw First Nation*","No","Thompson-Nicola Regional District","Thompson--Okanagan",{"$nulls":7},"",{"$nulls":6},"","",null,0,null,null,0,null,"Simpcw First Nation","Y",{"v":51.31689545,"d":"51.31690"},{"v":-120.149026395,"d":"-120.14903"},"http://www.google.com/maps/place/51.31689545,-120.149026395",50691,"Rural First Nations Secondary Reserve",157,77,"No","Yes","No","No ","Simpcw First Nation*","FALSE","FALSE"]
[null,8394,"Simpcw*","No","Thompson-Nicola Regional District","Thompson--Okanagan",{"$nulls":7},"",{"$nulls":6},"","",null,0,null,null,0,null,"Simpcw","Y",{"v":51.265369,"d":"51.26537"},{"v":-120.151162,"d":"-120.15116"},"http://www.google.com/maps/place/51.265369,-120.151162",8394,"Rural First Nations Primary Reserve",148,72,"No","Yes","Yes","No ","Simpcw*","FALSE","FALSE"]
[null,8965,"Simpson Ranch","No","Peace River Regional District","Northeast",{"$nulls":7},"",{"$nulls":6},"","",null,"",null,null,"",null,"Simpson Ranch","N",{"v":56.6,"d":"56.60000"},{"v":-122.433301,"d":"-122.43330"},"http://www.google.com/maps/place/56.6,-122.433301",8965,"Rural",26,6,"No","Yes","No","No ","Simpson Ranch","FALSE","FALSE"]
[null,8417,"Sinclair Mills","No","Regional District of Fraser-Fort George","Cariboo",{"$nulls":7},"",{"$nulls":6},"","",null,"",null,null,"",null,"Sinclair Mills","N",{"v":54.016699,"d":"54.01670"},{"v":-121.683301,"d":"-121.68330"},"http://www.google.com/maps/place/54.016699,-121.683301",8417,"Rural",10,7,"No","Yes","Yes","No ","Sinclair Mills","FALSE","FALSE"]
[null,8831,"Sinkut River","No","Bulkley Nechako Regional District","Nechako",{"$nulls":7},"",{"$nulls":6},"","",null,"",null,null,"",null,"Sinkut River","N",{"v":53.953797,"d":"53.95380"},{"v":-123.857299,"d":"-123.85730"},"http://www.google.com/maps/place/53.953797,-123.857299",8831,"Rural",168,61,"No","Yes","Yes","No ","Sinkut River","FALSE","FALSE"]
[null,7986,"Sion","Yes","Regional District of Kootenay Boundary","Kootenay",{"$nulls":7},"",{"$nulls":6},"","",null,"",null,null,"",null,"Sion","N",{"v":49.020682,"d":"49.02068"},{"v":-118.483838,"d":"-118.48384"},"http://www.google.com/maps/place/49.020682,-118.483838",7986,"Rural",804,379,"Yes","No","Yes","No ","Sion","FALSE","FALSE"]
[null,50706,"Siska*","No","Thompson-Nicola Regional District","Thompson--Okanagan",{"$nulls":7},"",{"$nulls":6},"","",null,0,null,null,0,null,"Siska","Y",{"v":50.136346185,"d":"50.13635"},{"v":-121.571554917,"d":"-121.57155"},"http://www.google.com/maps/place/50.136346185,-121.571554917",50706,"Rural First Nations Primary Reserve",101,39,"No","Yes","Yes","No ","Siska*","FALSE","FALSE"]
[null,7955,"Six Mile","Yes","Regional District of Central Kootenay","Kootenay",{"$nulls":7},"",{"$nulls":6},"","",null,"",null,null,"",null,"Six Mile","N",49.57855,{"v":-117.225128,"d":"-117.22513"},"http://www.google.com/maps/place/49.57855,-117.225128",7955,"Rural",1083,530,"Yes","No","Yes","No ","Six Mile","FALSE","FALSE"]
[null,8307,"Six Mile Point","Yes","Columbia-Shuswap Regional District","Thompson--Okanagan",{"$nulls":7},"",{"$nulls":6},"","",null,"",null,null,"",null,"Six Mile Point","N",{"v":50.769637,"d":"50.76964"},{"v":-119.011192,"d":"-119.01119"},"http://www.google.com/maps/place/50.769637,-119.011192",8307,"Rural",122,214,"Yes","No","Yes","No ","Six Mile Point","FALSE","FALSE"]
[null,50582,"Skawahlook First Nation*","No","Fraser Valley Regional District","Lower Mainland--Southwest",{"$nulls":7},"",{"$nulls":6},"","",null,0,null,null,0,null,"Skawahlook First Nation","Y",{"v":49.356845609,"d":"49.35685"},{"v":-121.606183637,"d":"-121.60618"},"http://www.google.com/maps/place/49.356845609,-121.606183637",50582,"Rural First Nations Primary Reserve",217,88,"No","No","Yes","No ","Skawahlook First Nation*","FALSE","FALSE"]
[null,50687,"Skeetchestn*","No","Thompson-Nicola Regional District","Thompson--Okanagan",{"$nulls":7},"",{"$nulls":6},"","",null,0,null,null,0,null,"Skeetchestn","Y",{"v":50.840870956,"d":"50.84087"},{"v":-120.945864717,"d":"-120.94586"},"http://www.google.com/maps/place/50.840870956,-120.945864717",50687,"Rural First Nations Primary Reserve",181,82,"No","Yes","Yes","No ","Skeetchestn*","FALSE","FALSE"]
[null,9014,"Skidegate Landing","No","North Coast Regional District","North Coast",{"$nulls":7},"",{"$nulls":6},"","",null,"",null,null,"",null,"Skidegate Landing","N",{"v":53.247201,"d":"53.24720"},{"v":-132.0083,"d":"-132.00830"},"http://www.google.com/maps/place/53.247201,-132.0083",9014,"Rural",169,102,"No","Yes","Yes","No ","Skidegate Landing","FALSE","FALSE"]
[null,50670,"Skidegate*","No","North Coast Regional District","North Coast",{"$nulls":7},"",{"$nulls":6},"","",null,0,null,null,0,null,"Skidegate","Y",{"v":53.266887,"d":"53.26689"},{"v":-131.989501,"d":"-131.98950"},"http://www.google.com/maps/place/53.266887,-131.989501",50670,"Rural First Nations Primary Reserve",836,382,"No","Yes","Yes","No ","Skidegate*","FALSE","FALSE"]
[null,8817,"Skin Tyee*","No","Bulkley Nechako Regional District","Nechako",{"$nulls":7},"",{"$nulls":6},"","",null,0,null,null,0,null,"Skin Tyee","Y",{"v":53.948561,"d":"53.94856"},{"v":-125.651762,"d":"-125.65176"},"http://www.google.com/maps/place/53.948561,-125.651762",8817,"Rural First Nations Secondary Reserve",47,27,"No","Yes","Yes","No ","Skin Tyee*","FALSE","FALSE"]
[null,8828,"Skin Tyee*","No","Bulkley Nechako Regional District","Nechako",{"$nulls":7},"",{"$nulls":6},"","",null,0,null,null,0,null,"Skin Tyee","Y",{"v":53.987501,"d":"53.98750"},{"v":-126.4875,"d":"-126.48750"},"http://www.google.com/maps/place/53.987501,-126.4875",8828,"Rural First Nations Secondary Reserve",10,6,"No","Yes","Yes","No ","Skin Tyee*","FALSE","FALSE"]
[null,50729,"Skin Tyee*","No","Bulkley Nechako Regional District","Nechako",{"$nulls":7},"",{"$nulls":6},"","",null,0,null,null,0,null,"Skin Tyee","Y",{"v":53.995206307,"d":"53.99521"},{"v":-125.882243431,"d":"-125.88224"},"http://www.google.com/maps/place/53.995206307,-125.882243431",50729,"Rural First Nations Primary Reserve",99,48,"No","Yes","Yes","No ","Skin Tyee*","FALSE","FALSE"]
[null,8354,"Skookumchuck","No","Regional District of East Kootenay","Kootenay",{"$nulls":7},"",{"$nulls":6},"","",null,"",null,null,"",null,"Skookumchuck","N",{"v":49.916701,"d":"49.91670"},{"v":-115.7333,"d":"-115.73330"},"http://www.google.com/maps/place/49.916701,-115.7333",8354,"Rural",37,22,"No","Yes","Yes","No ","Skookumchuck","FALSE","FALSE"]
[null,50562,"Skookumchuck (Skatin Nations)*","No","Fraser Valley Regional District","Lower Mainland--Southwest",{"$nulls":7},"",{"$nulls":6},"","",null,0,null,null,0,null,"Skookumchuck (Skatin Nations)","Y",{"v":49.938295825,"d":"49.93830"},{"v":-122.410397335,"d":"-122.41040"},"http://www.google.com/maps/place/49.938295825,-122.410397335",50562,"Rural First Nations Primary Reserve",85,28,"No","Yes","Yes","No ","Skookumchuck (Skatin Nations)*","FALSE","FALSE"]
[null,50571,"Skowkale*","Yes","Fraser Valley Regional District","Lower Mainland--Southwest",{"$nulls":7},"",{"$nulls":6},"","",null,0,null,null,0,null,"Skowkale","Y",{"v":49.141712689,"d":"49.14171"},{"v":-121.940579261,"d":"-121.94058"},"http://www.google.com/maps/place/49.141712689,-121.940579261",50571,"Rural First Nations Primary Reserve",27163,12788,"Yes","No","Yes","No ","Skowkale*","FALSE","FALSE"]
[null,50707,"Skuppah*","No","Thompson-Nicola Regional District","Thompson--Okanagan",{"$nulls":7},"",{"$nulls":6},"","",null,0,null,null,0,null,"Skuppah","Y",{"v":50.187592161,"d":"50.18759"},{"v":-121.573860869,"d":"-121.57386"},"http://www.google.com/maps/place/50.187592161,-121.573860869",50707,"Rural First Nations Primary Reserve",72,32,"No","Yes","Yes","No ","Skuppah*","FALSE","FALSE"]
[null,50573,"Skwah*","Yes","Fraser Valley Regional District","Lower Mainland--Southwest",{"$nulls":7},"",{"$nulls":6},"","",null,0,null,null,0,null,"Skwah","Y",{"v":49.177749134,"d":"49.17775"},{"v":-121.971968117,"d":"-121.97197"},"http://www.google.com/maps/place/49.177749134,-121.971968117",50573,"Urban First Nations Primary Reserve",7464,2914,"Yes","No","Yes","No ","Skwah*","FALSE","FALSE"]
[null,8065,"Slesse Park","No","Fraser Valley Regional District","Lower Mainland--Southwest",{"$nulls":7},"",{"$nulls":6},"","",null,"",null,null,"",null,"Slesse Park","N",{"v":49.080512,"d":"49.08051"},{"v":-121.820607,"d":"-121.82061"},"http://www.google.com/maps/place/49.080512,-121.820607",8065,"Rural",1137,565,"No","No","Yes","No ","Slesse Park","FALSE","FALSE"]
[null,50554,"Sliammon (Tla'amin Nation)*","Yes",null,"Vancouver Island and Coast",{"$nulls":7},"",{"$nulls":6},"","",null,0,null,null,0,null,"Sliammon (Tla'amin Nation)","Y",49.90059,{"v":-124.617391,"d":"-124.61739"},"http://www.google.com/maps/place/49.90059,-124.617391",50554,"Rural First Nations Primary Reserve",481,225,"Yes","No","No","No ","Sliammon (Tla'amin Nation)*","FALSE","FALSE"]
[null,7959,"Slocan","No","Regional District of Central Kootenay","Kootenay",{"$nulls":7},"",{"$nulls":6},"","",null,"",null,null,"",null,"Slocan","N",{"v":49.7667,"d":"49.76670"},{"v":-117.466699,"d":"-117.46670"},"http://www.google.com/maps/place/49.7667,-117.466699",7959,"Rural",153,103,"No","Yes","No","No ","Slocan","FALSE","FALSE"]
[null,100123,"Slocan Park","No","Regional District of Central Kootenay","Kootenay",{"$nulls":7},"",{"$nulls":6},"","",null,"",null,null,"",null,"Slocan Park","N",{"v":49.516667,"d":"49.51667"},-117.61667,"http://www.google.com/maps/place/49.516667,-117.61667",100123,"Rural",372,171,"No","Yes","No","No ","Slocan Park","FALSE","FALSE"]
[null,8846,"Smithers","Yes","Bulkley Nechako Regional District","Nechako",{"$nulls":7},"",{"$nulls":6},"","",null,"",null,null,"",null,"Smithers","N",{"v":54.782456,"d":"54.78246"},-127.16616,"http://www.google.com/maps/place/54.782456,-127.16616",8846,"Rural",4162,1892,"Yes","No","No","No ","Smithers","FALSE","FALSE"]
[null,8797,"Smithers Landing","Yes","Bulkley Nechako Regional District","Nechako",{"$nulls":7},"",{"$nulls":6},"","",null,"",null,null,"",null,"Smithers Landing","N",55.05402,{"v":-126.526014,"d":"-126.52601"},"http://www.google.com/maps/place/55.05402,-126.526014",8797,"Rural",24,20,"Yes","No","No","No ","Smithers Landing","FALSE","FALSE"]
[null,8972,"Snake River","No","Northern Rockies Regional Municipality","Northeast",{"$nulls":7},"",{"$nulls":6},"","",null,"",null,null,"",null,"Snake River","N",{"v":59.036397,"d":"59.03640"},{"v":-122.439215,"d":"-122.43922"},"http://www.google.com/maps/place/59.036397,-122.439215",8972,"Rural",1,0,"No","Yes","Yes","No ","Snake River","FALSE","FALSE"]
[null,8174,"Snug Cove","No","Metro Vancouver Regional District","Lower Mainland--Southwest",{"$nulls":7},"",{"$nulls":6},"","",null,"",null,null,"",null,"Snug Cove","N",{"v":49.382937,"d":"49.38294"},{"v":-123.335712,"d":"-123.33571"},"http://www.google.com/maps/place/49.382937,-123.335712",8174,"Rural",1918,944,"No","Yes","Yes","No ","Snug Cove","FALSE","FALSE"]
[null,50648,"Snuneymuxw First Nation*","Yes","Regional District of Nanaimo","Vancouver Island and Coast",{"$nulls":7},"",{"$nulls":6},"","",null,0,null,null,0,null,"Snuneymuxw First Nation","Y",{"v":49.15166709,"d":"49.15167"},{"v":-123.930277307,"d":"-123.93028"},"http://www.google.com/maps/place/49.15166709,-123.930277307",50648,"Rural First Nations Primary Reserve",1551,760,"Yes","No","Yes","No ","Snuneymuxw First Nation*","FALSE","FALSE"]
[null,8698,"Snuneymuxw*","Yes","Regional District of Nanaimo","Vancouver Island and Coast",{"$nulls":7},"",{"$nulls":6},"","",null,0,null,null,0,null,"Snuneymuxw","Y",{"v":49.122957,"d":"49.12296"},{"v":-123.869598,"d":"-123.86960"},"http://www.google.com/maps/place/49.122957,-123.869598",8698,"Rural First Nations Secondary Reserve",2870,1213,"Yes","No","Yes","No ","Snuneymuxw*","FALSE","FALSE"]
[null,8455,"Soda Creek","No","Cariboo Regional District","Cariboo",{"$nulls":7},"",{"$nulls":6},"","",null,"",null,null,"",null,"Soda Creek","N",{"v":52.346582,"d":"52.34658"},{"v":-122.292173,"d":"-122.29217"},"http://www.google.com/maps/place/52.346582,-122.292173",8455,"Rural",128,71,"No","Yes","Yes","No ","Soda Creek","FALSE","FALSE"]
[null,8454,"Soda Creek*","No","Cariboo Regional District","Cariboo",{"$nulls":7},"",{"$nulls":6},"","",null,0,null,null,0,null,"Soda Creek","Y",{"v":52.327502,"d":"52.32750"},{"v":-122.274759,"d":"-122.27476"},"http://www.google.com/maps/place/52.327502,-122.274759",8454,"Rural First Nations Secondary Reserve",80,25,"No","Yes","Yes","No ","Soda Creek*","FALSE","FALSE"]
[null,50716,"Soda Creek*","No","Cariboo Regional District","Cariboo",{"$nulls":7},"",{"$nulls":6},"","",null,0,null,null,0,null,"Soda Creek","Y",{"v":52.280448919,"d":"52.28045"},{"v":-122.144782114,"d":"-122.14478"},"http://www.google.com/maps/place/52.280448919,-122.144782114",50716,"Rural First Nations Primary Reserve",54,22,"No","No","Yes","No ","Soda Creek*","FALSE","FALSE"]
[null,8554,"Sointula","No","Regional District of Mount Waddington","Vancouver Island and Coast",{"$nulls":7},"",{"$nulls":6},"","",null,"",null,null,"",null,"Sointula","N",{"v":50.633299,"d":"50.63330"},{"v":-127.0167,"d":"-127.01670"},"http://www.google.com/maps/place/50.633299,-127.0167",8554,"Rural",478,292,"No","No","Yes","No ","Sointula","FALSE","FALSE"]
[null,8326,"Solsqua","No","Columbia-Shuswap Regional District","Thompson--Okanagan",{"$nulls":7},"",{"$nulls":6},"","",null,"",null,null,"",null,"Solsqua","N",{"v":50.870685,"d":"50.87069"},{"v":-118.939534,"d":"-118.93953"},"http://www.google.com/maps/place/50.870685,-118.939534",8326,"Rural",262,160,"No","No","Yes","No ","Solsqua","FALSE","FALSE"]
[null,50656,"Songhees Nation (Songhees First Nation)*","Yes","Capital Regional District","Vancouver Island and Coast",{"$nulls":7},"",{"$nulls":6},"","",null,0,null,null,0,null,"Songhees Nation (Songhees First Nation)","Y",48.44143,{"v":-123.428152,"d":"-123.42815"},"http://www.google.com/maps/place/48.44143,-123.428152",50656,"Rural First Nations Primary Reserve",42282,21677,"Yes","No","Yes","No ","Songhees Nation (Songhees First Nation)*","FALSE","FALSE"]
[null,8636,"Sooke","Yes","Capital Regional District","Vancouver Island and Coast",{"$nulls":7},"",{"$nulls":6},"","",null,"",null,null,"",null,"Sooke","N",{"v":48.382279,"d":"48.38228"},{"v":-123.727914,"d":"-123.72791"},"http://www.google.com/maps/place/48.382279,-123.727914",8636,"Rural",6136,2793,"Yes","No","Yes","No ","Sooke","FALSE","FALSE"]
[null,50572,"Soowahlie*","Yes","Fraser Valley Regional District","Lower Mainland--Southwest",{"$nulls":7},"",{"$nulls":6},"","",null,0,null,null,0,null,"Soowahlie","Y",{"v":49.081020085,"d":"49.08102"},{"v":-121.968958886,"d":"-121.96896"},"http://www.google.com/maps/place/49.081020085,-121.968958886",50572,"Rural First Nations Primary Reserve",27513,10888,"Yes","No","Yes","No ","Soowahlie*","FALSE","FALSE"]
[null,8357,"Sorrento","Yes","Columbia-Shuswap Regional District","Thompson--Okanagan",{"$nulls":7},"",{"$nulls":6},"","",null,"",null,null,"",null,"Sorrento","N",{"v":50.878242,"d":"50.87824"},{"v":-119.467115,"d":"-119.46712"},"http://www.google.com/maps/place/50.878242,-119.467115",8357,"Rural",1069,651,"Yes","No","Yes","No ","Sorrento","FALSE","FALSE"]
[null,8625,"South Bentinck","No","Central Coast Regional District","Vancouver Island and Coast",{"$nulls":7},"",{"$nulls":6},"","",null,"",null,null,"",null,"South Bentinck","N",{"v":52.044399,"d":"52.04440"},{"v":-126.6667,"d":"-126.66670"},"http://www.google.com/maps/place/52.044399,-126.6667",8625,"Rural",3,2,"No","Yes","Yes","No ","South Bentinck","FALSE","FALSE"]
[null,8851,"South Hazelton","No","Regional District of Kitimat-Stikine","North Coast",{"$nulls":7},"",{"$nulls":6},"","",null,"",null,null,"",null,"South Hazelton","N",{"v":55.237518,"d":"55.23752"},{"v":-127.658701,"d":"-127.65870"},"http://www.google.com/maps/place/55.237518,-127.658701",8851,"Rural",508,258,"No","No","No","No ","South Hazelton","FALSE","FALSE"]
[null,8462,"South Lakeside","Yes","Cariboo Regional District","Cariboo",{"$nulls":7},"",{"$nulls":6},"","",null,"",null,null,"",null,"South Lakeside","N",{"v":52.1083,"d":"52.10830"},{"v":-122.0972,"d":"-122.09720"},"http://www.google.com/maps/place/52.1083,-122.0972",8462,"Rural",1550,804,"Yes","No","No","No ","South Lakeside","FALSE","FALSE"]
[null,8251,"South Shalalth","No","Squamish-Lillooet Regional District","Lower Mainland--Southwest",{"$nulls":7},"",{"$nulls":6},"","",null,"",null,null,"",null,"South Shalalth","N",50.72883,{"v":-122.244354,"d":"-122.24435"},"http://www.google.com/maps/place/50.72883,-122.244354",8251,"Rural",38,25,"No","Yes","No","No ","South Shalalth","FALSE","FALSE"]
[null,100124,"South Slocan","Yes","Regional District of Central Kootenay","Kootenay",{"$nulls":7},"",{"$nulls":6},"","",null,"",null,null,"",null,"South Slocan","N",{"v":49.45762778,"d":"49.45763"},{"v":-117.52367222,"d":"-117.52367"},"http://www.google.com/maps/place/49.45762778,-117.52367222",100124,"Rural",920,389,"Yes","No","No","No ","South Slocan","FALSE","FALSE"]
[null,8087,"South Surrey","Yes","Metro Vancouver Regional District","Lower Mainland--Southwest",{"$nulls":7},"",{"$nulls":6},"","",null,"",null,null,"",null,"South Surrey","N",{"v":49.054281,"d":"49.05428"},{"v":-122.832917,"d":"-122.83292"},"http://www.google.com/maps/place/49.054281,-122.832917",8087,"Urban",58492,27051,"Yes","No","Yes","No ","South Surrey","FALSE","FALSE"]
[null,8935,"South Taylor","No","Peace River Regional District","Northeast",{"$nulls":7},"",{"$nulls":6},"","",null,"",null,null,"",null,"South Taylor","N",{"v":56.106812,"d":"56.10681"},{"v":-120.633736,"d":"-120.63374"},"http://www.google.com/maps/place/56.106812,-120.633736",8935,"Rural",179,47,"No","Yes","Yes","No ","South Taylor","FALSE","FALSE"]
[null,8695,"South Wellington","Yes","Regional District of Nanaimo","Vancouver Island and Coast",{"$nulls":7},"",{"$nulls":6},"","",null,"",null,null,"",null,"South Wellington","N",{"v":49.0941,"d":"49.09410"},{"v":-123.886796,"d":"-123.88680"},"http://www.google.com/maps/place/49.0941,-123.886796",8695,"Rural",2773,1146,"Yes","No","No","No ","South Wellington","FALSE","FALSE"]
[null,8810,"Southbank","No","Bulkley Nechako Regional District","Nechako",{"$nulls":7},"",{"$nulls":6},"","",null,"",null,null,"",null,"Southbank","N",{"v":54.021239,"d":"54.02124"},-125.77075,"http://www.google.com/maps/place/54.021239,-125.77075",8810,"Rural",201,98,"No","Yes","No","No ","Southbank","FALSE","FALSE"]
[null,50600,"Spallumcheen (Splatsin)*","Yes","Regional District of North Okanagan","Thompson--Okanagan",{"$nulls":7},"",{"$nulls":6},"","",null,0,null,null,0,null,"Spallumcheen (Splatsin)","Y",{"v":50.542514197,"d":"50.54251"},{"v":-119.138698037,"d":"-119.13870"},"http://www.google.com/maps/place/50.542514197,-119.138698037",50600,"Rural First Nations Primary Reserve",1985,970,"Yes","No","Yes","No ","Spallumcheen (Splatsin)*","FALSE","FALSE"]
[null,7938,"Sparwood","Yes","Regional District of East Kootenay","Kootenay",{"$nulls":7},"",{"$nulls":6},"","",null,"",null,null,"",null,"Sparwood","N",{"v":49.732622,"d":"49.73262"},{"v":-114.891904,"d":"-114.89190"},"http://www.google.com/maps/place/49.732622,-114.891904",7938,"Rural",3307,1880,"Yes","No","No","No ","Sparwood","FALSE","FALSE"]
[null,8272,"Spences Bridge","No","Thompson-Nicola Regional District","Thompson--Okanagan",{"$nulls":7},"",{"$nulls":6},"","",null,"",null,null,"",null,"Spences Bridge","N",{"v":50.423355,"d":"50.42336"},{"v":-121.344062,"d":"-121.34406"},"http://www.google.com/maps/place/50.423355,-121.344062",8272,"Rural",114,69,"No","Yes","Yes","No ","Spences Bridge","FALSE","FALSE"]
[null,8339,"Spillimacheen","No","Regional District of East Kootenay","Kootenay",{"$nulls":7},"",{"$nulls":6},"","",null,"",null,null,"",null,"Spillimacheen","N",{"v":50.907249,"d":"50.90725"},{"v":-116.363519,"d":"-116.36352"},"http://www.google.com/maps/place/50.907249,-116.363519",8339,"Rural",63,55,"No","Yes","Yes","No ","Spillimacheen","FALSE","FALSE"]
[null,8473,"Springhouse","No","Cariboo Regional District","Cariboo",{"$nulls":7},"",{"$nulls":6},"","",null,"",null,null,"",null,"Springhouse","N",{"v":51.966701,"d":"51.96670"},{"v":-122.1333,"d":"-122.13330"},"http://www.google.com/maps/place/51.966701,-122.1333",8473,"Rural",117,52,"No","Yes","Yes","No ","Springhouse","FALSE","FALSE"]
[null,8741,"Sproat Lake","Yes","Regional District of Alberni-Clayoquot","Vancouver Island and Coast",{"$nulls":7},"",{"$nulls":6},"","",null,"",null,null,"",null,"Sproat Lake","N",{"v":49.276622,"d":"49.27662"},{"v":-124.923621,"d":"-124.92362"},"http://www.google.com/maps/place/49.276622,-124.923621",8741,"Rural",848,497,"Yes","No","Yes","No ","Sproat Lake","FALSE","FALSE"]
[null,100133,"Spruceland and Wilks/Kahn","No","Regional District of East Kootenay","Kootenay",{"$nulls":7},"",{"$nulls":6},"","",null,"",null,null,"",null,"Spruceland and Wilks/Kahn","N",{"v":49.54888977,"d":"49.54889"},{"v":-115.81790612,"d":"-115.81791"},"http://www.google.com/maps/place/49.54888977,-115.81790612",100133,"Rural",475,185,"No","No","No","No ","Spruceland and Wilks/Kahn","FALSE","FALSE"]
[null,8229,"Spuzzum","No","Fraser Valley Regional District","Lower Mainland--Southwest",{"$nulls":7},"",{"$nulls":6},"","",null,"",null,null,"",null,"Spuzzum","N",49.68864,{"v":-121.416755,"d":"-121.41676"},"http://www.google.com/maps/place/49.68864,-121.416755",8229,"Rural",22,17,"No","Yes","No","No ","Spuzzum","FALSE","FALSE"]
[null,50708,"Spuzzum*","No","Fraser Valley Regional District","Lower Mainland--Southwest",{"$nulls":7},"",{"$nulls":6},"","",null,0,null,null,0,null,"Spuzzum","Y",{"v":49.661023326,"d":"49.66102"},{"v":-121.411473898,"d":"-121.41147"},"http://www.google.com/maps/place/49.661023326,-121.411473898",50708,"Rural First Nations Primary Reserve",41,16,"No","Yes","Yes","No ","Spuzzum*","FALSE","FALSE"]
[null,8156,"Squamish","Yes","Squamish-Lillooet Regional District","Lower Mainland--Southwest",{"$nulls":7},"",{"$nulls":6},"","",null,"",null,null,"",null,"Squamish","N",{"v":49.702408,"d":"49.70241"},{"v":-123.146733,"d":"-123.14673"},"http://www.google.com/maps/place/49.702408,-123.146733",8156,"Rural",5015,2183,"Yes","No","No","No ","Squamish","FALSE","FALSE"]
[null,50555,"Squamish*","Yes","Metro Vancouver Regional District","Lower Mainland--Southwest",{"$nulls":7},"",{"$nulls":6},"","",null,0,null,null,0,null,"Squamish","Y",{"v":49.318261453,"d":"49.31826"},{"v":-123.083572229,"d":"-123.08357"},"http://www.google.com/maps/place/49.318261453,-123.083572229",50555,"Urban First Nations Primary Reserve",47239,20236,"Yes","No","Yes","No ","Squamish*","FALSE","FALSE"]
[null,8157,{"$f":"HYPERLINK(AG1057,AP1057)","v":"Squamish*"},"No","Squamish-Lillooet Regional District","Lower Mainland--Southwest",{"$nulls":7},{"$f":"IF(COUNT(V1057)=0, \"\", IF(V1057>=0,\"Sufficient Capacity\", IF(V1057<0,\"Not Enough Capacity\")))","v":""},{"$nulls":6},{"$f":"IF(OR(ISBLANK(H1057),ISBLANK(I1057),ISBLANK(J1057)), \"\",(H1057*I1057/J1057))","v":""},{"$f":"IF(AND(COUNT(L1057,U1057)=2, OR($M$10=\"Last-Mile\", $M$10=\"Transport & Last-Mile\")), L1057-U1057, \"\")","v":""},null,{"$f":"IF(AD1057=\"Y\",COUNT(H1057), \"\")","v":0},null,null,{"$f":"IF(AD1057=\"Y\",COUNT(P1057), \"\")","v":0},null,"Squamish","Y",{"v":49.690967,"d":"49.69097"},{"v":-123.150287,"d":"-123.15029"},"http://www.google.com/maps/place/49.690967,-123.150287",8157,"Rural First Nations Secondary Reserve",117,28,"No","No","Yes","No ",{"$f":"IF(AD1057=\"Y\", CONCATENATE(AC1057,\"*\"), AC1057)","v":"Squamish*"},{"$f":"IF(G1057=\"Last-Mile\",\"TRUE\",IF(G1057=\"Transport & Last-Mile\",\"TRUE\",\"FALSE\"))","v":"FALSE"},{"$f":"IF(G1057=\"Transport\",\"TRUE\",IF(G1057=\"Transport & Last-Mile\",\"TRUE\",\"FALSE\"))","v":"FALSE"}]
[null,8158,"Squamish*","Yes","Squamish-Lillooet Regional District","Lower Mainland--Southwest",{"$nulls":7},"",{"$nulls":6},"","",null,0,null,null,0,null,"Squamish","Y",{"v":49.771237,"d":"49.77124"},{"v":-123.162035,"d":"-123.16204"},"http://www.google.com/maps/place/49.771237,-123.162035",8158,"Rural First Nations Secondary Reserve",3472,1229,"Yes","No","No","No ","Squamish*","FALSE","FALSE"]
[null,8161,"Squamish*","No","Squamish-Lillooet Regional District","Lower Mainland--Southwest",{"$nulls":7},"",{"$nulls":6},"","",null,0,null,null,0,null,"Squamish","Y",{"v":49.8,"d":"49.80000"},{"v":-123.183301,"d":"-123.18330"},"http://www.google.com/maps/place/49.8,-123.183301",8161,"Rural First Nations Secondary Reserve",199,92,"No","Yes","No","No ","Squamish*","FALSE","FALSE"]
[null,8226,"Squeah","No","Fraser Valley Regional District","Lower Mainland--Southwest",{"$nulls":7},"",{"$nulls":6},"","",null,"",null,null,"",null,"Squeah","N",49.50422,{"v":-121.420497,"d":"-121.42050"},"http://www.google.com/maps/place/49.50422,-121.420497",8226,"Rural",179,103,"No","Yes","No","No ","Squeah","FALSE","FALSE"]
[null,50574,"Squiala First Nation*","Yes","Fraser Valley Regional District","Lower Mainland--Southwest",{"$nulls":7},"",{"$nulls":6},"","",null,0,null,null,0,null,"Squiala First Nation","Y",{"v":49.158014,"d":"49.15801"},{"v":-121.979421,"d":"-121.97942"},"http://www.google.com/maps/place/49.158014,-121.979421",50574,"Rural First Nations Primary Reserve",27163,12788,"Yes","No","No","No ","Squiala First Nation*","FALSE","FALSE"]
[null,8474,"St. Joseph Mission","No","Cariboo Regional District","Cariboo",{"$nulls":7},"",{"$nulls":6},"","",null,"",null,null,"",null,"St. Joseph Mission","N",{"v":52.0667,"d":"52.06670"},{"v":-121.949999,"d":"-121.95000"},"http://www.google.com/maps/place/52.0667,-121.949999",8474,"Rural",56,23,"No","Yes","No","No ","St. Joseph Mission","FALSE","FALSE"]
[null,100107,"St. Leon Hot Springs","No","Regional District of Central Kootenay","Kootenay",{"$nulls":7},"",{"$nulls":6},"","",null,"",null,null,"",null,"St. Leon Hot Springs","N",50.44242,-117.88455,"http://www.google.com/maps/place/50.44242,-117.88455",100107,"Rural",1,0,"No","Yes","No","No ","St. Leon Hot Springs","FALSE","FALSE"]
[null,100136,"St. Marys Lake","No","Regional District of East Kootenay","Kootenay",{"$nulls":7},"",{"$nulls":6},"","",null,"",null,null,"",null,"St. Marys Lake","N",{"v":49.62398834,"d":"49.62399"},{"v":-116.10865758,"d":"-116.10866"},"http://www.google.com/maps/place/49.62398834,-116.10865758",100136,"Rural",22,14,"No","Yes","No","No ","St. Marys Lake","FALSE","FALSE"]
[null,8007,"St. Mary's*","No","Regional District of East Kootenay","Kootenay",{"$nulls":7},"",{"$nulls":6},"","",null,0,null,null,0,null,"St. Mary's","Y",49.62032,{"v":-115.696089,"d":"-115.69609"},"http://www.google.com/maps/place/49.62032,-115.696089",8007,"Rural First Nations Primary Reserve",128,46,"No","Yes","No","No ","St. Mary's*","FALSE","FALSE"]
[null,8973,"Steamboat","No","Northern Rockies Regional Municipality","Northeast",{"$nulls":7},"",{"$nulls":6},"","",null,"",null,null,"",null,"Steamboat","N",{"v":58.675634,"d":"58.67563"},{"v":-123.712165,"d":"-123.71217"},"http://www.google.com/maps/place/58.675634,-123.712165",8973,"Rural",0,0,"No","Yes","No","No ","Steamboat","FALSE","FALSE"]
[null,50613,"Stellat'en First Nation*","No","Bulkley Nechako Regional District","Nechako",{"$nulls":7},"",{"$nulls":6},"","",null,0,null,null,0,null,"Stellat'en First Nation","Y",{"v":54.063796504,"d":"54.06380"},{"v":-124.911113623,"d":"-124.91111"},"http://www.google.com/maps/place/54.063796504,-124.911113623",50613,"Rural First Nations Primary Reserve",275,100,"No","Yes","No","No ","Stellat'en First Nation*","FALSE","FALSE"]
[null,8588,"Stewardson Inlet","No","Regional District of Alberni-Clayoquot","Vancouver Island and Coast",{"$nulls":7},"",{"$nulls":6},"","",null,"",null,null,"",null,"Stewardson Inlet","N",{"v":49.421714,"d":"49.42171"},-126.31636,"http://www.google.com/maps/place/49.421714,-126.31636",8588,"Rural",5,3,"No","Yes","No","No ","Stewardson Inlet","FALSE","FALSE"]
[null,8895,"Stewart","No","Regional District of Kitimat-Stikine","North Coast",{"$nulls":7},"",{"$nulls":6},"","",null,"",null,null,"",null,"Stewart","N",{"v":55.941823,"d":"55.94182"},{"v":-129.983772,"d":"-129.98377"},"http://www.google.com/maps/place/55.941823,-129.983772",8895,"Rural",376,275,"No","Yes","No","No ","Stewart","FALSE","FALSE"]
[null,8986,"Stikine","No","Regional District of Kitimat-Stikine","North Coast",{"$nulls":7},"",{"$nulls":6},"","",null,"",null,null,"",null,"Stikine","N",{"v":56.698135,"d":"56.69814"},-131.80644,"http://www.google.com/maps/place/56.698135,-131.80644",8986,"Rural",30,25,"No","Yes","Yes","No ","Stikine","FALSE","FALSE"]
[null,8194,"Stillwater","Yes","qathet Regional District","Vancouver Island and Coast",{"$nulls":7},"",{"$nulls":6},"","",null,"",null,null,"",null,"Stillwater","N",{"v":49.7667,"d":"49.76670"},{"v":-124.3,"d":"-124.30000"},"http://www.google.com/maps/place/49.7667,-124.3",8194,"Rural",131,95,"Yes","No","No","No ","Stillwater","FALSE","FALSE"]
[null,50717,"Stone (Yunesit'in Government)*","No","Cariboo Regional District","Cariboo",{"$nulls":7},"",{"$nulls":6},"","",null,0,null,null,0,null,"Stone (Yunesit'in Government)","Y",{"v":51.92319217,"d":"51.92319"},{"v":-123.135168595,"d":"-123.13517"},"http://www.google.com/maps/place/51.92319217,-123.135168595",50717,"Rural First Nations Primary Reserve",183,50,"No","Yes","No","No ","Stone (Yunesit'in Government)*","FALSE","FALSE"]
[null,8433,"Stoner","No","Regional District of Fraser-Fort George","Cariboo",{"$nulls":7},"",{"$nulls":6},"","",null,"",null,null,"",null,"Stoner","N",{"v":53.629067,"d":"53.62907"},{"v":-122.662451,"d":"-122.66245"},"http://www.google.com/maps/place/53.629067,-122.662451",8433,"Rural",101,45,"No","Yes","No","No ","Stoner","FALSE","FALSE"]
[null,8384,"Stump Lake","No","Thompson-Nicola Regional District","Thompson--Okanagan",{"$nulls":7},"",{"$nulls":6},"","",null,"",null,null,"",null,"Stump Lake","N",{"v":50.388316,"d":"50.38832"},{"v":-120.327795,"d":"-120.32780"},"http://www.google.com/maps/place/50.388316,-120.327795",8384,"Rural",20,38,"No","Yes","No","No ","Stump Lake","FALSE","FALSE"]
[null,8683,"Sturdies Bay","No","Capital Regional District","Vancouver Island and Coast",{"$nulls":7},"",{"$nulls":6},"","",null,"",null,null,"",null,"Sturdies Bay","N",{"v":48.879166,"d":"48.87917"},{"v":-123.319444,"d":"-123.31944"},"http://www.google.com/maps/place/48.879166,-123.319444",8683,"Rural",192,311,"No","Yes","No","No ","Sturdies Bay","FALSE","FALSE"]
[null,50719,"Sugarcane (Williams Lake)*","No","Cariboo Regional District","Cariboo",{"$nulls":7},"",{"$nulls":6},"","",null,0,null,null,0,null,"Sugarcane (Williams Lake)","Y",{"v":52.108297741,"d":"52.10830"},{"v":-121.993912319,"d":"-121.99391"},"http://www.google.com/maps/place/52.108297741,-121.993912319",50719,"Rural First Nations Primary Reserve",438,191,"No","Yes","No","No ","Sugarcane (Williams Lake)*","FALSE","FALSE"]
[null,8563,"Sullivan Bay","No","Regional District of Mount Waddington","Vancouver Island and Coast",{"$nulls":7},"",{"$nulls":6},"","",null,"",null,null,"",null,"Sullivan Bay","N",{"v":50.883301,"d":"50.88330"},{"v":-126.816701,"d":"-126.81670"},"http://www.google.com/maps/place/50.883301,-126.816701",8563,"Rural",5,3,"No","Yes","No","No ","Sullivan Bay","FALSE","FALSE"]
[null,50578,"Sumas First Nation*","Yes","Fraser Valley Regional District","Lower Mainland--Southwest",{"$nulls":7},"",{"$nulls":6},"","",null,0,null,null,0,null,"Sumas First Nation","Y",{"v":49.055516307,"d":"49.05552"},{"v":-122.195016475,"d":"-122.19502"},"http://www.google.com/maps/place/49.055516307,-122.195016475",50578,"Rural First Nations Primary Reserve",7918,3015,"Yes","No","No","No ","Sumas First Nation*","FALSE","FALSE"]
[null,8130,"Summerland","Yes","Regional District of Okanagan-Similkameen","Thompson--Okanagan",{"$nulls":7},"",{"$nulls":6},"","",null,"",null,null,"",null,"Summerland","N",49.60544,{"v":-119.672582,"d":"-119.67258"},"http://www.google.com/maps/place/49.60544,-119.672582",8130,"Rural",8487,3876,"Yes","No","Yes","No ","Summerland","FALSE","FALSE"]
[null,8974,"Summit Lake","No","Northern Rockies Regional Municipality","Northeast",{"$nulls":7},"",{"$nulls":6},"","",null,"",null,null,"",null,"Summit Lake","N",{"v":58.655394,"d":"58.65539"},{"v":-124.637719,"d":"-124.63772"},"http://www.google.com/maps/place/58.655394,-124.637719",8974,"Rural",45,30,"No","Yes","No","No ","Summit Lake","FALSE","FALSE"]
[null,8404,"Summit Lake","No","Regional District of Central Kootenay","Kootenay",{"$nulls":7},"",{"$nulls":6},"","",null,"",null,null,"",null,"Summit Lake","N",{"v":50.152267,"d":"50.15227"},{"v":-117.660714,"d":"-117.66071"},"http://www.google.com/maps/place/50.152267,-117.660714",8404,"Rural",1,1,"No","Yes","No","No ","Summit Lake","FALSE","FALSE"]
[null,8428,"Summit Lake","No","Regional District of Fraser-Fort George","Cariboo",{"$nulls":7},"",{"$nulls":6},"","",null,"",null,null,"",null,"Summit Lake","N",{"v":54.25,"d":"54.25000"},{"v":-122.633299,"d":"-122.63330"},"http://www.google.com/maps/place/54.25,-122.633299",8428,"Rural",39,86,"No","No","Yes","No ","Summit Lake","FALSE","FALSE"]
[null,8377,"Sun Peaks","Yes","Thompson-Nicola Regional District","Thompson--Okanagan",{"$nulls":7},"",{"$nulls":6},"","",null,"",null,null,"",null,"Sun Peaks","N",{"v":50.878038,"d":"50.87804"},{"v":-119.908131,"d":"-119.90813"},"http://www.google.com/maps/place/50.878038,-119.908131",8377,"Rural",215,298,"Yes","No","Yes","No ","Sun Peaks","FALSE","FALSE"]
[null,7982,"Sunningdale","Yes","Regional District of Kootenay Boundary","Kootenay",{"$nulls":7},"",{"$nulls":6},"","",null,"",null,null,"",null,"Sunningdale","N",{"v":49.1167,"d":"49.11670"},{"v":-117.716699,"d":"-117.71670"},"http://www.google.com/maps/place/49.1167,-117.716699",7982,"Rural",3165,1475,"Yes","No","No","No ","Sunningdale","FALSE","FALSE"]
[null,8313,"Sunnybrae","No","Columbia-Shuswap Regional District","Thompson--Okanagan",{"$nulls":7},"",{"$nulls":6},"","",null,"",null,null,"",null,"Sunnybrae","N",{"v":50.773243,"d":"50.77324"},{"v":-119.269944,"d":"-119.26994"},"http://www.google.com/maps/place/50.773243,-119.269944",8313,"Rural",229,149,"No","Yes","No","No ","Sunnybrae","FALSE","FALSE"]
[null,50617,"Sunnyside (Tl'azt'en Nation)*","No","Bulkley Nechako Regional District","Nechako",{"$nulls":7},"",{"$nulls":6},"","",null,0,null,null,0,null,"Sunnyside (Tl'azt'en Nation)","Y",{"v":54.655868834,"d":"54.65587"},{"v":-124.723572847,"d":"-124.72357"},"http://www.google.com/maps/place/54.655868834,-124.723572847",50617,"Rural First Nations Secondary Reserve",401,114,"No","Yes","No","No ","Sunnyside (Tl'azt'en Nation)*","FALSE","FALSE"]
[null,8918,"Sunset Prairie","No","Peace River Regional District","Northeast",{"$nulls":7},"",{"$nulls":6},"","",null,"",null,null,"",null,"Sunset Prairie","N",{"v":55.839743,"d":"55.83974"},{"v":-120.763988,"d":"-120.76399"},"http://www.google.com/maps/place/55.839743,-120.763988",8918,"Rural",28,16,"No","Yes","Yes","No ","Sunset Prairie","FALSE","FALSE"]
[null,8042,"Sunshine Valley","No","Fraser Valley Regional District","Lower Mainland--Southwest",{"$nulls":7},"",{"$nulls":6},"","",null,"",null,null,"",null,"Sunshine Valley","N",49.27272,{"v":-121.238805,"d":"-121.23881"},"http://www.google.com/maps/place/49.27272,-121.238805",8042,"Rural",166,335,"No","No","No","No ","Sunshine Valley","FALSE","FALSE"]
[null,8770,"Surge Narrows","No","Strathcona Regional District","Vancouver Island and Coast",{"$nulls":7},"",{"$nulls":6},"","",null,"",null,null,"",null,"Surge Narrows","N",{"v":50.230599,"d":"50.23060"},{"v":-125.108938,"d":"-125.10894"},"http://www.google.com/maps/place/50.230599,-125.108938",8770,"Rural",33,28,"No","Yes","No","No ","Surge Narrows","FALSE","FALSE"]
[null,8116,"Surrey","Yes","Metro Vancouver Regional District","Lower Mainland--Southwest",{"$nulls":7},"",{"$nulls":6},"","",null,"",null,null,"",null,"Surrey","N",{"v":49.174479,"d":"49.17448"},{"v":-122.827771,"d":"-122.82777"},"http://www.google.com/maps/place/49.174479,-122.827771",8116,"Urban",86764,27248,"Yes","No","No","No ","Surrey","FALSE","FALSE"]
[null,8663,"Swartz Bay","Yes","Capital Regional District","Vancouver Island and Coast",{"$nulls":7},"",{"$nulls":6},"","",null,"",null,null,"",null,"Swartz Bay","N",{"v":48.682666,"d":"48.68267"},-123.41313,"http://www.google.com/maps/place/48.682666,-123.41313",8663,"Urban",4178,2111,"Yes","No","Yes","No ","Swartz Bay","FALSE","FALSE"]
[null,100129,"Sweetwater","No","Regional District of East Kootenay","Kootenay",{"$nulls":7},"",{"$nulls":6},"","",null,"",null,null,"",null,"Sweetwater","N",{"v":49.17352733,"d":"49.17353"},{"v":-115.24347351,"d":"-115.24347"},"http://www.google.com/maps/place/49.17352733,-115.24347351",100129,"Rural",1,1,"No","Yes","Yes","No ","Sweetwater","FALSE","FALSE"]
[null,9045,"Ta Ta Creek","Yes","Regional District of East Kootenay","Kootenay",{"$nulls":7},"",{"$nulls":6},"","",null,"",null,null,"",null,"Ta Ta Creek","N",{"v":49.783301,"d":"49.78330"},{"v":-115.7833,"d":"-115.78330"},"http://www.google.com/maps/place/49.783301,-115.7833",9045,"Rural",307,360,"Yes","No","No","No ","Ta Ta Creek","FALSE","FALSE"]
[null,8808,"Tachie*","No","Bulkley Nechako Regional District","Nechako",{"$nulls":7},"",{"$nulls":6},"","",null,0,null,null,0,null,"Tachie","Y",{"v":54.654818,"d":"54.65482"},{"v":-124.757885,"d":"-124.75789"},"http://www.google.com/maps/place/54.654818,-124.757885",8808,"Rural First Nations Secondary Reserve",401,114,"No","Yes","No","No ","Tachie*","FALSE","FALSE"]
[null,7979,"Taghum","Yes","Regional District of Central Kootenay","Kootenay",{"$nulls":7},"",{"$nulls":6},"","",null,"",null,null,"",null,"Taghum","N",{"v":49.493387,"d":"49.49339"},{"v":-117.398939,"d":"-117.39894"},"http://www.google.com/maps/place/49.493387,-117.398939",7979,"Rural",864,415,"Yes","No","Yes","No ","Taghum","FALSE","FALSE"]
[null,8984,"Tahltan","No","Regional District of Kitimat-Stikine","North Coast",{"$nulls":7},"",{"$nulls":6},"","",null,"",null,null,"",null,"Tahltan","N",{"v":58.472426,"d":"58.47243"},{"v":-130.015498,"d":"-130.01550"},"http://www.google.com/maps/place/58.472426,-130.015498",8984,"Rural",58,19,"No","Yes","No","No ","Tahltan","FALSE","FALSE"]
[null,8577,"Tahsis","No","Strathcona Regional District","Vancouver Island and Coast",{"$nulls":7},"",{"$nulls":6},"","",null,"",null,null,"",null,"Tahsis","N",{"v":49.930295,"d":"49.93030"},{"v":-126.654712,"d":"-126.65471"},"http://www.google.com/maps/place/49.930295,-126.654712",8577,"Rural",248,400,"No","Yes","Yes","No ","Tahsis","FALSE","FALSE"]
[null,50608,"Takla Landing (Takla Nation)*","No","Bulkley Nechako Regional District","Nechako",{"$nulls":7},"",{"$nulls":6},"","",null,0,null,null,0,null,"Takla Landing (Takla Nation)","Y",{"v":55.482356,"d":"55.48236"},{"v":-125.975336,"d":"-125.97534"},"http://www.google.com/maps/place/55.482356,-125.975336",50608,"Rural First Nations Primary Reserve",75,34,"No","Yes","Yes","Yes ","Takla Landing (Takla Nation)*","FALSE","FALSE"]
[null,50501,"Taku River Tlingit*","No","Stikine Regional District (Unincorporated)","Nechako",{"$nulls":7},"",{"$nulls":6},"","",null,0,null,null,0,null,"Taku River Tlingit","Y",{"v":59.505817395,"d":"59.50582"},{"v":-133.658689059,"d":"-133.65869"},"http://www.google.com/maps/place/59.505817395,-133.658689059",50501,"Rural First Nations Primary Reserve",162,100,"No","Yes","Yes","Yes ","Taku River Tlingit*","FALSE","FALSE"]
[null,8818,"Takysie Lake","No","Bulkley Nechako Regional District","Nechako",{"$nulls":7},"",{"$nulls":6},"","",null,"",null,null,"",null,"Takysie Lake","N",{"v":53.883301,"d":"53.88330"},{"v":-125.8667,"d":"-125.86670"},"http://www.google.com/maps/place/53.883301,-125.8667",8818,"Rural",57,27,"No","Yes","Yes","No ","Takysie Lake","FALSE","FALSE"]
[null,8314,"Tappen*","No","Columbia-Shuswap Regional District","Thompson--Okanagan",{"$nulls":7},"",{"$nulls":6},"","",null,0,null,null,0,null,"Tappen","Y",{"v":50.783988,"d":"50.78399"},{"v":-119.330606,"d":"-119.33061"},"http://www.google.com/maps/place/50.783988,-119.330606",8314,"Rural First Nations Secondary Reserve",752,363,"No","No","Yes","No ","Tappen*","FALSE","FALSE"]
[null,8823,"Tatalrose","No","Bulkley Nechako Regional District","Nechako",{"$nulls":7},"",{"$nulls":6},"","",null,"",null,null,"",null,"Tatalrose","N",{"v":53.983299,"d":"53.98330"},{"v":-125.983299,"d":"-125.98330"},"http://www.google.com/maps/place/53.983299,-125.983299",8823,"Rural",14,7,"No","Yes","Yes","No ","Tatalrose","FALSE","FALSE"]
[null,8515,"Tatla Lake","No","Cariboo Regional District","Cariboo",{"$nulls":7},"",{"$nulls":6},"","",null,"",null,null,"",null,"Tatla Lake","N",{"v":51.900001,"d":"51.90000"},{"v":-124.6,"d":"-124.60000"},"http://www.google.com/maps/place/51.900001,-124.6",8515,"Rural",60,31,"No","Yes","No","No ","Tatla Lake","FALSE","FALSE"]
[null,8772,"Tatlayoko Lake","No","Cariboo Regional District","Cariboo",{"$nulls":7},"",{"$nulls":6},"","",null,"",null,null,"",null,"Tatlayoko Lake","N",{"v":51.7167,"d":"51.71670"},{"v":-124.433299,"d":"-124.43330"},"http://www.google.com/maps/place/51.7167,-124.433299",8772,"Rural",46,21,"No","Yes","Yes","No ","Tatlayoko Lake","FALSE","FALSE"]
[null,8990,"Tatogga","No","Regional District of Kitimat-Stikine","North Coast",{"$nulls":7},"",{"$nulls":6},"","",null,"",null,null,"",null,"Tatogga","N",{"v":57.716348,"d":"57.71635"},{"v":-129.987351,"d":"-129.98735"},"http://www.google.com/maps/place/57.716348,-129.987351",8990,"Rural",2,2,"No","Yes","Yes","No ","Tatogga","FALSE","FALSE"]
[null,8478,"Tatton","No","Cariboo Regional District","Cariboo",{"$nulls":7},"",{"$nulls":6},"","",null,"",null,null,"",null,"Tatton","N",{"v":51.705674,"d":"51.70567"},{"v":-121.385414,"d":"-121.38541"},"http://www.google.com/maps/place/51.705674,-121.385414",8478,"Rural",51,27,"No","Yes","No","No ","Tatton","FALSE","FALSE"]
[null,8936,"Taylor","Yes","Peace River Regional District","Northeast",{"$nulls":7},"",{"$nulls":6},"","",null,"",null,null,"",null,"Taylor","N",{"v":56.154368,"d":"56.15437"},{"v":-120.679864,"d":"-120.67986"},"http://www.google.com/maps/place/56.154368,-120.679864",8936,"Rural",1499,608,"Yes","No","Yes","No ","Taylor","FALSE","FALSE"]
[null,8814,"Tchesinkut Lake","No","Bulkley Nechako Regional District","Nechako",{"$nulls":7},"",{"$nulls":6},"","",null,"",null,null,"",null,"Tchesinkut Lake","N",{"v":54.082274,"d":"54.08227"},{"v":-125.737955,"d":"-125.73796"},"http://www.google.com/maps/place/54.082274,-125.737955",8814,"Rural",109,45,"No","Yes","No","No ","Tchesinkut Lake","FALSE","FALSE"]
[null,8833,"Telachick","No","Regional District of Fraser-Fort George","Cariboo",{"$nulls":7},"",{"$nulls":6},"","",null,"",null,null,"",null,"Telachick","N",{"v":53.862116,"d":"53.86212"},{"v":-123.182321,"d":"-123.18232"},"http://www.google.com/maps/place/53.862116,-123.182321",8833,"Rural",26,9,"No","Yes","Yes","No ","Telachick","FALSE","FALSE"]
[null,8570,"Telegraph Cove","No","Regional District of Mount Waddington","Vancouver Island and Coast",{"$nulls":7},"",{"$nulls":6},"","",null,"",null,null,"",null,"Telegraph Cove","N",{"v":50.545747,"d":"50.54575"},-126.82751,"http://www.google.com/maps/place/50.545747,-126.82751",8570,"Rural",17,21,"No","Yes","No","No ","Telegraph Cove","FALSE","FALSE"]
[null,50682,"Telegraph Creek (Tahltan)*","No","Regional District of Kitimat-Stikine","North Coast",{"$nulls":7},"",{"$nulls":6},"","",null,0,null,null,0,null,"Telegraph Creek (Tahltan)","Y",{"v":57.906884789,"d":"57.90688"},{"v":-131.160409854,"d":"-131.16041"},"http://www.google.com/maps/place/57.906884789,-131.160409854",50682,"Rural First Nations Primary Reserve",83,62,"No","Yes","Yes","No ","Telegraph Creek (Tahltan)*","FALSE","FALSE"]
[null,8844,"Telkwa","No","Bulkley Nechako Regional District","Nechako",{"$nulls":7},"",{"$nulls":6},"","",null,"",null,null,"",null,"Telkwa","N",{"v":54.697199,"d":"54.69720"},{"v":-127.049999,"d":"-127.05000"},"http://www.google.com/maps/place/54.697199,-127.049999",8844,"Rural",906,417,"No","No","No","No ","Telkwa","FALSE","FALSE"]
[null,8437,"Ten Mile Lake","No","Cariboo Regional District","Cariboo",{"$nulls":7},"",{"$nulls":6},"","",null,"",null,null,"",null,"Ten Mile Lake","N",{"v":53.088274,"d":"53.08827"},{"v":-122.440349,"d":"-122.44035"},"http://www.google.com/maps/place/53.088274,-122.440349",8437,"Rural",297,131,"No","Yes","Yes","No ","Ten Mile Lake","FALSE","FALSE"]
[null,8864,"Terrace","Yes","Regional District of Kitimat-Stikine","North Coast",{"$nulls":7},"",{"$nulls":6},"","",null,"",null,null,"",null,"Terrace","N",{"v":54.523404,"d":"54.52340"},{"v":-128.598449,"d":"-128.59845"},"http://www.google.com/maps/place/54.523404,-128.598449",8864,"Rural",11100,4661,"Yes","No","Yes","No ","Terrace","FALSE","FALSE"]
[null,8409,"Tête Jaune Cache","No","Regional District of Fraser-Fort George","Cariboo",{"$nulls":7},"",{"$nulls":6},"","",null,"",null,null,"",null,"Tête Jaune Cache","N",{"v":52.9667,"d":"52.96670"},{"v":-119.4292,"d":"-119.42920"},"http://www.google.com/maps/place/52.9667,-119.4292",8409,"Rural",112,58,"No","Yes","Yes","No ","Tête Jaune Cache","FALSE","FALSE"]
[null,8565,"Thompson Sound","No","Regional District of Mount Waddington","Vancouver Island and Coast",{"$nulls":7},"",{"$nulls":6},"","",null,"",null,null,"",null,"Thompson Sound","N",{"v":50.803652,"d":"50.80365"},{"v":-126.008239,"d":"-126.00824"},"http://www.google.com/maps/place/50.803652,-126.008239",8565,"Rural",3,9,"No","Yes","Yes","No ","Thompson Sound","FALSE","FALSE"]
[null,8866,"Thornhill","Yes","Regional District of Kitimat-Stikine","North Coast",{"$nulls":7},"",{"$nulls":6},"","",null,"",null,null,"",null,"Thornhill","N",{"v":54.512493,"d":"54.51249"},{"v":-128.540495,"d":"-128.54050"},"http://www.google.com/maps/place/54.512493,-128.540495",8866,"Rural",3469,1575,"Yes","No","Yes","No ","Thornhill","FALSE","FALSE"]
[null,100132,"Tie Lake","No","Regional District of East Kootenay","Kootenay",{"$nulls":7},"",{"$nulls":6},"","",null,"",null,null,"",null,"Tie Lake","N",{"v":49.42027913,"d":"49.42028"},{"v":-115.32317803,"d":"-115.32318"},"http://www.google.com/maps/place/49.42027913,-115.32317803",100132,"Rural",44,61,"No","Yes","Yes","No ","Tie Lake","FALSE","FALSE"]
[null,8782,"Tintagel","No","Bulkley Nechako Regional District","Nechako",{"$nulls":7},"",{"$nulls":6},"","",null,"",null,null,"",null,"Tintagel","N",54.20285,{"v":-125.593009,"d":"-125.59301"},"http://www.google.com/maps/place/54.20285,-125.593009",8782,"Rural",142,67,"No","Yes","No","No ","Tintagel","FALSE","FALSE"]
[null,8222,"Tipella","No","Fraser Valley Regional District","Lower Mainland--Southwest",{"$nulls":7},"",{"$nulls":6},"","",null,"",null,null,"",null,"Tipella","N",{"v":49.744625,"d":"49.74463"},{"v":-122.153829,"d":"-122.15383"},"http://www.google.com/maps/place/49.744625,-122.153829",8222,"Rural",11,9,"No","Yes","Yes","No ","Tipella","FALSE","FALSE"]
[null,8260,{"$f":"HYPERLINK(AG1121,AP1121)","v":"T'it'q'et*"},"No","Squamish-Lillooet Regional District","Lower Mainland--Southwest",{"$nulls":7},{"$f":"IF(COUNT(V1121)=0, \"\", IF(V1121>=0,\"Sufficient Capacity\", IF(V1121<0,\"Not Enough Capacity\")))","v":""},{"$nulls":6},{"$f":"IF(OR(ISBLANK(H1121),ISBLANK(I1121),ISBLANK(J1121)), \"\",(H1121*I1121/J1121))","v":""},{"$f":"IF(AND(COUNT(L1121,U1121)=2, OR($M$10=\"Last-Mile\", $M$10=\"Transport & Last-Mile\")), L1121-U1121, \"\")","v":""},null,{"$f":"IF(AD1121=\"Y\",COUNT(H1121), \"\")","v":0},null,null,{"$f":"IF(AD1121=\"Y\",COUNT(P1121), \"\")","v":0},null,"T'it'q'et","Y",{"v":50.5833,"d":"50.58330"},{"v":-121.85,"d":"-121.85000"},"http://www.google.com/maps/place/50.5833,-121.85",8260,"Rural First Nations Secondary Reserve",116,54,"No","Yes","Yes","No ",{"$f":"IF(AD1121=\"Y\", CONCATENATE(AC1121,\"*\"), AC1121)","v":"T'it'q'et*"},{"$f":"IF(G1121=\"Last-Mile\",\"TRUE\",IF(G1121=\"Transport & Last-Mile\",\"TRUE\",\"FALSE\"))","v":"FALSE"},{"$f":"IF(G1121=\"Transport\",\"TRUE\",IF(G1121=\"Transport & Last-Mile\",\"TRUE\",\"FALSE\"))","v":"FALSE"}]
[null,50593,"T'it'q'et*","No","Squamish-Lillooet Regional District","Lower Mainland--Southwest",{"$nulls":7},"",{"$nulls":6},"","",null,0,null,null,0,null,"T'it'q'et","Y",{"v":50.678208235,"d":"50.67821"},{"v":-121.942150103,"d":"-121.94215"},"http://www.google.com/maps/place/50.678208235,-121.942150103",50593,"Rural First Nations Primary Reserve",359,173,"No","Yes","Yes","No ","T'it'q'et*","FALSE","FALSE"]
[null,50688,"Tk'emlúps te Secwépemc*","Yes","Thompson-Nicola Regional District","Thompson--Okanagan",{"$nulls":7},"",{"$nulls":6},"","",null,0,null,null,0,null,"Tk'emlúps te Secwépemc","Y",{"v":50.682038305,"d":"50.68204"},{"v":-120.296506554,"d":"-120.29651"},"http://www.google.com/maps/place/50.682038305,-120.296506554",50688,"Rural First Nations Secondary Reserve",7330,3074,"Yes","No","Yes","No ","Tk'emlúps te Secwépemc*","FALSE","FALSE"]
[null,8594,"Tla-o-qui-aht","Yes","Regional District of Alberni-Clayoquot","Vancouver Island and Coast",{"$nulls":7},"",{"$nulls":6},"","",null,"",null,null,"",null,"Tla-o-qui-aht","N",{"v":49.141159,"d":"49.14116"},{"v":-125.9099,"d":"-125.90990"},"http://www.google.com/maps/place/49.141159,-125.9099",8594,"Rural",472,216,"Yes","No","Yes","No ","Tla-o-qui-aht","FALSE","FALSE"]
[null,8596,"Tla-o-qui-aht*","Yes","Regional District of Alberni-Clayoquot","Vancouver Island and Coast",{"$nulls":7},"",{"$nulls":6},"","",null,0,null,null,0,null,"Tla-o-qui-aht","Y",{"v":49.071259,"d":"49.07126"},{"v":-125.781959,"d":"-125.78196"},"http://www.google.com/maps/place/49.071259,-125.781959",8596,"Rural First Nations Secondary Reserve",346,151,"Yes","No","Yes","No ","Tla-o-qui-aht*","FALSE","FALSE"]
[null,9009,"Tlell","No","North Coast Regional District","North Coast",{"$nulls":7},"",{"$nulls":6},"","",null,"",null,null,"",null,"Tlell","N",{"v":53.5667,"d":"53.56670"},{"v":-131.933299,"d":"-131.93330"},"http://www.google.com/maps/place/53.5667,-131.933299",9009,"Rural",144,87,"No","Yes","Yes","No ","Tlell","FALSE","FALSE"]
[null,50712,"Tl'etinqox Government*","No","Cariboo Regional District","Cariboo",{"$nulls":7},"",{"$nulls":6},"","",null,0,null,null,0,null,"Tl'etinqox Government","Y",{"v":52.016983647,"d":"52.01698"},{"v":-123.176378748,"d":"-123.17638"},"http://www.google.com/maps/place/52.016983647,-123.176378748",50712,"Rural First Nations Secondary Reserve",341,128,"No","Yes","Yes","No ","Tl'etinqox Government*","FALSE","FALSE"]
[null,8510,"Tl'etinqox-t'in Government Office*","No","Cariboo Regional District","Cariboo",{"$nulls":7},"",{"$nulls":6},"","",null,0,null,null,0,null,"Tl'etinqox-t'in Government Office","Y",{"v":52.112626,"d":"52.11263"},{"v":-123.235654,"d":"-123.23565"},"http://www.google.com/maps/place/52.112626,-123.235654",8510,"Rural First Nations Primary Reserve",42,26,"No","Yes","Yes","No ","Tl'etinqox-t'in Government Office*","FALSE","FALSE"]
[null,50637,"Tlowitsis Tribe*","No","Strathcona Regional District","Vancouver Island and Coast",{"$nulls":7},"",{"$nulls":6},"","",null,0,null,null,0,null,"Tlowitsis Tribe","Y",{"v":50.528704148,"d":"50.52870"},{"v":-125.988071676,"d":"-125.98807"},"http://www.google.com/maps/place/50.528704148,-125.988071676",50637,"Rural First Nations Primary Reserve",2,4,"No","Yes","No","No ","Tlowitsis Tribe*","FALSE","FALSE"]
[null,8975,"Toad River","No","Northern Rockies Regional Municipality","Northeast",{"$nulls":7},"",{"$nulls":6},"","",null,"",null,null,"",null,"Toad River","N",{"v":58.85,"d":"58.85000"},{"v":-125.233299,"d":"-125.23330"},"http://www.google.com/maps/place/58.85,-125.233299",8975,"Rural",15,5,"No","Yes","No","No ","Toad River","FALSE","FALSE"]
[null,50603,"Tobacco Plains*","No","Regional District of East Kootenay","Kootenay",{"$nulls":7},"",{"$nulls":6},"","",null,0,null,null,0,null,"Tobacco Plains","Y",{"v":49.093333908,"d":"49.09333"},{"v":-115.081905417,"d":"-115.08191"},"http://www.google.com/maps/place/49.093333908,-115.081905417",50603,"Rural First Nations Primary Reserve",86,74,"No","Yes","No","No ","Tobacco Plains*","FALSE","FALSE"]
[null,8593,"Tofino","Yes","Regional District of Alberni-Clayoquot","Vancouver Island and Coast",{"$nulls":7},"",{"$nulls":6},"","",null,"",null,null,"",null,"Tofino","N",{"v":49.150507,"d":"49.15051"},-125.90559,"http://www.google.com/maps/place/49.150507,-125.90559",8593,"Rural",472,216,"Yes","No","No","No ","Tofino","FALSE","FALSE"]
[null,50718,"Toosey*","No","Cariboo Regional District","Cariboo",{"$nulls":7},"",{"$nulls":6},"","",null,0,null,null,0,null,"Toosey","Y",{"v":51.93181594,"d":"51.93182"},{"v":-122.502324215,"d":"-122.50232"},"http://www.google.com/maps/place/51.93181594,-122.502324215",50718,"Rural First Nations Primary Reserve",107,42,"No","Yes","Yes","No ","Toosey*","FALSE","FALSE"]
[null,8790,"Topley","No","Bulkley Nechako Regional District","Nechako",{"$nulls":7},"",{"$nulls":6},"","",null,"",null,null,"",null,"Topley","N",{"v":54.506831,"d":"54.50683"},{"v":-126.301006,"d":"-126.30101"},"http://www.google.com/maps/place/54.506831,-126.301006",8790,"Rural",59,33,"No","Yes","Yes","No ","Topley","FALSE","FALSE"]
[null,8796,"Topley Landing","No","Bulkley Nechako Regional District","Nechako",{"$nulls":7},"",{"$nulls":6},"","",null,"",null,null,"",null,"Topley Landing","N",{"v":54.80722778,"d":"54.80723"},{"v":-126.14263333,"d":"-126.14263"},"http://www.google.com/maps/place/54.80722778,-126.14263333",8796,"Rural",122,82,"No","Yes","No","No ","Topley Landing","FALSE","FALSE"]
[null,8602,"Toquaht*","No","Regional District of Alberni-Clayoquot","Vancouver Island and Coast",{"$nulls":7},"",{"$nulls":6},"","",null,0,null,null,0,null,"Toquaht","Y",{"v":48.995918,"d":"48.99592"},{"v":-125.379408,"d":"-125.37941"},"http://www.google.com/maps/place/48.995918,-125.379408",8602,"Rural First Nations Primary Reserve",19,11,"No","Yes","No","No ","Toquaht*","FALSE","FALSE"]
[null,50666,"Toquaht*","Yes","Regional District of Alberni-Clayoquot","Vancouver Island and Coast",{"$nulls":7},"",{"$nulls":6},"","",null,0,null,null,0,null,"Toquaht","Y",{"v":48.945046,"d":"48.94505"},{"v":-125.556988,"d":"-125.55699"},"http://www.google.com/maps/place/48.945046,-125.556988",50666,"Rural First Nations Secondary Reserve",1071,540,"Yes","No","No","No ","Toquaht*","FALSE","FALSE"]
[null,100588,"Tow Hill","No","North Coast Regional District","North Coast",{"$nulls":7},"",{"$nulls":6},"","",null,"",null,null,"",null,"Tow Hill","N",{"v":54.026145,"d":"54.02615"},{"v":-132.008433,"d":"-132.00843"},"http://www.google.com/maps/place/54.026145,-132.008433",100588,"Rural",12,7,"No","Yes","Yes","No ","Tow Hill","FALSE","FALSE"]
[null,8517,"Towdystan","No","Cariboo Regional District","Cariboo",{"$nulls":7},"",{"$nulls":6},"","",null,"",null,null,"",null,"Towdystan","N",{"v":52.263377,"d":"52.26338"},{"v":-125.086839,"d":"-125.08684"},"http://www.google.com/maps/place/52.263377,-125.086839",8517,"Rural",11,5,"No","Yes","No","No ","Towdystan","FALSE","FALSE"]
[null,8940,"Tower Lake","No","Peace River Regional District","Northeast",{"$nulls":7},"",{"$nulls":6},"","",null,"",null,null,"",null,"Tower Lake","N",{"v":56.015487,"d":"56.01549"},{"v":-120.561331,"d":"-120.56133"},"http://www.google.com/maps/place/56.015487,-120.561331",8940,"Rural",28,11,"No","Yes","No","No ","Tower Lake","FALSE","FALSE"]
[null,8290,"Traders Cove","Yes","Regional District of Central Okanagan","Thompson--Okanagan",{"$nulls":7},"",{"$nulls":6},"","",null,"",null,null,"",null,"Traders Cove","N",{"v":49.936086,"d":"49.93609"},{"v":-119.504107,"d":"-119.50411"},"http://www.google.com/maps/place/49.936086,-119.504107",8290,"Rural",612,290,"Yes","No","No","No ","Traders Cove","FALSE","FALSE"]
[null,7965,"Trail","Yes","Regional District of Kootenay Boundary","Kootenay",{"$nulls":7},"",{"$nulls":6},"","",null,"",null,null,"",null,"Trail","N",{"v":49.100001,"d":"49.10000"},{"v":-117.700001,"d":"-117.70000"},"http://www.google.com/maps/place/49.100001,-117.700001",7965,"Rural",3165,1475,"Yes","No","No","No ","Trail","FALSE","FALSE"]
[null,8379,"Tranquille","No","Thompson-Nicola Regional District","Thompson--Okanagan",{"$nulls":7},"",{"$nulls":6},"","",null,"",null,null,"",null,"Tranquille","N",{"v":50.720004,"d":"50.72000"},{"v":-120.520801,"d":"-120.52080"},"http://www.google.com/maps/place/50.720004,-120.520801",8379,"Rural",15,30,"No","Yes","No","No ","Tranquille","FALSE","FALSE"]
[null,8347,"Trout Lake","No","Columbia-Shuswap Regional District","Thompson--Okanagan",{"$nulls":7},"",{"$nulls":6},"","",null,"",null,null,"",null,"Trout Lake","N",{"v":50.6472,"d":"50.64720"},{"v":-117.538899,"d":"-117.53890"},"http://www.google.com/maps/place/50.6472,-117.538899",8347,"Rural",38,65,"No","Yes","No","No ","Trout Lake","FALSE","FALSE"]
[null,50653,"Tsartlip*","Yes","Capital Regional District","Vancouver Island and Coast",{"$nulls":7},"",{"$nulls":6},"","",null,0,null,null,0,null,"Tsartlip","Y",{"v":48.581272331,"d":"48.58127"},{"v":-123.467466399,"d":"-123.46747"},"http://www.google.com/maps/place/48.581272331,-123.467466399",50653,"Rural First Nations Primary Reserve",7409,3123,"Yes","No","No","No ","Tsartlip*","FALSE","FALSE"]
[null,51635,"Tsatsisnukwomi (Da'naxda'xw First Nation)*","No","Regional District of Mount Waddington","Vancouver Island and Coast",{"$nulls":7},"",{"$nulls":6},"","",null,0,null,null,0,null,"Tsatsisnukwomi (Da'naxda'xw First Nation)","Y",{"v":50.59666944,"d":"50.59667"},{"v":-126.59771111,"d":"-126.59771"},"http://www.google.com/maps/place/50.59666944,-126.59771111",51635,"Rural First Nations Primary Reserve",10,7,"No","Yes","Yes","No ","Tsatsisnukwomi (Da'naxda'xw First Nation)*","FALSE","FALSE"]
[null,50654,"Tsawout First Nation*","Yes","Capital Regional District","Vancouver Island and Coast",{"$nulls":7},"",{"$nulls":6},"","",null,0,null,null,0,null,"Tsawout First Nation","Y",{"v":48.591983,"d":"48.59198"},-123.39068,"http://www.google.com/maps/place/48.591983,-123.39068",50654,"Urban First Nations Primary Reserve",9159,3979,"Yes","No","Yes","No ","Tsawout First Nation*","FALSE","FALSE"]
[null,8089,"Tsawwassen","Yes","Metro Vancouver Regional District","Lower Mainland--Southwest",{"$nulls":7},"",{"$nulls":6},"","",null,"",null,null,"",null,"Tsawwassen","N",{"v":49.018293,"d":"49.01829"},{"v":-123.080538,"d":"-123.08054"},"http://www.google.com/maps/place/49.018293,-123.080538",8089,"Urban",8716,3354,"Yes","No","Yes","No ","Tsawwassen","FALSE","FALSE"]
[null,50577,"Tsawwassen First Nation*","Yes","Metro Vancouver Regional District","Lower Mainland--Southwest",{"$nulls":7},"",{"$nulls":6},"","",null,0,null,null,0,null,"Tsawwassen First Nation","Y",{"v":49.037882663,"d":"49.03788"},{"v":-123.097696314,"d":"-123.09770"},"http://www.google.com/maps/place/49.037882663,-123.097696314",50577,"Urban First Nations Primary Reserve",8716,3354,"Yes","No","Yes","No ","Tsawwassen First Nation*","FALSE","FALSE"]
[null,50609,"Tsay Keh Dene*","No","Peace River Regional District","Northeast",{"$nulls":7},"",{"$nulls":6},"","",null,0,null,null,0,null,"Tsay Keh Dene","Y",{"v":56.892647,"d":"56.89265"},{"v":-124.962364,"d":"-124.96236"},"http://www.google.com/maps/place/56.892647,-124.962364",50609,"Remote First Nations Primary Reserve",5,1,"No","Yes","Yes","No ","Tsay Keh Dene*","FALSE","FALSE"]
[null,50665,"Tseshaht*","Yes","Regional District of Alberni-Clayoquot","Vancouver Island and Coast",{"$nulls":7},"",{"$nulls":6},"","",null,0,null,null,0,null,"Tseshaht","Y",{"v":49.267225,"d":"49.26723"},{"v":-124.848919,"d":"-124.84892"},"http://www.google.com/maps/place/49.267225,-124.848919",50665,"Rural First Nations Primary Reserve",1870,844,"Yes","No","Yes","No ","Tseshaht*","FALSE","FALSE"]
[null,50655,"Tseycum*","Yes","Capital Regional District","Vancouver Island and Coast",{"$nulls":7},"",{"$nulls":6},"","",null,0,null,null,0,null,"Tseycum","Y",{"v":48.666039486,"d":"48.66604"},{"v":-123.451344362,"d":"-123.45134"},"http://www.google.com/maps/place/48.666039486,-123.451344362",50655,"Rural First Nations Primary Reserve",2946,1364,"Yes","No","No","No ","Tseycum*","FALSE","FALSE"]
[null,8254,"Ts'kw'aylaxw*","No","Thompson-Nicola Regional District","Thompson--Okanagan",{"$nulls":7},"",{"$nulls":6},"","",null,0,null,null,0,null,"Ts'kw'aylaxw","Y",{"v":50.8167,"d":"50.81670"},{"v":-121.666701,"d":"-121.66670"},"http://www.google.com/maps/place/50.8167,-121.666701",8254,"Rural First Nations Secondary Reserve",32,14,"No","Yes","No","No ","Ts'kw'aylaxw*","FALSE","FALSE"]
[null,50657,"T'Sou-ke First Nation*","Yes","Capital Regional District","Vancouver Island and Coast",{"$nulls":7},"",{"$nulls":6},"","",null,0,null,null,0,null,"T'Sou-ke First Nation","Y",{"v":48.384648022,"d":"48.38465"},{"v":-123.697181191,"d":"-123.69718"},"http://www.google.com/maps/place/48.384648022,-123.697181191",50657,"Rural First Nations Primary Reserve",6136,2793,"Yes","No","Yes","No ","T'Sou-ke First Nation*","FALSE","FALSE"]
[null,8637,"T'Sou-ke*","Yes","Capital Regional District","Vancouver Island and Coast",{"$nulls":7},"",{"$nulls":6},"","",null,0,null,null,0,null,"T'Sou-ke","Y",{"v":48.363364,"d":"48.36336"},-123.74757,"http://www.google.com/maps/place/48.363364,-123.74757",8637,"Rural First Nations Secondary Reserve",6136,2793,"Yes","No","No","No ","T'Sou-ke*","FALSE","FALSE"]
[null,8129,"Tulameen","No","Regional District of Okanagan-Similkameen","Thompson--Okanagan",{"$nulls":7},"",{"$nulls":6},"","",null,"",null,null,"",null,"Tulameen","N",{"v":49.5458,"d":"49.54580"},{"v":-120.7583,"d":"-120.75830"},"http://www.google.com/maps/place/49.5458,-120.7583",8129,"Rural",239,381,"No","Yes","No","No ","Tulameen","FALSE","FALSE"]
[null,8993,"Tulsequah","No","Stikine Regional District (Unincorporated)","Nechako",{"$nulls":7},"",{"$nulls":6},"","",null,"",null,null,"",null,"Tulsequah","N",{"v":58.657651,"d":"58.65765"},{"v":-133.544045,"d":"-133.54405"},"http://www.google.com/maps/place/58.657651,-133.544045",8993,"Rural",null,null,"No","No","No","No ","Tulsequah","FALSE","FALSE"]
[null,9000,"Tumbler Ridge","No","Peace River Regional District","Northeast",{"$nulls":7},"",{"$nulls":6},"","",null,"",null,null,"",null,"Tumbler Ridge","N",{"v":55.1333,"d":"55.13330"},{"v":-120.999999,"d":"-121.00000"},"http://www.google.com/maps/place/55.1333,-120.999999",9000,"Rural",1987,1565,"No","Yes","No","No ","Tumbler Ridge","FALSE","FALSE"]
[null,8206,"Tuwanek","Yes","Sunshine Coast Regional District","Lower Mainland--Southwest",{"$nulls":7},"",{"$nulls":6},"","",null,"",null,null,"",null,"Tuwanek","N",{"v":49.544235,"d":"49.54424"},{"v":-123.756808,"d":"-123.75681"},"http://www.google.com/maps/place/49.544235,-123.756808",8206,"Rural",142,143,"Yes","No","Yes","No ","Tuwanek","FALSE","FALSE"]
[null,8914,"Twidwell Bend","No","Peace River Regional District","Northeast",{"$nulls":7},"",{"$nulls":6},"","",null,"",null,null,"",null,"Twidwell Bend","N",{"v":55.615495,"d":"55.61550"},{"v":-121.571497,"d":"-121.57150"},"http://www.google.com/maps/place/55.615495,-121.571497",8914,"Rural",21,8,"No","Yes","Yes","No ","Twidwell Bend","FALSE","FALSE"]
[null,100153,"Twin Lakes","No","Regional District of Okanagan-Similkameen","Thompson--Okanagan",{"$nulls":7},"",{"$nulls":6},"","",null,"",null,null,"",null,"Twin Lakes","N",{"v":49.342021,"d":"49.34202"},{"v":-119.718643,"d":"-119.71864"},"http://www.google.com/maps/place/49.342021,-119.718643",100153,"Rural",331,201,"No","Yes","No","No ","Twin Lakes","FALSE","FALSE"]
[null,8850,"Two Mile","Yes","Regional District of Kitimat-Stikine","North Coast",{"$nulls":7},"",{"$nulls":6},"","",null,"",null,null,"",null,"Two Mile","N",{"v":55.268663,"d":"55.26866"},{"v":-127.626636,"d":"-127.62664"},"http://www.google.com/maps/place/55.268663,-127.626636",8850,"Rural",345,171,"Yes","No","Yes","No ","Two Mile","FALSE","FALSE"]
[null,50575,"Tzeachten*","Yes","Fraser Valley Regional District","Lower Mainland--Southwest",{"$nulls":7},"",{"$nulls":6},"","",null,0,null,null,0,null,"Tzeachten","Y",{"v":49.111856,"d":"49.11186"},{"v":-121.953976,"d":"-121.95398"},"http://www.google.com/maps/place/49.111856,-121.953976",50575,"Urban First Nations Primary Reserve",27513,10888,"Yes","No","Yes","No ","Tzeachten*","FALSE","FALSE"]
[null,50667,"Uchucklesaht*","No","Regional District of Alberni-Clayoquot","Vancouver Island and Coast",{"$nulls":7},"",{"$nulls":6},"","",null,0,null,null,0,null,"Uchucklesaht","Y",{"v":49.024,"d":"49.02400"},{"v":-125.04,"d":"-125.04000"},"http://www.google.com/maps/place/49.024,-125.04",50667,"Rural First Nations Primary Reserve",10,49,"No","Yes","Yes","No ","Uchucklesaht*","FALSE","FALSE"]
[null,8600,"Ucluelet","Yes","Regional District of Alberni-Clayoquot","Vancouver Island and Coast",{"$nulls":7},"",{"$nulls":6},"","",null,"",null,null,"",null,"Ucluelet","N",{"v":48.939959,"d":"48.93996"},{"v":-125.544843,"d":"-125.54484"},"http://www.google.com/maps/place/48.939959,-125.544843",8600,"Rural",1071,540,"Yes","No","Yes","No ","Ucluelet","FALSE","FALSE"]
[null,50668,"Ucluelet First Nation*","Yes","Regional District of Alberni-Clayoquot","Vancouver Island and Coast",{"$nulls":7},"",{"$nulls":6},"","",null,0,null,null,0,null,"Ucluelet First Nation","Y",{"v":48.936417171,"d":"48.93642"},{"v":-125.52596562,"d":"-125.52597"},"http://www.google.com/maps/place/48.936417171,-125.52596562",50668,"Rural First Nations Primary Reserve",1075,474,"Yes","No","Yes","No ","Ucluelet First Nation*","FALSE","FALSE"]
[null,8599,"Ucluelet*","Yes","Regional District of Alberni-Clayoquot","Vancouver Island and Coast",{"$nulls":7},"",{"$nulls":6},"","",null,0,null,null,0,null,"Ucluelet","Y",{"v":48.979354,"d":"48.97935"},{"v":-125.575967,"d":"-125.57597"},"http://www.google.com/maps/place/48.979354,-125.575967",8599,"Rural First Nations Secondary Reserve",124,62,"Yes","No","Yes","No ","Ucluelet*","FALSE","FALSE"]
[null,8518,"Ulkatcho*","No","Cariboo Regional District","Cariboo",{"$nulls":7},"",{"$nulls":6},"","",null,0,null,null,0,null,"Ulkatcho","Y",{"v":52.293673,"d":"52.29367"},{"v":-125.114376,"d":"-125.11438"},"http://www.google.com/maps/place/52.293673,-125.114376",8518,"Rural First Nations Secondary Reserve",11,5,"No","Yes","No","No ","Ulkatcho*","FALSE","FALSE"]
[null,8519,"Ulkatcho*","No","Cariboo Regional District","Cariboo",{"$nulls":7},"",{"$nulls":6},"","",null,0,null,null,0,null,"Ulkatcho","Y",{"v":52.359753,"d":"52.35975"},{"v":-125.157296,"d":"-125.15730"},"http://www.google.com/maps/place/52.359753,-125.157296",8519,"Rural First Nations Secondary Reserve",52,53,"No","No","No","No ","Ulkatcho*","FALSE","FALSE"]
[null,50722,"Ulkatcho*","No","Cariboo Regional District","Cariboo",{"$nulls":7},"",{"$nulls":6},"","",null,0,null,null,0,null,"Ulkatcho","Y",{"v":52.467285947,"d":"52.46729"},{"v":-125.306675676,"d":"-125.30668"},"http://www.google.com/maps/place/52.467285947,-125.306675676",50722,"Rural First Nations Primary Reserve",359,203,"No","Yes","Yes","No ","Ulkatcho*","FALSE","FALSE"]
[null,50588,"Union Bar First Nation*","Yes","Fraser Valley Regional District","Lower Mainland--Southwest",{"$nulls":7},"",{"$nulls":6},"","",null,0,null,null,0,null,"Union Bar First Nation","Y",{"v":49.435226,"d":"49.43523"},{"v":-121.438138,"d":"-121.43814"},"http://www.google.com/maps/place/49.435226,-121.438138",50588,"Rural First Nations Primary Reserve",49,35,"Yes","No","Yes","No ","Union Bar First Nation*","FALSE","FALSE"]
[null,8727,"Union Bay","Yes","Comox Valley Regional District","Vancouver Island and Coast",{"$nulls":7},"",{"$nulls":6},"","",null,"",null,null,"",null,"Union Bay","N",{"v":49.580206,"d":"49.58021"},{"v":-124.885176,"d":"-124.88518"},"http://www.google.com/maps/place/49.580206,-124.885176",8727,"Rural",612,326,"Yes","No","No","No ","Union Bay","FALSE","FALSE"]
[null,8103,"University Hill","Yes","Metro Vancouver Regional District","Lower Mainland--Southwest",{"$nulls":7},"",{"$nulls":6},"","",null,"",null,null,"",null,"University Hill","N",{"v":49.266888,"d":"49.26689"},{"v":-123.241849,"d":"-123.24185"},"http://www.google.com/maps/place/49.266888,-123.241849",8103,"Urban",21753,10785,"Yes","No","Yes","No ","University Hill","FALSE","FALSE"]
[null,100143,"Upper Donald","No","Columbia-Shuswap Regional District","Thompson--Okanagan",{"$nulls":7},"",{"$nulls":6},"","",null,"",null,null,"",null,"Upper Donald","N",{"v":51.33664627,"d":"51.33665"},{"v":-116.95582257,"d":"-116.95582"},"http://www.google.com/maps/place/51.33664627,-116.95582257",100143,"Rural",1262,624,"No","Yes","No","No ","Upper Donald","FALSE","FALSE"]
[null,8418,"Upper Fraser","No","Regional District of Fraser-Fort George","Cariboo",{"$nulls":7},"",{"$nulls":6},"","",null,"",null,null,"",null,"Upper Fraser","N",{"v":54.108237,"d":"54.10824"},{"v":-121.930563,"d":"-121.93056"},"http://www.google.com/maps/place/54.108237,-121.930563",8418,"Rural",1,0,"No","Yes","Yes","No ","Upper Fraser","FALSE","FALSE"]
[null,8959,"Upper Halfway","No","Peace River Regional District","Northeast",{"$nulls":7},"",{"$nulls":6},"","",null,"",null,null,"",null,"Upper Halfway","N",{"v":56.517639,"d":"56.51764"},{"v":-122.225726,"d":"-122.22573"},"http://www.google.com/maps/place/56.517639,-122.225726",8959,"Rural",2,1,"No","Yes","No","No ","Upper Halfway","FALSE","FALSE"]
[null,8255,"Upper Hat Creek 1 (Bonaparte)*","No","Thompson-Nicola Regional District","Thompson--Okanagan",{"$nulls":7},"",{"$nulls":6},"","",null,0,null,null,0,null,"Upper Hat Creek 1 (Bonaparte)","Y",{"v":50.8167,"d":"50.81670"},{"v":-121.5833,"d":"-121.58330"},"http://www.google.com/maps/place/50.8167,-121.5833",8255,"Rural First Nations Secondary Reserve",23,12,"No","Yes","No","No ","Upper Hat Creek 1 (Bonaparte)*","FALSE","FALSE"]
[null,8281,"Upper Nicola*","No","Thompson-Nicola Regional District","Thompson--Okanagan",{"$nulls":7},"",{"$nulls":6},"","",null,0,null,null,0,null,"Upper Nicola","Y",50.21971,{"v":-120.462118,"d":"-120.46212"},"http://www.google.com/maps/place/50.21971,-120.462118",8281,"Rural First Nations Secondary Reserve",112,56,"No","Yes","No","No ","Upper Nicola*","FALSE","FALSE"]
[null,50697,"Upper Nicola*","No","Thompson-Nicola Regional District","Thompson--Okanagan",{"$nulls":7},"",{"$nulls":6},"","",null,0,null,null,0,null,"Upper Nicola","Y",{"v":50.141989451,"d":"50.14199"},{"v":-120.28242517,"d":"-120.28243"},"http://www.google.com/maps/place/50.141989451,-120.28242517",50697,"Rural First Nations Primary Reserve",126,65,"No","Yes","Yes","No ","Upper Nicola*","FALSE","FALSE"]
[null,50599,"Upper Similkameen*","No","Regional District of Okanagan-Similkameen","Thompson--Okanagan",{"$nulls":7},"",{"$nulls":6},"","",null,0,null,null,0,null,"Upper Similkameen","Y",{"v":49.355863031,"d":"49.35586"},{"v":-120.078733533,"d":"-120.07873"},"http://www.google.com/maps/place/49.355863031,-120.078733533",50599,"Rural First Nations Primary Reserve",240,164,"No","Yes","No","No ","Upper Similkameen*","FALSE","FALSE"]
[null,8862,"Usk","No","Regional District of Kitimat-Stikine","North Coast",{"$nulls":7},"",{"$nulls":6},"","",null,"",null,null,"",null,"Usk","N",{"v":54.6333,"d":"54.63330"},{"v":-128.4167,"d":"-128.41670"},"http://www.google.com/maps/place/54.6333,-128.4167",8862,"Rural",433,156,"No","Yes","Yes","No ","Usk","FALSE","FALSE"]
[null,8407,"Valemount","No","Regional District of Fraser-Fort George","Cariboo",{"$nulls":7},"",{"$nulls":6},"","",null,"",null,null,"",null,"Valemount","N",{"v":52.830511,"d":"52.83051"},{"v":-119.265048,"d":"-119.26505"},"http://www.google.com/maps/place/52.830511,-119.265048",8407,"Rural",758,427,"No","Yes","No","No ","Valemount","FALSE","FALSE"]
[null,8372,"Valleyview","Yes","Thompson-Nicola Regional District","Thompson--Okanagan",{"$nulls":7},"",{"$nulls":6},"","",null,"",null,null,"",null,"Valleyview","N",{"v":50.673821,"d":"50.67382"},{"v":-120.249667,"d":"-120.24967"},"http://www.google.com/maps/place/50.673821,-120.249667",8372,"Urban",7330,3074,"Yes","No","No","No ","Valleyview","FALSE","FALSE"]
[null,100121,"Vallican","No","Regional District of Central Kootenay","Kootenay",{"$nulls":7},"",{"$nulls":6},"","",null,"",null,null,"",null,"Vallican","N",{"v":49.566667,"d":"49.56667"},{"v":-117.65,"d":"-117.65000"},"http://www.google.com/maps/place/49.566667,-117.65",100121,"Rural",119,65,"No","Yes","No","No ","Vallican","FALSE","FALSE"]
[null,8196,{"$f":"HYPERLINK(AG1185,AP1185)","v":"Van Anda"},"No","qathet Regional District","Vancouver Island and Coast",{"$nulls":7},{"$f":"IF(COUNT(V1185)=0, \"\", IF(V1185>=0,\"Sufficient Capacity\", IF(V1185<0,\"Not Enough Capacity\")))","v":""},{"$nulls":6},{"$f":"IF(OR(ISBLANK(H1185),ISBLANK(I1185),ISBLANK(J1185)), \"\",(H1185*I1185/J1185))","v":""},{"$f":"IF(AND(COUNT(L1185,U1185)=2, OR($M$10=\"Last-Mile\", $M$10=\"Transport & Last-Mile\")), L1185-U1185, \"\")","v":""},null,{"$f":"IF(AD1185=\"Y\",COUNT(H1185), \"\")","v":""},null,null,{"$f":"IF(AD1185=\"Y\",COUNT(P1185), \"\")","v":""},null,"Van Anda","N",{"v":49.7583,"d":"49.75830"},{"v":-124.550001,"d":"-124.55000"},"http://www.google.com/maps/place/49.7583,-124.550001",8196,"Rural",322,220,"No","Yes","Yes","No ",{"$f":"IF(AD1185=\"Y\", CONCATENATE(AC1185,\"*\"), AC1185)","v":"Van Anda"},{"$f":"IF(G1185=\"Last-Mile\",\"TRUE\",IF(G1185=\"Transport & Last-Mile\",\"TRUE\",\"FALSE\"))","v":"FALSE"},{"$f":"IF(G1185=\"Transport\",\"TRUE\",IF(G1185=\"Transport & Last-Mile\",\"TRUE\",\"FALSE\"))","v":"FALSE"}]
[null,8104,"Vancouver","Yes","Metro Vancouver Regional District","Lower Mainland--Southwest",{"$nulls":7},"",{"$nulls":6},"","",null,"",null,null,"",null,"Vancouver","N",{"v":49.244798,"d":"49.24480"},{"v":-123.115387,"d":"-123.11539"},"http://www.google.com/maps/place/49.244798,-123.115387",8104,"Urban",103965,41470,"Yes","No","Yes","No ","Vancouver","FALSE","FALSE"]
[null,8775,"Vanderhoof","No","Bulkley Nechako Regional District","Nechako",{"$nulls":7},"",{"$nulls":6},"","",null,"",null,null,"",null,"Vanderhoof","N",54.01747,-124.00228,"http://www.google.com/maps/place/54.01747,-124.00228",8775,"Rural",3928,1627,"No","Yes","Yes","No ","Vanderhoof","FALSE","FALSE"]
[null,8400,"Vavenby","No","Thompson-Nicola Regional District","Thompson--Okanagan",{"$nulls":7},"",{"$nulls":6},"","",null,"",null,null,"",null,"Vavenby","N",{"v":51.585763,"d":"51.58576"},{"v":-119.726132,"d":"-119.72613"},"http://www.google.com/maps/place/51.585763,-119.726132",8400,"Rural",270,136,"No","Yes","No","No ","Vavenby","FALSE","FALSE"]
[null,8062,"Vedder Crossing","Yes","Fraser Valley Regional District","Lower Mainland--Southwest",{"$nulls":7},"",{"$nulls":6},"","",null,"",null,null,"",null,"Vedder Crossing","N",{"v":49.106244,"d":"49.10624"},{"v":-121.970806,"d":"-121.97081"},"http://www.google.com/maps/place/49.106244,-121.970806",8062,"Urban",27513,10888,"Yes","No","No","No ","Vedder Crossing","FALSE","FALSE"]
[null,9048,"Vermilion Crossing","No","Regional District of East Kootenay","Kootenay",{"$nulls":7},"",{"$nulls":6},"","",null,"",null,null,"",null,"Vermilion Crossing","N",{"v":51.0333,"d":"51.03330"},{"v":-115.983301,"d":"-115.98330"},"http://www.google.com/maps/place/51.0333,-115.983301",9048,"Rural",null,null,"No","No","Yes","No ","Vermilion Crossing","FALSE","FALSE"]
[null,8584,"Vernon","No","Regional District of Mount Waddington","Vancouver Island and Coast",{"$nulls":7},"",{"$nulls":6},"","",null,"",null,null,"",null,"Vernon","N",{"v":50.033301,"d":"50.03330"},{"v":-126.35,"d":"-126.35000"},"http://www.google.com/maps/place/50.033301,-126.35",8584,"Rural",null,null,"No","No","No","No ","Vernon","FALSE","FALSE"]
[null,8282,"Vernon","Yes","Regional District of North Okanagan","Thompson--Okanagan",{"$nulls":7},"",{"$nulls":6},"","",null,"",null,null,"",null,"Vernon","N",{"v":50.264224,"d":"50.26422"},{"v":-119.268887,"d":"-119.26889"},"http://www.google.com/maps/place/50.264224,-119.268887",8282,"Urban",25595,12000,"Yes","No","Yes","No ","Vernon","FALSE","FALSE"]
[null,8647,"Victoria","Yes","Capital Regional District","Vancouver Island and Coast",{"$nulls":7},"",{"$nulls":6},"","",null,"",null,null,"",null,"Victoria","N",{"v":48.433439,"d":"48.43344"},{"v":-123.361707,"d":"-123.36171"},"http://www.google.com/maps/place/48.433439,-123.361707",8647,"Urban",56294,33846,"Yes","No","No","No ","Victoria","FALSE","FALSE"]
[null,8498,"Vidette","No","Thompson-Nicola Regional District","Thompson--Okanagan",{"$nulls":7},"",{"$nulls":6},"","",null,"",null,null,"",null,"Vidette","N",{"v":51.166699,"d":"51.16670"},{"v":-120.900001,"d":"-120.90000"},"http://www.google.com/maps/place/51.166699,-120.900001",8498,"Rural",0,0,"No","Yes","No","No ","Vidette","FALSE","FALSE"]
[null,8648,"View Royal","Yes","Capital Regional District","Vancouver Island and Coast",{"$nulls":7},"",{"$nulls":6},"","",null,"",null,null,"",null,"View Royal","N",{"v":48.458299,"d":"48.45830"},{"v":-123.45,"d":"-123.45000"},"http://www.google.com/maps/place/48.458299,-123.45",8648,"Urban",25303,10309,"Yes","No","Yes","No ","View Royal","FALSE","FALSE"]
[null,9013,"Village of Queen Charlotte","No","North Coast Regional District","North Coast",{"$nulls":7},"",{"$nulls":6},"","",null,"",null,null,"",null,"Village of Queen Charlotte","N",{"v":53.256464,"d":"53.25646"},{"v":-132.094015,"d":"-132.09402"},"http://www.google.com/maps/place/53.256464,-132.094015",9013,"Rural",680,396,"No","Yes","Yes","No ","Village of Queen Charlotte","FALSE","FALSE"]
[null,8913,"Wabi Hill","No","Peace River Regional District","Northeast",{"$nulls":7},"",{"$nulls":6},"","",null,"",null,null,"",null,"Wabi Hill","N",55.67069,{"v":-121.532394,"d":"-121.53239"},"http://www.google.com/maps/place/55.67069,-121.532394",8913,"Rural",345,128,"No","Yes","No","No ","Wabi Hill","FALSE","FALSE"]
[null,8540,"Wadhams","No","Central Coast Regional District","Vancouver Island and Coast",{"$nulls":7},"",{"$nulls":6},"","",null,"",null,null,"",null,"Wadhams","N",51.51713,{"v":-127.519258,"d":"-127.51926"},"http://www.google.com/maps/place/51.51713,-127.519258",8540,"Rural",1,1,"No","Yes","Yes","No ","Wadhams","FALSE","FALSE"]
[null,8269,"Walhachin","No","Thompson-Nicola Regional District","Thompson--Okanagan",{"$nulls":7},"",{"$nulls":6},"","",null,"",null,null,"",null,"Walhachin","N",50.75145,{"v":-120.990691,"d":"-120.99069"},"http://www.google.com/maps/place/50.75145,-120.990691",8269,"Rural",396,235,"No","Yes","Yes","No ","Walhachin","FALSE","FALSE"]
[null,100115,"Walkers","No","Regional District of Central Kootenay","Kootenay",{"$nulls":7},"",{"$nulls":6},"","",null,"",null,null,"",null,"Walkers","N",{"v":49.70837778,"d":"49.70838"},{"v":-116.86431389,"d":"-116.86431"},"http://www.google.com/maps/place/49.70837778,-116.86431389",100115,"Rural",294,207,"No","Yes","Yes","No ","Walkers","FALSE","FALSE"]
[null,8084,"Walnut Grove","Yes","Metro Vancouver Regional District","Lower Mainland--Southwest",{"$nulls":7},"",{"$nulls":6},"","",null,"",null,null,"",null,"Walnut Grove","N",{"v":49.180555,"d":"49.18056"},{"v":-122.648192,"d":"-122.64819"},"http://www.google.com/maps/place/49.180555,-122.648192",8084,"Rural",30091,10896,"Yes","No","Yes","No ","Walnut Grove","FALSE","FALSE"]
[null,7931,"Wardner","No","Regional District of East Kootenay","Kootenay",{"$nulls":7},"",{"$nulls":6},"","",null,"",null,null,"",null,"Wardner","N",{"v":49.416999,"d":"49.41700"},{"v":-115.428955,"d":"-115.42896"},"http://www.google.com/maps/place/49.416999,-115.428955",7931,"Rural",99,66,"No","Yes","Yes","No ","Wardner","FALSE","FALSE"]
[null,7966,"Warfield","Yes","Regional District of Kootenay Boundary","Kootenay",{"$nulls":7},"",{"$nulls":6},"","",null,"",null,null,"",null,"Warfield","N",{"v":49.094466,"d":"49.09447"},{"v":-117.748631,"d":"-117.74863"},"http://www.google.com/maps/place/49.094466,-117.748631",7966,"Rural",3500,1853,"Yes","No","No","No ","Warfield","FALSE","FALSE"]
[null,8009,"Wasa","Yes","Regional District of East Kootenay","Kootenay",{"$nulls":7},"",{"$nulls":6},"","",null,"",null,null,"",null,"Wasa","N",{"v":49.7833,"d":"49.78330"},{"v":-115.733301,"d":"-115.73330"},"http://www.google.com/maps/place/49.7833,-115.733301",8009,"Rural",307,360,"Yes","No","No","No ","Wasa","FALSE","FALSE"]
[null,8884,"Weewanie","No","Regional District of Kitimat-Stikine","North Coast",{"$nulls":7},"",{"$nulls":6},"","",null,"",null,null,"",null,"Weewanie","N",{"v":53.691666,"d":"53.69167"},{"v":-128.790277,"d":"-128.79028"},"http://www.google.com/maps/place/53.691666,-128.790277",8884,"Rural",null,null,"No","No","Yes","No ","Weewanie","FALSE","FALSE"]
[null,8186,"Welcome Beach","Yes","Sunshine Coast Regional District","Lower Mainland--Southwest",{"$nulls":7},"",{"$nulls":6},"","",null,"",null,null,"",null,"Welcome Beach","N",{"v":49.480507,"d":"49.48051"},{"v":-123.891579,"d":"-123.89158"},"http://www.google.com/maps/place/49.480507,-123.891579",8186,"Rural",1276,626,"Yes","No","Yes","No ","Welcome Beach","FALSE","FALSE"]
[null,8445,"Wells","No","Cariboo Regional District","Cariboo",{"$nulls":7},"",{"$nulls":6},"","",null,"",null,null,"",null,"Wells","N",{"v":53.104141,"d":"53.10414"},{"v":-121.570533,"d":"-121.57053"},"http://www.google.com/maps/place/53.104141,-121.570533",8445,"Rural",142,101,"No","Yes","No","No ","Wells","FALSE","FALSE"]
[null,8830,"Weneez","No","Bulkley Nechako Regional District","Nechako",{"$nulls":7},"",{"$nulls":6},"","",null,"",null,null,"",null,"Weneez","N",{"v":53.967698,"d":"53.96770"},{"v":-123.980428,"d":"-123.98043"},"http://www.google.com/maps/place/53.967698,-123.980428",8830,"Rural",328,138,"No","Yes","Yes","No ","Weneez","FALSE","FALSE"]
[null,100110,"West Creston","No","Regional District of Central Kootenay","Kootenay",{"$nulls":7},"",{"$nulls":6},"","",null,"",null,null,"",null,"West Creston","N",{"v":49.09008333,"d":"49.09008"},{"v":-116.6196167,"d":"-116.61962"},"http://www.google.com/maps/place/49.09008333,-116.6196167",100110,"Rural",378,176,"No","Yes","Yes","No ","West Creston","FALSE","FALSE"]
[null,50545,"West Moberly First Nations*","No","Peace River Regional District","Northeast",{"$nulls":7},"",{"$nulls":6},"","",null,0,null,null,0,null,"West Moberly First Nations","Y",{"v":55.82791187,"d":"55.82791"},{"v":-121.852487973,"d":"-121.85249"},"http://www.google.com/maps/place/55.82791187,-121.852487973",50545,"Rural First Nations Primary Reserve",160,65,"No","Yes","Yes","No ","West Moberly First Nations*","FALSE","FALSE"]
[null,8054,"West Popkum","Yes","Fraser Valley Regional District","Lower Mainland--Southwest",{"$nulls":7},"",{"$nulls":6},"","",null,"",null,null,"",null,"West Popkum","N",{"v":49.182155,"d":"49.18216"},{"v":-121.772678,"d":"-121.77268"},"http://www.google.com/maps/place/49.182155,-121.772678",8054,"Rural",2923,1074,"Yes","No","Yes","No ","West Popkum","FALSE","FALSE"]
[null,8137,"Westbank","Yes","Regional District of Central Okanagan","Thompson--Okanagan",{"$nulls":7},"",{"$nulls":6},"","",null,"",null,null,"",null,"Westbank","N",{"v":49.828564,"d":"49.82856"},{"v":-119.631383,"d":"-119.63138"},"http://www.google.com/maps/place/49.828564,-119.631383",8137,"Urban",20108,8809,"Yes","No","No","No ","Westbank","FALSE","FALSE"]
[null,50601,"Westbank First Nation*","Yes","Regional District of Central Okanagan","Thompson--Okanagan",{"$nulls":7},"",{"$nulls":6},"","",null,0,null,null,0,null,"Westbank First Nation","Y",{"v":49.834470504,"d":"49.83447"},{"v":-119.615793433,"d":"-119.61579"},"http://www.google.com/maps/place/49.834470504,-119.615793433",50601,"Urban First Nations Primary Reserve",20108,8809,"Yes","No","Yes","No ","Westbank First Nation*","FALSE","FALSE"]
[null,9024,"Westbridge","No","Regional District of Kootenay Boundary","Kootenay",{"$nulls":7},"",{"$nulls":6},"","",null,"",null,null,"",null,"Westbridge","N",{"v":49.171453,"d":"49.17145"},{"v":-118.975308,"d":"-118.97531"},"http://www.google.com/maps/place/49.171453,-118.975308",9024,"Rural",51,33,"No","Yes","Yes","No ","Westbridge","FALSE","FALSE"]
[null,100353,"Westham Island","Yes","Metro Vancouver Regional District","Lower Mainland--Southwest",{"$nulls":7},"",{"$nulls":6},"","",null,"",null,null,"",null,"Westham Island","N",49.09045,{"v":-123.16043056,"d":"-123.16043"},"http://www.google.com/maps/place/49.09045,-123.16043056",100353,"Rural",4068,2049,"Yes","No","Yes","No ","Westham Island","FALSE","FALSE"]
[null,8616,"Westholme","Yes","Cowichan Valley Regional District","Vancouver Island and Coast",{"$nulls":7},"",{"$nulls":6},"","",null,"",null,null,"",null,"Westholme","N",{"v":48.866701,"d":"48.86670"},{"v":-123.7,"d":"-123.70000"},"http://www.google.com/maps/place/48.866701,-123.7",8616,"Rural",712,273,"Yes","No","Yes","No ","Westholme","FALSE","FALSE"]
[null,8124,"Westmount","Yes","Metro Vancouver Regional District","Lower Mainland--Southwest",{"$nulls":7},"",{"$nulls":6},"","",null,"",null,null,"",null,"Westmount","N",{"v":49.343925,"d":"49.34393"},{"v":-123.209153,"d":"-123.20915"},"http://www.google.com/maps/place/49.343925,-123.209153",8124,"Urban",5883,2191,"Yes","No","Yes","No ","Westmount","FALSE","FALSE"]
[null,8135,"Westside*","Yes","Regional District of Central Okanagan","Thompson--Okanagan",{"$nulls":7},"",{"$nulls":6},"","",null,0,null,null,0,null,"Westside","Y",49.88223,{"v":-119.535235,"d":"-119.53524"},"http://www.google.com/maps/place/49.88223,-119.535235",8135,"Urban First Nations Secondary Reserve",11559,4591,"Yes","No","No","No ","Westside*","FALSE","FALSE"]
[null,8375,"Westsyde","Yes","Thompson-Nicola Regional District","Thompson--Okanagan",{"$nulls":7},"",{"$nulls":6},"","",null,"",null,null,"",null,"Westsyde","N",{"v":50.763669,"d":"50.76367"},-120.34848,"http://www.google.com/maps/place/50.763669,-120.34848",8375,"Urban",6479,2647,"Yes","No","Yes","No ","Westsyde","FALSE","FALSE"]
[null,8211,"Westview","Yes","qathet Regional District","Vancouver Island and Coast",{"$nulls":7},"",{"$nulls":6},"","",null,"",null,null,"",null,"Westview","N",{"v":49.836397,"d":"49.83640"},{"v":-124.524637,"d":"-124.52464"},"http://www.google.com/maps/place/49.836397,-124.524637",8211,"Rural",7874,3801,"Yes","No","Yes","No ","Westview","FALSE","FALSE"]
[null,8317,"Westwold","No","Thompson-Nicola Regional District","Thompson--Okanagan",{"$nulls":7},"",{"$nulls":6},"","",null,"",null,null,"",null,"Westwold","N",{"v":50.467906,"d":"50.46791"},-119.74665,"http://www.google.com/maps/place/50.467906,-119.74665",8317,"Rural",99,52,"No","Yes","Yes","No ","Westwold","FALSE","FALSE"]
[null,50725,"Wet'suwet'en Village (Wet'suwet'en First Nation)*","No","Bulkley Nechako Regional District","Nechako",{"$nulls":7},"",{"$nulls":6},"","",null,0,null,null,0,null,"Wet'suwet'en Village (Wet'suwet'en First Nation)","Y",{"v":54.330719398,"d":"54.33072"},{"v":-125.888229677,"d":"-125.88823"},"http://www.google.com/maps/place/54.330719398,-125.888229677",50725,"Rural First Nations Primary Reserve",192,71,"No","Yes","Yes","No ","Wet'suwet'en Village (Wet'suwet'en First Nation)*","FALSE","FALSE"]
[null,8218,"Whaletown","No","Strathcona Regional District","Vancouver Island and Coast",{"$nulls":7},"",{"$nulls":6},"","",null,"",null,null,"",null,"Whaletown","N",{"v":50.101192,"d":"50.10119"},{"v":-125.046777,"d":"-125.04678"},"http://www.google.com/maps/place/50.101192,-125.046777",8218,"Rural",321,221,"No","Yes","Yes","No ","Whaletown","FALSE","FALSE"]
[null,100147,"Whatshan Campground","No","Regional District of Central Kootenay","Kootenay",{"$nulls":7},"",{"$nulls":6},"","",null,"",null,null,"",null,"Whatshan Campground","N",49.91492,{"v":-118.118202,"d":"-118.11820"},"http://www.google.com/maps/place/49.91492,-118.118202",100147,"Rural",9,6,"No","Yes","Yes","No ","Whatshan Campground","FALSE","FALSE"]
[null,8717,"Whisky Creek","Yes","Regional District of Nanaimo","Vancouver Island and Coast",{"$nulls":7},"",{"$nulls":6},"","",null,"",null,null,"",null,"Whisky Creek","N",{"v":49.308183,"d":"49.30818"},{"v":-124.508306,"d":"-124.50831"},"http://www.google.com/maps/place/49.308183,-124.508306",8717,"Rural",1485,666,"Yes","No","Yes","No ","Whisky Creek","FALSE","FALSE"]
[null,50702,"Whispering Pines/Clinton*","No","Thompson-Nicola Regional District","Thompson--Okanagan",{"$nulls":7},"",{"$nulls":6},"","",null,0,null,null,0,null,"Whispering Pines/Clinton","Y",{"v":50.986696924,"d":"50.98670"},{"v":-120.240793348,"d":"-120.24079"},"http://www.google.com/maps/place/50.986696924,-120.240793348",50702,"Rural First Nations Primary Reserve",203,84,"No","Yes","Yes","No ","Whispering Pines/Clinton*","FALSE","FALSE"]
[null,8162,"Whistler","Yes","Squamish-Lillooet Regional District","Lower Mainland--Southwest",{"$nulls":7},"",{"$nulls":6},"","",null,"",null,null,"",null,"Whistler","N",{"v":50.121548,"d":"50.12155"},{"v":-122.962037,"d":"-122.96204"},"http://www.google.com/maps/place/50.121548,-122.962037",8162,"Rural",5742,5456,"Yes","No","No","No ","Whistler","FALSE","FALSE"]
[null,8164,"Whistler Creek","Yes","Squamish-Lillooet Regional District","Lower Mainland--Southwest",{"$nulls":7},"",{"$nulls":6},"","",null,"",null,null,"",null,"Whistler Creek","N",{"v":50.093461,"d":"50.09346"},{"v":-122.993468,"d":"-122.99347"},"http://www.google.com/maps/place/50.093461,-122.993468",8164,"Rural",5742,5456,"Yes","No","Yes","No ","Whistler Creek","FALSE","FALSE"]
[null,8363,"White Lake","No","Columbia-Shuswap Regional District","Thompson--Okanagan",{"$nulls":7},"",{"$nulls":6},"","",null,"",null,null,"",null,"White Lake","N",{"v":50.879754,"d":"50.87975"},{"v":-119.3015,"d":"-119.30150"},"http://www.google.com/maps/place/50.879754,-119.3015",8363,"Rural",567,281,"No","Yes","Yes","No ","White Lake","FALSE","FALSE"]
[null,8080,"White Rock","Yes","Metro Vancouver Regional District","Lower Mainland--Southwest",{"$nulls":7},"",{"$nulls":6},"","",null,"",null,null,"",null,"White Rock","N",{"v":49.025169,"d":"49.02517"},{"v":-122.796164,"d":"-122.79616"},"http://www.google.com/maps/place/49.025169,-122.796164",8080,"Urban",58492,27051,"Yes","No","Yes","No ","White Rock","FALSE","FALSE"]
[null,8633,"Whyac*","No","Cowichan Valley Regional District","Vancouver Island and Coast",{"$nulls":7},"",{"$nulls":6},"","",null,0,null,null,0,null,"Whyac","Y",{"v":48.669091,"d":"48.66909"},{"v":-124.846433,"d":"-124.84643"},"http://www.google.com/maps/place/48.669091,-124.846433",8633,"Rural First Nations Secondary Reserve",null,null,"No","No","Yes","No ","Whyac*","FALSE","FALSE"]
[null,8466,"Wildwood","Yes","Cariboo Regional District","Cariboo",{"$nulls":7},"",{"$nulls":6},"","",null,"",null,null,"",null,"Wildwood","N",{"v":52.213421,"d":"52.21342"},{"v":-122.088781,"d":"-122.08878"},"http://www.google.com/maps/place/52.213421,-122.088781",8466,"Rural",513,235,"Yes","No","Yes","No ","Wildwood","FALSE","FALSE"]
[null,8210,"Wildwood","Yes","qathet Regional District","Vancouver Island and Coast",{"$nulls":7},"",{"$nulls":6},"","",null,"",null,null,"",null,"Wildwood","N",{"v":49.891027,"d":"49.89103"},{"v":-124.557127,"d":"-124.55713"},"http://www.google.com/maps/place/49.891027,-124.557127",8210,"Rural",1569,743,"Yes","No","Yes","No ","Wildwood","FALSE","FALSE"]
[null,8791,"Wiley","No","Bulkley Nechako Regional District","Nechako",{"$nulls":7},"",{"$nulls":6},"","",null,"",null,null,"",null,"Wiley","N",{"v":54.515038,"d":"54.51504"},{"v":-126.333734,"d":"-126.33373"},"http://www.google.com/maps/place/54.515038,-126.333734",8791,"Rural",90,40,"No","Yes","Yes","No ","Wiley","FALSE","FALSE"]
[null,8745,"Williams Beach","No","Comox Valley Regional District","Vancouver Island and Coast",{"$nulls":7},"",{"$nulls":6},"","",null,"",null,null,"",null,"Williams Beach","N",{"v":49.833966,"d":"49.83397"},{"v":-125.060902,"d":"-125.06090"},"http://www.google.com/maps/place/49.833966,-125.060902",8745,"Rural",161,75,"No","No","Yes","No ","Williams Beach","FALSE","FALSE"]
[null,8456,"Williams Lake","Yes","Cariboo Regional District","Cariboo",{"$nulls":7},"",{"$nulls":6},"","",null,"",null,null,"",null,"Williams Lake","N",{"v":52.141472,"d":"52.14147"},{"v":-122.142883,"d":"-122.14288"},"http://www.google.com/maps/place/52.141472,-122.142883",8456,"Rural",9762,4441,"Yes","No","Yes","No ","Williams Lake","FALSE","FALSE"]
[null,8178,"Williamsons Landing","Yes","Sunshine Coast Regional District","Lower Mainland--Southwest",{"$nulls":7},"",{"$nulls":6},"","",null,"",null,null,"",null,"Williamsons Landing","N",{"v":49.449749,"d":"49.44975"},{"v":-123.468572,"d":"-123.46857"},"http://www.google.com/maps/place/49.449749,-123.468572",8178,"Rural",1388,786,"Yes","No","Yes","No ","Williamsons Landing","FALSE","FALSE"]
[null,8420,"Willow River","No","Regional District of Fraser-Fort George","Cariboo",{"$nulls":7},"",{"$nulls":6},"","",null,"",null,null,"",null,"Willow River","N",{"v":54.078726,"d":"54.07873"},{"v":-122.474372,"d":"-122.47437"},"http://www.google.com/maps/place/54.078726,-122.474372",8420,"Rural",175,96,"No","Yes","Yes","No ","Willow River","FALSE","FALSE"]
[null,8920,"Willow Valley","No","Peace River Regional District","Northeast",{"$nulls":7},"",{"$nulls":6},"","",null,"",null,null,"",null,"Willow Valley","N",{"v":55.856302,"d":"55.85630"},{"v":-120.871525,"d":"-120.87153"},"http://www.google.com/maps/place/55.856302,-120.871525",8920,"Rural",26,16,"No","Yes","Yes","No ","Willow Valley","FALSE","FALSE"]
[null,7997,"Willowbrook","No","Regional District of Okanagan-Similkameen","Thompson--Okanagan",{"$nulls":7},"",{"$nulls":6},"","",null,"",null,null,"",null,"Willowbrook","N",{"v":49.260719,"d":"49.26072"},{"v":-119.593518,"d":"-119.59352"},"http://www.google.com/maps/place/49.260719,-119.593518",7997,"Rural",240,111,"No","Yes","No","No ","Willowbrook","FALSE","FALSE"]
[null,8017,"Wilmer","Yes","Regional District of East Kootenay","Kootenay",{"$nulls":7},"",{"$nulls":6},"","",null,"",null,null,"",null,"Wilmer","N",{"v":50.542552,"d":"50.54255"},{"v":-116.063447,"d":"-116.06345"},"http://www.google.com/maps/place/50.542552,-116.063447",8017,"Rural",415,196,"Yes","No","No","No ","Wilmer","FALSE","FALSE"]
[null,8183,"Wilson Creek","Yes","Sunshine Coast Regional District","Lower Mainland--Southwest",{"$nulls":7},"",{"$nulls":6},"","",null,"",null,null,"",null,"Wilson Creek","N",{"v":49.440944,"d":"49.44094"},-123.71285,"http://www.google.com/maps/place/49.440944,-123.71285",8183,"Rural",2316,1208,"Yes","No","No","No ","Wilson Creek","FALSE","FALSE"]
[null,8287,"Wilson Landing","Yes","Regional District of Central Okanagan","Thompson--Okanagan",{"$nulls":7},"",{"$nulls":6},"","",null,"",null,null,"",null,"Wilson Landing","N",{"v":49.9821,"d":"49.98210"},{"v":-119.497268,"d":"-119.49727"},"http://www.google.com/maps/place/49.9821,-119.497268",8287,"Rural",99,102,"Yes","No","Yes","No ","Wilson Landing","FALSE","FALSE"]
[null,8014,"Windermere","Yes","Regional District of East Kootenay","Kootenay",{"$nulls":7},"",{"$nulls":6},"","",null,"",null,null,"",null,"Windermere","N",{"v":50.4667,"d":"50.46670"},{"v":-115.983299,"d":"-115.98330"},"http://www.google.com/maps/place/50.4667,-115.983299",8014,"Rural",1071,1722,"Yes","No","Yes","No ","Windermere","FALSE","FALSE"]
[null,8145,"Winfield","Yes","Regional District of Central Okanagan","Thompson--Okanagan",{"$nulls":7},"",{"$nulls":6},"","",null,"",null,null,"",null,"Winfield","N",{"v":50.033324,"d":"50.03332"},{"v":-119.401779,"d":"-119.40178"},"http://www.google.com/maps/place/50.033324,-119.401779",8145,"Rural",5290,2317,"Yes","No","Yes","No ","Winfield","FALSE","FALSE"]
[null,7958,"Winlaw","No","Regional District of Central Kootenay","Kootenay",{"$nulls":7},"",{"$nulls":6},"","",null,"",null,null,"",null,"Winlaw","N",{"v":49.614419,"d":"49.61442"},{"v":-117.549724,"d":"-117.54972"},"http://www.google.com/maps/place/49.614419,-117.549724",7958,"Rural",435,218,"No","Yes","Yes","No ","Winlaw","FALSE","FALSE"]
[null,8543,"Winter Harbour","No","Regional District of Mount Waddington","Vancouver Island and Coast",{"$nulls":7},"",{"$nulls":6},"","",null,"",null,null,"",null,"Winter Harbour","N",{"v":50.5167,"d":"50.51670"},{"v":-128.0333,"d":"-128.03330"},"http://www.google.com/maps/place/50.5167,-128.0333",8543,"Rural",15,59,"No","Yes","Yes","No ","Winter Harbour","FALSE","FALSE"]
[null,8827,"Wistaria","No","Bulkley Nechako Regional District","Nechako",{"$nulls":7},"",{"$nulls":6},"","",null,"",null,null,"",null,"Wistaria","N",53.84745,{"v":-126.280082,"d":"-126.28008"},"http://www.google.com/maps/place/53.84745,-126.280082",8827,"Rural",4,4,"No","Yes","Yes","No ","Wistaria","FALSE","FALSE"]
[null,8956,{"$f":"HYPERLINK(AG1249,AP1249)","v":"Wonowon"},"No","Peace River Regional District","Northeast",{"$nulls":7},{"$f":"IF(COUNT(V1249)=0, \"\", IF(V1249>=0,\"Sufficient Capacity\", IF(V1249<0,\"Not Enough Capacity\")))","v":""},{"$nulls":6},{"$f":"IF(OR(ISBLANK(H1249),ISBLANK(I1249),ISBLANK(J1249)), \"\",(H1249*I1249/J1249))","v":""},{"$f":"IF(AND(COUNT(L1249,U1249)=2, OR($M$10=\"Last-Mile\", $M$10=\"Transport & Last-Mile\")), L1249-U1249, \"\")","v":""},null,{"$f":"IF(AD1249=\"Y\",COUNT(H1249), \"\")","v":""},null,null,{"$f":"IF(AD1249=\"Y\",COUNT(P1249), \"\")","v":""},null,"Wonowon","N",{"v":56.728834,"d":"56.72883"},{"v":-121.814153,"d":"-121.81415"},"http://www.google.com/maps/place/56.728834,-121.814153",8956,"Rural",240,32,"No","Yes","Yes","No ",{"$f":"IF(AD1249=\"Y\", CONCATENATE(AC1249,\"*\"), AC1249)","v":"Wonowon"},{"$f":"IF(G1249=\"Last-Mile\",\"TRUE\",IF(G1249=\"Transport & Last-Mile\",\"TRUE\",\"FALSE\"))","v":"FALSE"},{"$f":"IF(G1249=\"Transport\",\"TRUE\",IF(G1249=\"Transport & Last-Mile\",\"TRUE\",\"FALSE\"))","v":"FALSE"}]
[null,100114,"Woodbury Creek","No","Regional District of Central Kootenay","Kootenay",{"$nulls":7},"",{"$nulls":6},"","",null,"",null,null,"",null,"Woodbury Creek","N",{"v":49.7751128,"d":"49.77511"},{"v":-116.9059346,"d":"-116.90593"},"http://www.google.com/maps/place/49.7751128,-116.9059346",100114,"Rural",50,38,"No","Yes","Yes","No ","Woodbury Creek","FALSE","FALSE"]
[null,8859,"Woodcock","No","Regional District of Kitimat-Stikine","North Coast",{"$nulls":7},"",{"$nulls":6},"","",null,"",null,null,"",null,"Woodcock","N",{"v":55.0667,"d":"55.06670"},{"v":-128.233301,"d":"-128.23330"},"http://www.google.com/maps/place/55.0667,-128.233301",8859,"Rural",5,3,"No","Yes","Yes","No ","Woodcock","FALSE","FALSE"]
[null,8146,"Woodsdale","Yes","Regional District of Central Okanagan","Thompson--Okanagan",{"$nulls":7},"",{"$nulls":6},"","",null,"",null,null,"",null,"Woodsdale","N",{"v":50.049457,"d":"50.04946"},{"v":-119.389763,"d":"-119.38976"},"http://www.google.com/maps/place/50.049457,-119.389763",8146,"Rural",3032,1407,"Yes","No","Yes","No ","Woodsdale","FALSE","FALSE"]
[null,8566,"Woss","No","Regional District of Mount Waddington","Vancouver Island and Coast",{"$nulls":7},"",{"$nulls":6},"","",null,"",null,null,"",null,"Woss","N",{"v":50.2167,"d":"50.21670"},{"v":-126.6,"d":"-126.60000"},"http://www.google.com/maps/place/50.2167,-126.6",8566,"Rural",189,144,"No","Yes","Yes","No ","Woss","FALSE","FALSE"]
[null,8005,"Wycliffe","No","Regional District of East Kootenay","Kootenay",{"$nulls":7},"",{"$nulls":6},"","",null,"",null,null,"",null,"Wycliffe","N",{"v":49.601326,"d":"49.60133"},{"v":-115.860707,"d":"-115.86071"},"http://www.google.com/maps/place/49.601326,-115.860707",8005,"Rural",396,158,"No","No","Yes","No ","Wycliffe","FALSE","FALSE"]
[null,7944,"Wynndel","No","Regional District of Central Kootenay","Kootenay",{"$nulls":7},"",{"$nulls":6},"","",null,"",null,null,"",null,"Wynndel","N",{"v":49.18,"d":"49.18000"},{"v":-116.5525,"d":"-116.55250"},"http://www.google.com/maps/place/49.18,-116.5525",7944,"Rural",559,265,"No","No","Yes","No ","Wynndel","FALSE","FALSE"]
[null,50592,"Xaxli'p*","No","Squamish-Lillooet Regional District","Lower Mainland--Southwest",{"$nulls":7},"",{"$nulls":6},"","",null,0,null,null,0,null,"Xaxli'p","Y",{"v":50.734625224,"d":"50.73463"},{"v":-121.864423819,"d":"-121.86442"},"http://www.google.com/maps/place/50.734625224,-121.864423819",50592,"Rural First Nations Primary Reserve",107,51,"No","Yes","Yes","No ","Xaxli'p*","FALSE","FALSE"]
[null,50714,"Xeni Gwet'in First Nations Government*","No","Cariboo Regional District","Cariboo",{"$nulls":7},"",{"$nulls":6},"","",null,0,null,null,0,null,"Xeni Gwet'in First Nations Government","Y",{"v":51.415370332,"d":"51.41537"},{"v":-124.09563063,"d":"-124.09563"},"http://www.google.com/maps/place/51.415370332,-124.09563063",50714,"Rural First Nations Primary Reserve",50,23,"No","Yes","Yes","No ","Xeni Gwet'in First Nations Government*","FALSE","FALSE"]
[null,8774,"Xeni Gwet'in*","No","Cariboo Regional District","Cariboo",{"$nulls":7},"",{"$nulls":6},"","",null,0,null,null,0,null,"Xeni Gwet'in","Y",{"v":51.468738,"d":"51.46874"},{"v":-123.936047,"d":"-123.93605"},"http://www.google.com/maps/place/51.468738,-123.936047",8774,"Rural First Nations Secondary Reserve",67,30,"No","Yes","Yes","No ","Xeni Gwet'in*","FALSE","FALSE"]
[null,8756,"Yaculta*","Yes","Strathcona Regional District","Vancouver Island and Coast",{"$nulls":7},"",{"$nulls":6},"","",null,0,null,null,0,null,"Yaculta","Y",{"v":50.021696,"d":"50.02170"},{"v":-125.194987,"d":"-125.19499"},"http://www.google.com/maps/place/50.021696,-125.194987",8756,"Rural First Nations Secondary Reserve",6241,3178,"Yes","No","Yes","No ","Yaculta*","FALSE","FALSE"]
[null,7941,"Yahk","No","Regional District of Central Kootenay","Kootenay",{"$nulls":7},"",{"$nulls":6},"","",null,"",null,null,"",null,"Yahk","N",{"v":49.085002,"d":"49.08500"},{"v":-116.081893,"d":"-116.08189"},"http://www.google.com/maps/place/49.085002,-116.081893",7941,"Rural",78,44,"No","Yes","No","No ","Yahk","FALSE","FALSE"]
[null,9002,"Yaku","No","North Coast Regional District","North Coast",{"$nulls":7},"",{"$nulls":6},"","",null,"",null,null,"",null,"Yaku","N",{"v":54.192332,"d":"54.19233"},{"v":-133.003274,"d":"-133.00327"},"http://www.google.com/maps/place/54.192332,-133.003274",9002,"Rural",5,2,"No","Yes","Yes","No ","Yaku","FALSE","FALSE"]
[null,50576,"Yakweakwioose*","Yes","Fraser Valley Regional District","Lower Mainland--Southwest",{"$nulls":7},"",{"$nulls":6},"","",null,0,null,null,0,null,"Yakweakwioose","Y",{"v":49.132615302,"d":"49.13262"},{"v":-121.938564952,"d":"-121.93856"},"http://www.google.com/maps/place/49.132615302,-121.938564952",50576,"Rural First Nations Primary Reserve",27163,12788,"Yes","No","Yes","No ","Yakweakwioose*","FALSE","FALSE"]
[null,50589,"Yale (Yale First Nation)*","No","Fraser Valley Regional District","Lower Mainland--Southwest",{"$nulls":7},"",{"$nulls":6},"","",null,0,null,null,0,null,"Yale (Yale First Nation)","Y",{"v":49.562177161,"d":"49.56218"},{"v":-121.42601193,"d":"-121.42601"},"http://www.google.com/maps/place/49.562177161,-121.42601193",50589,"Rural First Nations Primary Reserve",122,92,"No","Yes","Yes","No ","Yale (Yale First Nation)*","FALSE","FALSE"]
[null,8228,"Yale*","No","Fraser Valley Regional District","Lower Mainland--Southwest",{"$nulls":7},"",{"$nulls":6},"","",null,0,null,null,0,null,"Yale","Y",{"v":49.471157,"d":"49.47116"},{"v":-121.425282,"d":"-121.42528"},"http://www.google.com/maps/place/49.471157,-121.425282",8228,"Rural First Nations Secondary Reserve",179,103,"No","Yes","Yes","No ","Yale*","FALSE","FALSE"]
[null,8301,"Yankee Flats","No","Columbia-Shuswap Regional District","Thompson--Okanagan",{"$nulls":7},"",{"$nulls":6},"","",null,"",null,null,"",null,"Yankee Flats","N",{"v":50.516355,"d":"50.51636"},{"v":-119.375489,"d":"-119.37549"},"http://www.google.com/maps/place/50.516355,-119.375489",8301,"Rural",244,109,"No","No","Yes","No ","Yankee Flats","FALSE","FALSE"]
[null,8597,"Yarksis","Yes","Regional District of Alberni-Clayoquot","Vancouver Island and Coast",{"$nulls":7},"",{"$nulls":6},"","",null,"",null,null,"",null,"Yarksis","N",{"v":49.165362,"d":"49.16536"},-125.97055,"http://www.google.com/maps/place/49.165362,-125.97055",8597,"Rural",472,216,"Yes","No","Yes","No ","Yarksis","FALSE","FALSE"]
[null,8066,"Yarrow","Yes","Fraser Valley Regional District","Lower Mainland--Southwest",{"$nulls":7},"",{"$nulls":6},"","",null,"",null,null,"",null,"Yarrow","N",{"v":49.083299,"d":"49.08330"},{"v":-122.049999,"d":"-122.05000"},"http://www.google.com/maps/place/49.083299,-122.049999",8066,"Rural",2101,715,"Yes","No","Yes","No ","Yarrow","FALSE","FALSE"]
[null,50728,"Yekooche First Nation*","No","Bulkley Nechako Regional District","Nechako",{"$nulls":7},"",{"$nulls":6},"","",null,0,null,null,0,null,"Yekooche First Nation","Y",{"v":54.597878,"d":"54.59788"},{"v":-125.082199,"d":"-125.08220"},"http://www.google.com/maps/place/54.597878,-125.082199",50728,"Rural First Nations Primary Reserve",87,42,"No","Yes","Yes","No ","Yekooche First Nation*","FALSE","FALSE"]
[null,7954,"Ymir","No","Regional District of Central Kootenay","Kootenay",{"$nulls":7},"",{"$nulls":6},"","",null,"",null,null,"",null,"Ymir","N",{"v":49.2833,"d":"49.28330"},{"v":-117.216701,"d":"-117.21670"},"http://www.google.com/maps/place/49.2833,-117.216701",7954,"Rural",435,195,"No","Yes","Yes","No ","Ymir","FALSE","FALSE"]
[null,8610,"Youbou","Yes","Cowichan Valley Regional District","Vancouver Island and Coast",{"$nulls":7},"",{"$nulls":6},"","",null,"",null,null,"",null,"Youbou","N",{"v":48.872622,"d":"48.87262"},{"v":-124.199317,"d":"-124.19932"},"http://www.google.com/maps/place/48.872622,-124.199317",8610,"Rural",632,410,"Yes","No","Yes","No ","Youbou","FALSE","FALSE"]
[null,8559,"Yreka","No","Regional District of Mount Waddington","Vancouver Island and Coast",{"$nulls":7},"",{"$nulls":6},"","",null,"",null,null,"",null,"Yreka","N",{"v":50.463814,"d":"50.46381"},{"v":-127.558049,"d":"-127.55805"},"http://www.google.com/maps/place/50.463814,-127.558049",8559,"Rural",3,41,"No","Yes","Yes","No ","Yreka","FALSE","FALSE"]
[null,8578,"Yuquot*","No","Strathcona Regional District","Vancouver Island and Coast",{"$nulls":7},"",{"$nulls":6},"","",null,0,null,null,0,null,"Yuquot","Y",{"v":49.591767,"d":"49.59177"},{"v":-126.618654,"d":"-126.61865"},"http://www.google.com/maps/place/49.591767,-126.618654",8578,"Rural First Nations Secondary Reserve",5,2,"No","Yes","Yes","No ","Yuquot*","FALSE","FALSE"]
[null,9022,"Zamora","No","Regional District of Kootenay Boundary","Kootenay",{"$nulls":7},"",{"$nulls":6},"","",null,"",null,null,"",null,"Zamora","N",{"v":49.150001,"d":"49.15000"},{"v":-118.983299,"d":"-118.98330"},"http://www.google.com/maps/place/49.150001,-118.983299",9022,"Rural",24,15,"No","Yes","Yes","No ","Zamora","FALSE","FALSE"]
[null,8572,"Zeballos","No","Strathcona Regional District","Vancouver Island and Coast",{"$nulls":7},"",{"$nulls":6},"","",null,"",null,null,"",null,"Zeballos","N",{"v":49.987006,"d":"49.98701"},{"v":-126.847155,"d":"-126.84716"},"http://www.google.com/maps/place/49.987006,-126.847155",8572,"Rural",200,134,"No","Yes","Yes","No ","Zeballos","FALSE","FALSE"]

{"sheet":"Detailed Budget","index":2,"n_rows":155,"n_cols":9,"rows_kept":155,"merged":[[1,1,1,8],[2,1,2,7],[3,1,5,8],[6,4,6,8],[8,1,11,3],[8,5,8,8],[9,5,9,6],[12,1,14,3],[16,1,18,2],[16,5,16,7],[17,5,17,6],[18,5,18,6],[19,5,19,6],[20,5,20,6],[24,1,24,8],[26,4,26,5],[26,6,26,7],[27,1,27,2],[28,1,28,8],[29,1,29,2],[30,1,30,2],[31,1,31,2],[32,1,32,2],[33,1,33,2],[34,1,34,2],[35,1,35,2],[36,1,36,2],[37,1,37,2],[38,1,38,2],[39,1,39,8],[40,1,40,2],[41,1,41,2],[42,1,42,2],[43,1,43,2],[44,1,44,2],[45,1,45,2],[46,1,46,2],[47,1,47,2],[48,1,48,2],[49,1,49,2],[50,1,50,2],[51,1,51,2],[52,1,52,2],[53,1,53,2],[54,1,54,2],[55,1,55,2],[56,1,56,2],[57,1,57,2],[58,1,58,2],[59,1,59,2],[60,1,60,2],[61,1,61,8],[62,1,62,2],[63,1,63,2],[64,1,64,2],[65,1,65,2],[66,1,66,2],[67,1,67,2],[68,1,68,2],[69,1,69,2],[70,1,70,2],[71,1,71,2],[72,1,72,2],[73,1,73,2],[74,1,74,2],[75,1,75,2],[76,1,76,2],[77,1,77,2],[78,1,78,8],[79,1,79,2],[80,1,80,2],[81,1,81,2],[82,1,82,2],[83,1,83,2],[84,1,84,2],[85,1,85,2],[86,1,86,2],[87,1,87,2],[88,1,88,2],[89,1,89,2],[90,1,90,2],[91,1,91,2],[92,1,92,2],[93,1,93,8],[94,1,94,2],[95,1,95,2],[96,1,96,2],[97,1,97,2],[98,1,98,2],[99,1,99,2],[100,1,100,2],[101,1,101,2],[102,1,102,2],[103,1,103,8],[104,1,104,2],[105,1,105,2],[106,1,106,2],[107,1,107,2],[108,1,108,2],[109,1,109,2],[110,1,110,2],[111,1,111,2],[112,1,112,2],[113,1,113,2],[114,1,114,2],[115,1,115,2],[116,1,116,2],[117,1,117,2],[118,1,118,3],[120,4,120,5],[120,6,120,7],[121,1,121,2],[122,1,122,2],[123,1,123,2],[124,1,124,2],[125,1,125,2],[126,1,126,2],[127,1,127,2],[128,1,128,2],[129,1,129,2],[130,1,130,2],[131,1,131,2],[132,1,132,2],[133,1,133,2],[134,1,134,2],[135,1,135,2],[136,1,136,2],[137,1,137,3],[139,1,139,8],[141,2,141,3],[142,2,142,3],[143,2,143,3],[144,2,144,3],[146,2,146,4],[147,2,147,3],[147,5,147,6],[148,2,148,3],[148,6,148,7],[149,2,149,3],[150,2,150,3],[151,2,151,3],[152,2,152,3]]}
[]
[null,"Connecting British Columbia Program Phase 3"]
[null,"                                    DETAILED BUDGET",{"$nulls":6},"Published Nov 2019 – Ver. 1.1"]
[null,"Use this template to identify the proposed project costs. Refer to section 5.4 in the Connecting British Columbia Program Phase 3 Application Guide for a list of Eligible and Ineligible costs.  "]
[]
[]
[null,null,"INSTRUCTIONS",null,"SUMMARY (Auto-Populated)"]
[]
[null,"Step 1: Complete the Detailed Project Budget table below using the appropriate categories and sub-categories. Use \"other\" for items not listed.  Ensure that transport and last-mile costs are separated where applicable.  ",null,null,"Project Name:",{"$f":"IF(ISBLANK('INSTRUCTIONS - Project Info'!E27), \"Auto-Populated from the INSTRUCTIONS Sheet\", 'INSTRUCTIONS - Project Info'!E27)","v":"Auto-Populated from the INSTRUCTIONS Sheet"}]
[{"$nulls":4},"Project Type:",{"$f":"IF(ISBLANK('INSTRUCTIONS - Project Info'!E29), \"Auto-Populated from the INSTRUCTIONS Sheet\", 'INSTRUCTIONS - Project Info'!E29)","v":"Auto-Populated from the INSTRUCTIONS Sheet"}]
[]
[{"$nulls":4},"Project Budget"]
[null,"Step 2: Verify that the totals add up correctly and fill in the project funding information in the lower table.  ",{"$nulls":3},"Last-Mile","Transport","Total"]
[{"$nulls":4},"Eligible Costs",{"$f":"E143","v":0},0,0]
[{"$nulls":4},"Ineligible Costs",0,0,0]
[{"$nulls":4},"Total Costs",0,0,0]
[{"$nulls":4},"Project Funding",{"$nulls":3},"% of Eligible Costs:"]
[{"$nulls":5},"Connecting British Columbia Amount Requested",null,{"$f":"E148","v":0},{"$f":"H18/H14","v":{"$error":"#DIV/0!"}}]
[{"$nulls":5},"Applicant Contribution",null,{"$f":"E149","v":0}]
[{"$nulls":5},"Other Funding Sources",null,{"$f":"SUM(E150:E152)","v":0}]
[{"$nulls":5},"Total Funding",null,{"$f":"E153","v":0}]
[]
[{"$nulls":6},"Budget/Funding Error",{"$f":"H16-H21","v":0}]
[]
[null,"Step 1  - DETAILED BUDGET INFORMATION"]
[]
[{"$nulls":4},"Last-Mile Allocation",null,"Transport Allocation"]
[null,"Eligible Costs ",null,"Total Number of Units                           \n(if applicable)\n(please specify)","Equipment/Parts Costs","Labour Costs","Equipment/Parts Costs","Labour Costs","Total Allocation\nEligible Costs ($)\n(Auto-Populated)"]
[null,"Site Survey, Engineering and Project Management"]
[null,"Site Surveying",{"$nulls":6},{"$f":"SUM(E30:H30)","v":0}]
[null,"Engineering Design",{"$nulls":6},{"$f":"SUM(E31:H31)","v":0}]
[null,"Project Management",{"$nulls":6},0]
[null,"Pole Make Ready Costs ",{"$nulls":6},0]
[null,"Third Party Project Validation",{"$nulls":6},0]
[null,"Other (please specify)",{"$nulls":6},0]
[null,"Other (please specify)",{"$nulls":6},0]
[null,"Other (please specify)",{"$nulls":6},0]
[null,"Other (please specify)",{"$nulls":6},0]
[{"$nulls":8},0]
[null,"Networking"]
[null,"Point-to-Point Radio",{"$nulls":6},0]
[null,"Point-to-Multipoint Radio",{"$nulls":6},0]
[null,"Router",{"$nulls":6},0]
[null,"Switch",{"$nulls":6},0]
[null,"Satellite Related Equipment",{"$nulls":6},0]
[null,"DWDM",{"$nulls":6},0]
[null,"OLT",{"$nulls":6},0]
[null,"DSLAM",{"$nulls":6},0]
[null,"Cable Headend",{"$nulls":6},0]
[null,"Server (Computer)",{"$nulls":6},0]
[null,"Amplifier",{"$nulls":6},0]
[null,"OSS Software",{"$nulls":6},0]
[null,"BSS Software",{"$nulls":6},0]
[null,"Subscriber Management Software",{"$nulls":6},0]
[null,"LTE Software",{"$nulls":6},0]
[null,"Other  (please specify)",{"$nulls":6},0]
[null,"Other  (please specify)",{"$nulls":6},0]
[null,"Other  (please specify)",{"$nulls":6},0]
[null,"Other  (please specify)",{"$nulls":6},0]
[null,"Other  (please specify)",{"$nulls":6},0]
[{"$nulls":8},0]
[null,"Infrastructure"]
[null,"Fibre-optic cable for Last-Mile\n(estimate total number of units in meters)",{"$nulls":6},0]
[null,"Fibre-optic cable for Transport\n(estimate total number of units in meters)",{"$nulls":6},0]
[null,"Tower",{"$nulls":6},0]
[null,"Tower Section",{"$nulls":6},0]
[null,"Tower Strengthening Hardware",{"$nulls":6},0]
[null,"Mast",{"$nulls":6},0]
[null,"Pole",{"$nulls":6},0]
[null,"Foundations",{"$nulls":6},0]
[null,"Cabinets",{"$nulls":6},0]
[null,"Equipment Shelter",{"$nulls":6},0]
[null,"Drop Installation",{"$nulls":6},0]
[null,"Other  (please specify)",{"$nulls":6},0]
[null,"Other  (please specify)",{"$nulls":6},0]
[null,"Other  (please specify)",{"$nulls":6},0]
[null,"Other  (please specify)",{"$nulls":6},0]
[{"$nulls":8},0]
[null,"Power"]
[null,"Generator Power Equipment",{"$nulls":6},0]
[null,"Wind Power Equipment",{"$nulls":6},0]
[null,"Solar Power Equipment",{"$nulls":6},0]
[null,"UPS",{"$nulls":6},0]
[null,"Batteries",{"$nulls":6},0]
[null,"Antenna",{"$nulls":6},0]
[null,"Radome",{"$nulls":6},0]
[null,"Satellite Transponder Equipment",{"$nulls":6},0]
[null,"Other  (please specify)",{"$nulls":6},0]
[null,"Other  (please specify)",{"$nulls":6},0]
[null,"Other  (please specify)",{"$nulls":6},0]
[null,"Other  (please specify)",{"$nulls":6},0]
[null,"Other  (please specify)",{"$nulls":6},0]
[{"$nulls":8},0]
[null,"Travel"]
[null,"Flights",{"$nulls":6},0]
[null,"Vehicle rental",{"$nulls":6},0]
[null,"Accommodations",{"$nulls":6},{"$f":"SUM(E97:H97)","v":0}]
[null,"Other (please specify)",{"$nulls":6},0]
[null,"Other (please specify)",{"$nulls":6},0]
[null,"Other (please specify)",{"$nulls":6},0]
[null,"Other (please specify)",{"$nulls":6},0]
[null,"Other (please specify)",{"$nulls":6},0]
[{"$nulls":8},0]
[null,"Other Direct Costs"]
[null,"Site Preparation",{"$nulls":6},0]
[null,"Hydro Connection",{"$nulls":6},0]
[null,"Make-ready",{"$nulls":6},0]
[null,"Testing - Network elements",{"$nulls":6},0]
[null,"Testing - Power Systems ",{"$nulls":6},0]
[null,"Testing - Monitoring Systems",{"$nulls":6},0]
[null,"Software (please specify)",{"$nulls":6},0]
[null,"Flagging",{"$nulls":6},0]
[null,"Other (please specify)",{"$nulls":6},0]
[null,"Other (please specify)",{"$nulls":6},0]
[null,"Other (please specify)",{"$nulls":6},0]
[null,"Other (please specify)",{"$nulls":6},0]
[null,"Other (please specify)",{"$nulls":6},0]
[{"$nulls":8},0]
[null,"Total Eligible",null,null,{"$f":"SUM(E30:E39,E41:E61,E63:E78,E80:E93,E95:E103,E105:E118)","v":0},{"$f":"SUM(F30:F39,F41:F61,F63:F78,F80:F93,F95:F103,F105:F118)","v":0},{"$f":"SUM(G30:G39,G41:G61,G63:G78,G80:G93,G95:G103,G105:G118)","v":0},{"$f":"SUM(H30:H39,H41:H61,H63:H78,H80:H93,H95:H103,H105:H118)","v":0},{"$f":"SUM(E119:H119)","v":0}]
[]
[{"$nulls":4},"Last-Mile Allocation",null,"Transport Allocation"]
[null,"Ineligible Costs ",null,"Total Number of Units                           \n(if applicable)\n(specify units)","Equipment/Parts Costs","Labour Costs","Equipment/Parts Costs","Labour Costs","Total Allocation \nIneligible Costs ($)\n(Auto-Populated)"]
[null,"Billing Support Systems",{"$nulls":6},{"$f":"SUM(E123:H123)","v":0}]
[null,"Customer Care Systems",{"$nulls":6},{"$f":"SUM(E124:H124)","v":0}]
[null,"Licenses",{"$nulls":6},0]
[null,"General Liability Insurance",{"$nulls":6},0]
[null,"Testing – User Devices",{"$nulls":6},0]
[null,"Testing – Support Systems",{"$nulls":6},0]
[null,"CPE - Modems",{"$nulls":6},0]
[null,"CPE - Set Top Boxes",{"$nulls":6},0]
[null,"CPE - Inside Wiring",{"$nulls":6},0]
[null,"Other (please specify)",{"$nulls":6},0]
[null,"Other (please specify)",{"$nulls":6},0]
[null,"Other (please specify)",{"$nulls":6},0]
[null,"Other (please specify)",{"$nulls":6},0]
[null,"Other (please specify)",{"$nulls":6},0]
[{"$nulls":8},0]
[null,"Total Ineligible",null,null,{"$f":"SUM(E123:E137)","v":0},{"$f":"SUM(F123:F137)","v":0},0,0,{"$f":"SUM(E138:H138)","v":0}]
[]
[null,"Step 2  - SUMMARY PROJECT BUDGET"]
[]
[null,null,"Project Budget (Auto-Populated)",null,"Last-Mile","Transport","Total"]
[null,null,"Total Eligible Costs",null,{"$f":"SUM(E119:F119)","v":0},{"$f":"SUM(G119:H119)","v":0},{"$f":"DetailedTotalSum","v":0}]
[null,null,"Total Ineligible Costs",null,{"$f":"SUM(E138:F138)","v":0},{"$f":"SUM(G138:H138)","v":0},{"$f":"DetailedIneligibleTotal","v":0}]
[null,null,"Total Costs",null,{"$f":"SUM(E143:E144)","v":0},{"$f":"SUM(F143:F144)","v":0},{"$f":"SUM(G143:G144)","v":0}]
[]
[null,null,"Project Funding (Please Complete)"]
[null,"Value should not exceed\n50% of eligible costs","Connecting British Columbia Amount Requested",null,null,"  For Other Funding Sources, please identify:"]
[null,null,"Applicant Contribution",null,null,"Funding approved?","If No, enter date decision is expected:"]
[null,null,"Other Funding Sources (please specify)"]
[null,null,"Other Funding Sources (please specify)"]
[null,null,"Other Funding Sources (please specify)"]
[null,null,"Total Funding",null,{"$f":"SUM(E148:E152)","v":0}]
[]
[{"$nulls":3},"Budget/Funding Error",{"$f":"G145-E153","v":0}]

{"sheet":"Equipment Details","index":3,"n_rows":26,"n_cols":13,"rows_kept":26,"merged":[[1,1,1,8],[2,1,2,7],[3,1,4,8],[5,1,5,8],[6,2,6,5],[7,2,7,5],[8,1,8,8],[9,1,9,8]]}
[]
[null,"Connecting British Columbia Program Phase 3"]
[null,"                                  EQUIPMENT DETAILS",{"$nulls":6},"Published Nov 2019 – Ver. 1.1"]
[null,"Use this template to identify the equipment used for the proposed project.  Equipment listed should match the logical network diagram and mapping data provided with the application.   "]
[]
[]
[null,"Project Name:",{"$f":"IF(ISBLANK('INSTRUCTIONS - Project Info'!E27), \"Auto-Populated from the INSTRUCTIONS Sheet\", 'INSTRUCTIONS - Project Info'!E27)","v":"Auto-Populated from the INSTRUCTIONS Sheet"}]
[null,"Project Type:",{"$f":"IF(ISBLANK('INSTRUCTIONS - Project Info'!E29), \"Auto-Populated from the INSTRUCTIONS Sheet\", 'INSTRUCTIONS - Project Info'!E29)","v":"Auto-Populated from the INSTRUCTIONS Sheet"}]
[]
[null,"EQUIPMENT INFORMATION"]
[]
[null,"Network Identifier\n(should match with the logical network diagram and project mapping data)","Indicate Last-Mile or Transport Component\n(use drop-down)","Network Category                         \n(use drop-down)","Equipment Description","Proposed Throughput \n(Mbps)","Wireless Transmitter Frequency \n(if applicable in MHz)","Wireless Transmitter Bandwidth\n(if applicable MHz)","Licencing Status\n(use drop-down)",{"$nulls":3},"Drop-Down Lists"]
[{"$nulls":12},"Transport"]
[{"$nulls":12},"Last-Mile"]
[]
[]
[{"$nulls":12},"Fibre Optic"]
[{"$nulls":12},"Point-to-Point Wireless"]
[{"$nulls":12},"Routing and Switching"]
[{"$nulls":12},"Satellite Related"]
[{"$nulls":12},"Wireline Last-Mile"]
[]
[{"$nulls":12},"Not required"]
[{"$nulls":12},"Acquired"]
[{"$nulls":12},"Pending"]
[{"$nulls":12},"Not yet initiated"]

{"sheet":"Financial Operating Plan","index":4,"n_rows":55,"n_cols":38,"rows_kept":55,"merged":[[1,2,1,8],[2,2,2,8],[2,36,2,37],[4,2,4,10],[5,2,5,5],[7,2,7,13],[7,14,7,25],[7,26,7,37],[9,1,9,37],[14,1,14,37],[24,1,24,37]]}
[]
[null,null,"Connecting British Columbia Program Phase 3"]
[null," ","FINANCIAL OPERATING PLAN",{"$nulls":33},"Published Feb 2020 – Ver. 1.2"]
[]
[null,"Project Name:",{"$f":"IF(ISBLANK('INSTRUCTIONS - Project Info'!E27), \"Auto-Populated from the INSTRUCTIONS Sheet\", 'INSTRUCTIONS - Project Info'!E27)","v":"Auto-Populated from the INSTRUCTIONS Sheet"}]
[null,"Project Type:",{"$f":"IF(ISBLANK('INSTRUCTIONS - Project Info'!E29), \"Auto-Populated from the INSTRUCTIONS Sheet\", 'INSTRUCTIONS - Project Info'!E29)","v":"Auto-Populated from the INSTRUCTIONS Sheet"}]
[]
[null,null,"Year 1",{"$nulls":11},"Year 2",{"$nulls":11},"Year 3"]
[null,null,"Month 1","Month 2","Month 3","Month 4","Month 5","Month 6","Month 7","Month 8","Month 9","Month 10","Month 11","Month 12","Month 13","Month 14","Month 15","Month 16","Month 17","Month 18","Month 19","Month 20","Month 21","Month 22","Month 23","Month 24","Month 25","Month 26","Month 27","Month 28","Month 29","Month 30","Month 31","Month 32","Month 33","Month 34","Month 35","Month 36"]
[null,"Subscribers (Last-Mile Projects Only)"]
[null,"Number of Residential Customers"]
[null,"Number of Business Customers"]
[null,"Total Subscribers",{"$f":"SUM(C11:C12)","v":0},{"$f":"SUM(D11:D12)","v":0},0,0,0,0,0,0,0,0,0,0,0,0,0,0,0,0,0,0,0,0,0,0,0,0,0,0,0,0,0,0,0,0,0,0]
[]
[null,"Revenue"]
[null,"Transport Retail Data"]
[null,"Transport Wholesale Data"]
[null,"Other Transport Revenue (please specifiy)"]
[null,"Residential Client Revenue"]
[null,"Business Client Revenue"]
[null,"CPE Installation"]
[null,"Other Revenue (please specify)"]
[null,"Gross Revenue",{"$f":"SUM(C16:C22)","v":0},{"$f":"SUM(D16:D22)","v":0},0,0,0,0,0,0,0,0,0,0,0,0,0,0,0,0,0,0,0,0,0,0,0,0,0,0,0,0,0,0,0,0,0,0]
[]
[null,"Expenses"]
[null,"Residential Customer Installation Cost"]
[null,"Business Customer Installation Cost"]
[null,"Repair & Maintenance"]
[null,"Wages & Salaries"]
[null,"Gateway"]
[null,"Utilities "]
[null,"Network renewal"]
[null,"Sales/Marketing"]
[null,"G & A Expenses"]
[null,"Professional Fees (Legal/Accounting)"]
[null,"Vehicle Expenses"]
[null,"Insurance"]
[null,"Travel"]
[null,"Other (please specify)"]
[null,"Other (please specify)"]
[null,"Other (please specify)"]
[null,"Other (please specify)"]
[null,"Total Expenses",{"$f":"SUM(C26:C42)","v":0},{"$f":"SUM(D26:D42)","v":0},0,0,0,0,0,0,0,0,0,0,0,0,0,0,0,0,0,0,0,0,0,0,0,0,0,0,0,0,0,0,0,0,0,0]
[]
[null,"Net Income",{"$f":"+C23-C43","v":0},{"$f":"+D23-D43","v":0},0,0,0,0,0,0,0,0,0,0,0,0,0,0,0,0,0,0,0,0,0,0,0,0,0,0,0,0,0,0,0,0,0,0]
[]
[]
[null,"Connecting British Columbia Contribution"]
[null,"Other Funding"]
[null,"Payment on Financing (-)"]
[null,"Net Cash Flow from Financing Acitivities",{"$f":"SUM(C48,C49,IF(C50>0,C50*(-1),C50))","v":0},{"$f":"SUM(D48,D49,IF(D50>0,D50*(-1),D50))","v":0},0,0,0,0,0,0,0,0,0,0,0,0,0,0,0,0,0,0,0,0,0,0,0,0,0,0,0,0,0,0,0,0,0,0]
[]
[null,"Cash Flow  - Beginning of period",{"$f":"0","v":0},{"$f":"C55","v":""},{"$f":"D55","v":""},"","","","","","","","","","","","","","","","","","","","","","","","","","","","","","","","",""]
[null,"Increase (decrese) in cash",{"$f":"C45+C51","v":0},0,0,0,0,0,0,0,0,0,0,0,0,0,0,0,0,0,0,0,0,0,0,0,0,0,0,0,0,0,0,0,0,0,0,0]
[null,"Cash End of Period",{"$f":"IF(OR(COUNT(C26:C42)>0, COUNT(C16:C22)>0, COUNT(C48:C50)>0), SUM(C53:C54), \"\")","v":""},{"$f":"IF(OR(COUNT(D26:D42)>0, COUNT(#REF!)>0, COUNT(#REF!)>0, COUNT(#REF!)>0, COUNT(#REF!)>0, COUNT(D48:D50)>0), SUM(D53:D54), \"\")","v":""},{"$f":"IF(OR(COUNT(E26:E42)>0, COUNT(#REF!)>0, COUNT(#REF!)>0, COUNT(#REF!)>0, COUNT(#REF!)>0, COUNT(E48:E50)>0), SUM(E53:E54), \"\")","v":""},{"$f":"IF(OR(COUNT(F26:F42)>0, COUNT(#REF!)>0, COUNT(#REF!)>0, COUNT(#REF!)>0, COUNT(#REF!)>0, COUNT(F48:F50)>0), SUM(F53:F54), \"\")","v":""},{"$f":"IF(OR(COUNT(G26:G42)>0, COUNT(#REF!)>0, COUNT(#REF!)>0, COUNT(#REF!)>0, COUNT(#REF!)>0, COUNT(G48:G50)>0), SUM(G53:G54), \"\")","v":""},{"$f":"IF(OR(COUNT(H26:H42)>0, COUNT(#REF!)>0, COUNT(#REF!)>0, COUNT(#REF!)>0, COUNT(#REF!)>0, COUNT(H48:H50)>0), SUM(H53:H54), \"\")","v":""},{"$f":"IF(OR(COUNT(I26:I42)>0, COUNT(#REF!)>0, COUNT(#REF!)>0, COUNT(#REF!)>0, COUNT(#REF!)>0, COUNT(I48:I50)>0), SUM(I53:I54), \"\")","v":""},{"$f":"IF(OR(COUNT(J26:J42)>0, COUNT(#REF!)>0, COUNT(#REF!)>0, COUNT(#REF!)>0, COUNT(#REF!)>0, COUNT(J48:J50)>0), SUM(J53:J54), \"\")","v":""},{"$f":"IF(OR(COUNT(K26:K42)>0, COUNT(#REF!)>0, COUNT(#REF!)>0, COUNT(#REF!)>0, COUNT(#REF!)>0, COUNT(K48:K50)>0), SUM(K53:K54), \"\")","v":""},{"$f":"IF(OR(COUNT(L26:L42)>0, COUNT(#REF!)>0, COUNT(#REF!)>0, COUNT(#REF!)>0, COUNT(#REF!)>0, COUNT(L48:L50)>0), SUM(L53:L54), \"\")","v":""},{"$f":"IF(OR(COUNT(M26:M42)>0, COUNT(#REF!)>0, COUNT(#REF!)>0, COUNT(#REF!)>0, COUNT(#REF!)>0, COUNT(M48:M50)>0), SUM(M53:M54), \"\")","v":""},{"$f":"IF(OR(COUNT(N26:N42)>0, COUNT(#REF!)>0, COUNT(#REF!)>0, COUNT(#REF!)>0, COUNT(#REF!)>0, COUNT(N48:N50)>0), SUM(N53:N54), \"\")","v":""},{"$f":"IF(OR(COUNT(O26:O42)>0, COUNT(#REF!)>0, COUNT(#REF!)>0, COUNT(#REF!)>0, COUNT(#REF!)>0, COUNT(O48:O50)>0), SUM(O53:O54), \"\")","v":""},{"$f":"IF(OR(COUNT(P26:P42)>0, COUNT(#REF!)>0, COUNT(#REF!)>0, COUNT(#REF!)>0, COUNT(#REF!)>0, COUNT(P48:P50)>0), SUM(P53:P54), \"\")","v":""},{"$f":"IF(OR(COUNT(Q26:Q42)>0, COUNT(#REF!)>0, COUNT(#REF!)>0, COUNT(#REF!)>0, COUNT(#REF!)>0, COUNT(Q48:Q50)>0), SUM(Q53:Q54), \"\")","v":""},{"$f":"IF(OR(COUNT(R26:R42)>0, COUNT(#REF!)>0, COUNT(#REF!)>0, COUNT(#REF!)>0, COUNT(#REF!)>0, COUNT(R48:R50)>0), SUM(R53:R54), \"\")","v":""},{"$f":"IF(OR(COUNT(S26:S42)>0, COUNT(#REF!)>0, COUNT(#REF!)>0, COUNT(#REF!)>0, COUNT(#REF!)>0, COUNT(S48:S50)>0), SUM(S53:S54), \"\")","v":""},{"$f":"IF(OR(COUNT(T26:T42)>0, COUNT(#REF!)>0, COUNT(#REF!)>0, COUNT(#REF!)>0, COUNT(#REF!)>0, COUNT(T48:T50)>0), SUM(T53:T54), \"\")","v":""},{"$f":"IF(OR(COUNT(U26:U42)>0, COUNT(#REF!)>0, COUNT(#REF!)>0, COUNT(#REF!)>0, COUNT(#REF!)>0, COUNT(U48:U50)>0), SUM(U53:U54), \"\")","v":""},{"$f":"IF(OR(COUNT(V26:V42)>0, COUNT(#REF!)>0, COUNT(#REF!)>0, COUNT(#REF!)>0, COUNT(#REF!)>0, COUNT(V48:V50)>0), SUM(V53:V54), \"\")","v":""},{"$f":"IF(OR(COUNT(W26:W42)>0, COUNT(#REF!)>0, COUNT(#REF!)>0, COUNT(#REF!)>0, COUNT(#REF!)>0, COUNT(W48:W50)>0), SUM(W53:W54), \"\")","v":""},{"$f":"IF(OR(COUNT(X26:X42)>0, COUNT(#REF!)>0, COUNT(#REF!)>0, COUNT(#REF!)>0, COUNT(#REF!)>0, COUNT(X48:X50)>0), SUM(X53:X54), \"\")","v":""},{"$f":"IF(OR(COUNT(Y26:Y42)>0, COUNT(#REF!)>0, COUNT(#REF!)>0, COUNT(#REF!)>0, COUNT(#REF!)>0, COUNT(Y48:Y50)>0), SUM(Y53:Y54), \"\")","v":""},{"$f":"IF(OR(COUNT(Z26:Z42)>0, COUNT(#REF!)>0, COUNT(#REF!)>0, COUNT(#REF!)>0, COUNT(#REF!)>0, COUNT(Z48:Z50)>0), SUM(Z53:Z54), \"\")","v":""},{"$f":"IF(OR(COUNT(AA26:AA42)>0, COUNT(#REF!)>0, COUNT(#REF!)>0, COUNT(#REF!)>0, COUNT(#REF!)>0, COUNT(AA48:AA50)>0), SUM(AA53:AA54), \"\")","v":""},{"$f":"IF(OR(COUNT(AB26:AB42)>0, COUNT(#REF!)>0, COUNT(#REF!)>0, COUNT(#REF!)>0, COUNT(#REF!)>0, COUNT(AB48:AB50)>0), SUM(AB53:AB54), \"\")","v":""},{"$f":"IF(OR(COUNT(AC26:AC42)>0, COUNT(#REF!)>0, COUNT(#REF!)>0, COUNT(#REF!)>0, COUNT(#REF!)>0, COUNT(AC48:AC50)>0), SUM(AC53:AC54), \"\")","v":""},{"$f":"IF(OR(COUNT(AD26:AD42)>0, COUNT(#REF!)>0, COUNT(#REF!)>0, COUNT(#REF!)>0, COUNT(#REF!)>0, COUNT(AD48:AD50)>0), SUM(AD53:AD54), \"\")","v":""},{"$f":"IF(OR(COUNT(AE26:AE42)>0, COUNT(#REF!)>0, COUNT(#REF!)>0, COUNT(#REF!)>0, COUNT(#REF!)>0, COUNT(AE48:AE50)>0), SUM(AE53:AE54), \"\")","v":""},{"$f":"IF(OR(COUNT(AF26:AF42)>0, COUNT(#REF!)>0, COUNT(#REF!)>0, COUNT(#REF!)>0, COUNT(#REF!)>0, COUNT(AF48:AF50)>0), SUM(AF53:AF54), \"\")","v":""},{"$f":"IF(OR(COUNT(AG26:AG42)>0, COUNT(#REF!)>0, COUNT(#REF!)>0, COUNT(#REF!)>0, COUNT(#REF!)>0, COUNT(AG48:AG50)>0), SUM(AG53:AG54), \"\")","v":""},{"$f":"IF(OR(COUNT(AH26:AH42)>0, COUNT(#REF!)>0, COUNT(#REF!)>0, COUNT(#REF!)>0, COUNT(#REF!)>0, COUNT(AH48:AH50)>0), SUM(AH53:AH54), \"\")","v":""},{"$f":"IF(OR(COUNT(AI26:AI42)>0, COUNT(#REF!)>0, COUNT(#REF!)>0, COUNT(#REF!)>0, COUNT(#REF!)>0, COUNT(AI48:AI50)>0), SUM(AI53:AI54), \"\")","v":""},{"$f":"IF(OR(COUNT(AJ26:AJ42)>0, COUNT(#REF!)>0, COUNT(#REF!)>0, COUNT(#REF!)>0, COUNT(#REF!)>0, COUNT(AJ48:AJ50)>0), SUM(AJ53:AJ54), \"\")","v":""},{"$f":"IF(OR(COUNT(AK26:AK42)>0, COUNT(#REF!)>0, COUNT(#REF!)>0, COUNT(#REF!)>0, COUNT(#REF!)>0, COUNT(AK48:AK50)>0), SUM(AK53:AK54), \"\")","v":""},{"$f":"IF(OR(COUNT(AL26:AL42)>0, COUNT(#REF!)>0, COUNT(#REF!)>0, COUNT(#REF!)>0, COUNT(#REF!)>0, COUNT(AL48:AL50)>0), SUM(AL53:AL54), \"\")","v":""}]

{"sheet":"SUMMARY","index":5,"n_rows":22,"n_cols":17,"rows_kept":22,"merged":[[1,1,1,10],[2,1,2,10],[4,3,4,10],[6,3,6,7],[8,1,8,10],[10,1,10,2],[11,12,11,15],[12,12,12,15],[13,12,13,15],[15,1,15,10],[16,10,17,10],[17,1,17,2],[18,7,18,8],[19,7,19,8],[20,7,20,8],[21,7,21,8]]}
[]
[null,"Connecting British Columbia Program Phase 3"]
[null,"SUMMARY (Auto-Populated)"]
[]
[null,null,"Project Name:",{"$f":"IF(ISBLANK('INSTRUCTIONS - Project Info'!E27), \"Auto-Populated from the INSTRUCTIONS Sheet\", 'INSTRUCTIONS - Project Info'!E27)","v":"Auto-Populated from the INSTRUCTIONS Sheet"}]
[]
[null,null,"Project Type:",{"$f":"IF(ISBLANK('INSTRUCTIONS - Project Info'!E29), \"Auto-Populated from the INSTRUCTIONS Sheet\", 'INSTRUCTIONS - Project Info'!E29)","v":"Auto-Populated from the INSTRUCTIONS Sheet"}]
[]
[null,"PROJECT COMMUNITIES (Auto-Populated)",{"$nulls":10},"Eligible Costs"]
[]
[null,"Last-Mile ",{"$nulls":4},"Transport"]
[{"$nulls":3},"Total Number of Communities",{"$f":"Communities!N13","v":""},null,null,"Total Number of Communities",{"$f":"Communities!N18","v":""},{"$nulls":3},"Last Mile Eligible Costs per Community",{"$nulls":3},{"$f":"D20/E12","v":{"$error":"#VALUE!"}}]
[{"$nulls":3},"First Nations Communities",{"$f":"Communities!N14","v":""},null,null,"First Nations Communities",{"$f":"Communities!N19","v":""},{"$nulls":3},"Last Mile Eligible Costs per Household",{"$nulls":3},{"$f":"D20/E14","v":{"$error":"#VALUE!"}}]
[{"$nulls":3},"Total Number of Households",{"$f":"Communities!N15","v":""},null,null,"Total Number of PoPs",{"$f":"Communities!N20","v":""},{"$nulls":3},"Eligible Transport Costs per km",{"$nulls":3},{"$f":"D20/'Detailed Budget'!D64","v":{"$error":"#DIV/0!"}}]
[]
[null,"PROJECT BUDGET (Auto-Populated)"]
[{"$nulls":10},"% of\nEligible Costs:"]
[null,"Project Budget",{"$nulls":4},"Project Funding"]
[{"$nulls":3},"Last-Mile","Transport","Total",null,"Connecting British Columbia Amount Requested",null,{"$f":"'Detailed Budget'!H18","v":0},{"$f":"J19/F20","v":{"$error":"#DIV/0!"}}]
[null,null,"Eligible Costs",{"$f":"'Detailed Budget'!F14","v":0},{"$f":"'Detailed Budget'!G14","v":0},{"$f":"'Detailed Budget'!H14","v":0},null,"Applicant Contribution",null,{"$f":"'Detailed Budget'!H19","v":0}]
[null,null,"Ineligible Costs",{"$f":"'Detailed Budget'!F15","v":0},{"$f":"'Detailed Budget'!G15","v":0},{"$f":"'Detailed Budget'!H15","v":0},null,"Other Funding Sources",null,{"$f":"'Detailed Budget'!H20","v":0}]
[null,null,"Total Costs",{"$f":"'Detailed Budget'!F16","v":0},{"$f":"'Detailed Budget'!G16","v":0},{"$f":"'Detailed Budget'!H16","v":0},null,"Total Funding",null,{"$f":"'Detailed Budget'!H21","v":0}]